You are viewing a plain text version of this content. The canonical link for it is here.
Posted to dev@kafka.apache.org by Apache Jenkins Server <je...@builds.apache.org> on 2015/10/10 02:26:26 UTC
Build failed in Jenkins: kafka-trunk-jdk8 #13
See <https://builds.apache.org/job/kafka-trunk-jdk8/13/changes>
Changes:
[wangguoz] MINOR: putting back kstream stateful transform methods
------------------------------------------
[...truncated 3238 lines...]
kafka.api.SSLConsumerTest > testSimpleConsumption PASSED
kafka.integration.PrimitiveApiTest > testFetchRequestCanProperlySerialize PASSED
kafka.integration.SslTopicMetadataTest > testIsrAfterBrokerShutDownAndJoinsBack PASSED
kafka.integration.PrimitiveApiTest > testPipelinedProduceRequests PASSED
kafka.api.ConsumerTest > testAutoCommitOnClose PASSED
kafka.integration.SslTopicMetadataTest > testAutoCreateTopicWithCollision PASSED
kafka.integration.PrimitiveApiTest > testProduceAndMultiFetch PASSED
kafka.integration.SslTopicMetadataTest > testAliveBrokerListWithNoTopics PASSED
kafka.api.SSLConsumerTest > testAutoOffsetReset PASSED
kafka.integration.PrimitiveApiTest > testDefaultEncoderProducerAndFetchWithCompression PASSED
kafka.integration.SslTopicMetadataTest > testAutoCreateTopic PASSED
kafka.api.ConsumerTest > testListTopics PASSED
kafka.integration.PrimitiveApiTest > testConsumerEmptyTopic PASSED
kafka.integration.SslTopicMetadataTest > testGetAllTopicMetadata PASSED
kafka.integration.PrimitiveApiTest > testEmptyFetchRequest PASSED
kafka.utils.ByteBoundedBlockingQueueTest > testByteBoundedBlockingQueue PASSED
kafka.coordinator.PartitionAssignorTest > testRoundRobinAssignorOneConsumerNonexistentTopic PASSED
kafka.coordinator.PartitionAssignorTest > testRangeAssignorOnlyAssignsPartitionsFromSubscribedTopics PASSED
kafka.coordinator.PartitionAssignorTest > testRangeAssignorOneConsumerNoTopic PASSED
kafka.coordinator.PartitionAssignorTest > testRangeAssignorOneConsumerMultipleTopics PASSED
kafka.coordinator.PartitionAssignorTest > testRoundRobinAssignorOnlyAssignsPartitionsFromSubscribedTopics PASSED
kafka.coordinator.PartitionAssignorTest > testRoundRobinAssignorTwoConsumersOneTopicOnePartition PASSED
kafka.coordinator.PartitionAssignorTest > testRangeAssignorTwoConsumersOneTopicTwoPartitions PASSED
kafka.coordinator.PartitionAssignorTest > testRoundRobinAssignorTwoConsumersOneTopicTwoPartitions PASSED
kafka.coordinator.PartitionAssignorTest > testRoundRobinAssignorMultipleConsumersMixedTopics PASSED
kafka.coordinator.PartitionAssignorTest > testRangeAssignorTwoConsumersOneTopicOnePartition PASSED
kafka.coordinator.PartitionAssignorTest > testRangeAssignorMultipleConsumersMixedTopics PASSED
kafka.coordinator.PartitionAssignorTest > testRoundRobinAssignorOneConsumerNoTopic PASSED
kafka.coordinator.PartitionAssignorTest > testRoundRobinAssignorOneConsumerOneTopic PASSED
kafka.coordinator.PartitionAssignorTest > testRangeAssignorOneConsumerOneTopic PASSED
kafka.coordinator.PartitionAssignorTest > testRangeAssignorOneConsumerNonexistentTopic PASSED
kafka.coordinator.PartitionAssignorTest > testRoundRobinAssignorOneConsumerMultipleTopics PASSED
kafka.coordinator.PartitionAssignorTest > testRoundRobinAssignorTwoConsumersTwoTopicsSixPartitions PASSED
kafka.coordinator.PartitionAssignorTest > testRangeAssignorTwoConsumersTwoTopicsSixPartitions PASSED
kafka.api.ConsumerTest > testExpandingTopicSubscriptions PASSED
kafka.integration.SslTopicMetadataTest > testAliveBrokersListWithNoTopicsAfterNewBrokerStartup PASSED
kafka.integration.SslTopicMetadataTest > testBasicTopicMetadata PASSED
kafka.integration.PlaintextTopicMetadataTest > testIsrAfterBrokerShutDownAndJoinsBack PASSED
kafka.integration.SslTopicMetadataTest > testTopicMetadataRequest PASSED
kafka.integration.PlaintextTopicMetadataTest > testAutoCreateTopicWithCollision PASSED
kafka.integration.PlaintextTopicMetadataTest > testAliveBrokerListWithNoTopics PASSED
kafka.api.ConsumerTest > testPatternUnsubscription PASSED
kafka.integration.PlaintextTopicMetadataTest > testAutoCreateTopic PASSED
kafka.integration.SslTopicMetadataTest > testAliveBrokersListWithNoTopicsAfterABrokerShutdown PASSED
kafka.utils.timer.TimerTest > testAlreadyExpiredTask PASSED
kafka.integration.PlaintextTopicMetadataTest > testGetAllTopicMetadata PASSED
kafka.utils.timer.TimerTest > testTaskExpiration PASSED
kafka.javaapi.message.ByteBufferMessageSetTest > testSizeInBytesWithCompression PASSED
kafka.javaapi.message.ByteBufferMessageSetTest > testIteratorIsConsistentWithCompression PASSED
kafka.javaapi.message.ByteBufferMessageSetTest > testIteratorIsConsistent PASSED
kafka.javaapi.message.ByteBufferMessageSetTest > testEqualsWithCompression PASSED
kafka.javaapi.message.ByteBufferMessageSetTest > testWrittenEqualsRead PASSED
kafka.javaapi.message.ByteBufferMessageSetTest > testEquals PASSED
kafka.javaapi.message.ByteBufferMessageSetTest > testSizeInBytes PASSED
kafka.api.ConsumerTest > testGroupConsumption PASSED
kafka.integration.PlaintextTopicMetadataTest > testAliveBrokersListWithNoTopicsAfterNewBrokerStartup PASSED
kafka.api.ConsumerTest > testPartitionsFor PASSED
kafka.integration.PlaintextTopicMetadataTest > testBasicTopicMetadata PASSED
kafka.integration.PlaintextTopicMetadataTest > testTopicMetadataRequest PASSED
kafka.api.ConsumerTest > testAutoCommitOnRebalance PASSED
kafka.integration.PlaintextTopicMetadataTest > testAliveBrokersListWithNoTopicsAfterABrokerShutdown PASSED
kafka.utils.timer.TimerTaskListTest > testAll PASSED
kafka.coordinator.CoordinatorMetadataTest > testBindGroupToTopicsAlreadyListenedOn PASSED
kafka.coordinator.CoordinatorMetadataTest > testGetGroup PASSED
kafka.coordinator.CoordinatorMetadataTest > testBindNonexistentGroupToTopics PASSED
kafka.coordinator.CoordinatorMetadataTest > testBindGroupToTopicsNotListenedOn PASSED
kafka.coordinator.CoordinatorMetadataTest > testUnbindNonexistentGroupFromTopics PASSED
kafka.coordinator.CoordinatorMetadataTest > testAddGroupReturnsPreexistingGroupIfItAlreadyExists PASSED
kafka.coordinator.CoordinatorMetadataTest > testUnbindGroupFromTopicsListenedOnByNoOtherGroup PASSED
kafka.coordinator.CoordinatorMetadataTest > testRemoveNonexistentGroup PASSED
kafka.coordinator.CoordinatorMetadataTest > testUnbindGroupFromTopicsNotListenedOn PASSED
kafka.coordinator.CoordinatorMetadataTest > testUnbindGroupFromTopicsListenedOnByOtherGroups PASSED
kafka.coordinator.CoordinatorMetadataTest > testRemoveGroupWithNoOtherGroupsBoundToItsTopics PASSED
kafka.coordinator.CoordinatorMetadataTest > testRemoveGroupWithOtherGroupsBoundToItsTopics PASSED
kafka.coordinator.CoordinatorMetadataTest > testGetNonexistentGroup PASSED
kafka.api.ConsumerTest > testSimpleConsumption PASSED
kafka.api.ConsumerTest > testPartitionPauseAndResume PASSED
kafka.api.ConsumerTest > testPartitionReassignmentCallback PASSED
kafka.api.ConsumerTest > testAutoOffsetReset PASSED
kafka.api.ConsumerTest > testCommitSpecifiedOffsets PASSED
kafka.api.ConsumerTest > testCommitMetadata PASSED
kafka.api.ConsumerTest > testPatternSubscription PASSED
kafka.security.auth.SimpleAclAuthorizerTest > testAllowAllAccess PASSED
kafka.security.auth.SimpleAclAuthorizerTest > testNoAclFound PASSED
kafka.security.auth.SimpleAclAuthorizerTest > testAclManagementAPIs PASSED
kafka.security.auth.SimpleAclAuthorizerTest > testWildCardAcls PASSED
kafka.security.auth.SimpleAclAuthorizerTest > testTopicAcl PASSED
kafka.security.auth.SimpleAclAuthorizerTest > testSuperUserHasAccess PASSED
kafka.security.auth.SimpleAclAuthorizerTest > testDenyTakesPrecedence PASSED
kafka.security.auth.SimpleAclAuthorizerTest > testNoAclFoundOverride PASSED
kafka.security.auth.SimpleAclAuthorizerTest > testLoadCache PASSED
kafka.utils.ReplicationUtilsTest > testUpdateLeaderAndIsr PASSED
kafka.utils.ReplicationUtilsTest > testGetLeaderIsrAndEpochForPartition PASSED
kafka.coordinator.ConsumerGroupMetadataTest > testDeadToRebalancingIllegalTransition PASSED
kafka.coordinator.ConsumerGroupMetadataTest > testPreparingRebalanceToRebalancingTransition PASSED
kafka.coordinator.ConsumerGroupMetadataTest > testRebalancingToDeadIllegalTransition PASSED
kafka.coordinator.ConsumerGroupMetadataTest > testPreparingRebalanceToStableIllegalTransition PASSED
kafka.coordinator.ConsumerGroupMetadataTest > testRebalancingToPreparingRebalanceTransition PASSED
kafka.coordinator.ConsumerGroupMetadataTest > testCannotRebalanceWhenDead PASSED
kafka.coordinator.ConsumerGroupMetadataTest > testStableToDeadIllegalTransition PASSED
kafka.coordinator.ConsumerGroupMetadataTest > testCannotRebalanceWhenPreparingRebalance PASSED
kafka.coordinator.ConsumerGroupMetadataTest > testDeadToPreparingRebalanceIllegalTransition PASSED
kafka.coordinator.ConsumerGroupMetadataTest > testStableToRebalancingIllegalTransition PASSED
kafka.coordinator.ConsumerGroupMetadataTest > testDeadToDeadIllegalTransition PASSED
kafka.coordinator.ConsumerGroupMetadataTest > testStableToPreparingRebalanceTransition PASSED
kafka.coordinator.ConsumerGroupMetadataTest > testCannotRebalanceWhenRebalancing PASSED
kafka.coordinator.ConsumerGroupMetadataTest > testPreparingRebalanceToDeadTransition PASSED
kafka.coordinator.ConsumerGroupMetadataTest > testStableToStableIllegalTransition PASSED
kafka.coordinator.ConsumerGroupMetadataTest > testRebalancingToStableTransition PASSED
kafka.coordinator.ConsumerGroupMetadataTest > testDeadToStableIllegalTransition PASSED
kafka.coordinator.ConsumerGroupMetadataTest > testCanRebalanceWhenStable PASSED
kafka.coordinator.ConsumerGroupMetadataTest > testRebalancingToRebalancingIllegalTransition PASSED
kafka.coordinator.ConsumerGroupMetadataTest > testPreparingRebalanceToPreparingRebalanceIllegalTransition PASSED
548 tests completed, 1 failed
:kafka-trunk-jdk8:core:test FAILED
:test_core_2_11_7 FAILED
FAILURE: Build failed with an exception.
* What went wrong:
Execution failed for task ':core:test'.
> There were failing tests. See the report at: file://<https://builds.apache.org/job/kafka-trunk-jdk8/ws/core/build/reports/tests/index.html>
* Try:
Run with --stacktrace option to get the stack trace. Run with --info or --debug option to get more log output.
BUILD FAILED
Total time: 13 mins 59.855 secs
Build step 'Execute shell' marked build as failure
Recording test results
Setting GRADLE_2_1_HOME=/home/jenkins/jenkins-slave/tools/hudson.plugins.gradle.GradleInstallation/Gradle_2.1
Setting JDK1_8_0_45_HOME=/home/jenkins/jenkins-slave/tools/hudson.model.JDK/jdk1.8.0_45
Setting GRADLE_2_1_HOME=/home/jenkins/jenkins-slave/tools/hudson.plugins.gradle.GradleInstallation/Gradle_2.1
Setting JDK1_8_0_45_HOME=/home/jenkins/jenkins-slave/tools/hudson.model.JDK/jdk1.8.0_45
Re: Jenkins build is back to normal : kafka-trunk-jdk8 #17
Posted by Ismael Juma <is...@gmail.com>.
Our first successful Jenkins JDK 8 build. :)
Ismael
On 12 Oct 2015 21:40, "Apache Jenkins Server" <je...@builds.apache.org>
wrote:
> See <https://builds.apache.org/job/kafka-trunk-jdk8/17/changes>
>
>
Jenkins build is back to normal : kafka-trunk-jdk8 #17
Posted by Apache Jenkins Server <je...@builds.apache.org>.
See <https://builds.apache.org/job/kafka-trunk-jdk8/17/changes>
Build failed in Jenkins: kafka-trunk-jdk8 #16
Posted by Apache Jenkins Server <je...@builds.apache.org>.
See <https://builds.apache.org/job/kafka-trunk-jdk8/16/changes>
Changes:
[cshapi] KAFKA-2633; Default logging from tools to Stderr
------------------------------------------
[...truncated 859 lines...]
<https://builds.apache.org/job/kafka-trunk-jdk8/ws/clients/src/main/java/org/apache/kafka/clients/producer/MockProducer.java>:81: warning: no @param for valueSerializer
public MockProducer(boolean autoComplete, Serializer<K> keySerializer, Serializer<V> valueSerializer) {
^
<https://builds.apache.org/job/kafka-trunk-jdk8/ws/clients/src/main/java/org/apache/kafka/clients/producer/Partitioner.java>:39: warning: no @return
public int partition(String topic, Object key, byte[] keyBytes, Object value, byte[] valueBytes, Cluster cluster);
^
<https://builds.apache.org/job/kafka-trunk-jdk8/ws/clients/src/main/java/org/apache/kafka/clients/producer/ProducerRecord.java>:71: warning: no @return
public String topic() {
^
<https://builds.apache.org/job/kafka-trunk-jdk8/ws/clients/src/main/java/org/apache/kafka/clients/producer/ProducerRecord.java>:78: warning: no @return
public K key() {
^
<https://builds.apache.org/job/kafka-trunk-jdk8/ws/clients/src/main/java/org/apache/kafka/clients/producer/ProducerRecord.java>:92: warning: no @return
public Integer partition() {
^
<https://builds.apache.org/job/kafka-trunk-jdk8/ws/clients/src/main/java/org/apache/kafka/clients/producer/RecordMetadata.java>:44: warning: no @return
public long offset() {
^
<https://builds.apache.org/job/kafka-trunk-jdk8/ws/clients/src/main/java/org/apache/kafka/clients/producer/RecordMetadata.java>:51: warning: no @return
public String topic() {
^
<https://builds.apache.org/job/kafka-trunk-jdk8/ws/clients/src/main/java/org/apache/kafka/clients/producer/RecordMetadata.java>:58: warning: no @return
public int partition() {
^
76 warnings
:kafka-trunk-jdk8:log4j-appender:compileJavawarning: [options] bootstrap class path not set in conjunction with -source 1.7
1 warning
:kafka-trunk-jdk8:log4j-appender:processResources UP-TO-DATE
:kafka-trunk-jdk8:log4j-appender:classes
:kafka-trunk-jdk8:log4j-appender:jar
:kafka-trunk-jdk8:core:compileJava UP-TO-DATE
:kafka-trunk-jdk8:core:compileScalaJava HotSpot(TM) 64-Bit Server VM warning: ignoring option MaxPermSize=512m; support was removed in 8.0
<https://builds.apache.org/job/kafka-trunk-jdk8/ws/core/src/main/scala/kafka/api/OffsetCommitRequest.scala>:78: value DEFAULT_TIMESTAMP in object OffsetCommitRequest is deprecated: see corresponding Javadoc for more information.
org.apache.kafka.common.requests.OffsetCommitRequest.DEFAULT_TIMESTAMP
^
<https://builds.apache.org/job/kafka-trunk-jdk8/ws/core/src/main/scala/kafka/common/OffsetMetadataAndError.scala>:36: value DEFAULT_TIMESTAMP in object OffsetCommitRequest is deprecated: see corresponding Javadoc for more information.
commitTimestamp: Long = org.apache.kafka.common.requests.OffsetCommitRequest.DEFAULT_TIMESTAMP,
^
<https://builds.apache.org/job/kafka-trunk-jdk8/ws/core/src/main/scala/kafka/common/OffsetMetadataAndError.scala>:37: value DEFAULT_TIMESTAMP in object OffsetCommitRequest is deprecated: see corresponding Javadoc for more information.
expireTimestamp: Long = org.apache.kafka.common.requests.OffsetCommitRequest.DEFAULT_TIMESTAMP) {
^
<https://builds.apache.org/job/kafka-trunk-jdk8/ws/core/src/main/scala/kafka/server/KafkaApis.scala>:259: value DEFAULT_TIMESTAMP in object OffsetCommitRequest is deprecated: see corresponding Javadoc for more information.
if (offsetAndMetadata.commitTimestamp == org.apache.kafka.common.requests.OffsetCommitRequest.DEFAULT_TIMESTAMP)
^
<https://builds.apache.org/job/kafka-trunk-jdk8/ws/core/src/main/scala/kafka/server/KafkaServer.scala>:277: a pure expression does nothing in statement position; you may be omitting necessary parentheses
ControllerStats.uncleanLeaderElectionRate
^
<https://builds.apache.org/job/kafka-trunk-jdk8/ws/core/src/main/scala/kafka/server/KafkaServer.scala>:278: a pure expression does nothing in statement position; you may be omitting necessary parentheses
ControllerStats.leaderElectionTimer
^
<https://builds.apache.org/job/kafka-trunk-jdk8/ws/core/src/main/scala/kafka/server/OffsetManager.scala>:380: value DEFAULT_TIMESTAMP in object OffsetCommitRequest is deprecated: see corresponding Javadoc for more information.
if (value.expireTimestamp == org.apache.kafka.common.requests.OffsetCommitRequest.DEFAULT_TIMESTAMP)
^
<https://builds.apache.org/job/kafka-trunk-jdk8/ws/core/src/main/scala/kafka/tools/ConsoleProducer.scala>:115: value METADATA_FETCH_TIMEOUT_CONFIG in object ProducerConfig is deprecated: see corresponding Javadoc for more information.
props.put(ProducerConfig.METADATA_FETCH_TIMEOUT_CONFIG, config.metadataFetchTimeoutMs.toString)
^
<https://builds.apache.org/job/kafka-trunk-jdk8/ws/core/src/main/scala/kafka/tools/ConsoleProducer.scala>:117: value TIMEOUT_CONFIG in object ProducerConfig is deprecated: see corresponding Javadoc for more information.
props.put(ProducerConfig.TIMEOUT_CONFIG, config.requestTimeoutMs.toString)
^
<https://builds.apache.org/job/kafka-trunk-jdk8/ws/core/src/main/scala/kafka/tools/ConsoleProducer.scala>:121: value BLOCK_ON_BUFFER_FULL_CONFIG in object ProducerConfig is deprecated: see corresponding Javadoc for more information.
props.put(ProducerConfig.BLOCK_ON_BUFFER_FULL_CONFIG, "false")
^
<https://builds.apache.org/job/kafka-trunk-jdk8/ws/core/src/main/scala/kafka/tools/EndToEndLatency.scala>:75: value BLOCK_ON_BUFFER_FULL_CONFIG in object ProducerConfig is deprecated: see corresponding Javadoc for more information.
producerProps.put(ProducerConfig.BLOCK_ON_BUFFER_FULL_CONFIG, "true")
^
<https://builds.apache.org/job/kafka-trunk-jdk8/ws/core/src/main/scala/kafka/tools/MirrorMaker.scala>:185: value BLOCK_ON_BUFFER_FULL_CONFIG in object ProducerConfig is deprecated: see corresponding Javadoc for more information.
maybeSetDefaultProperty(producerProps, ProducerConfig.BLOCK_ON_BUFFER_FULL_CONFIG, "true")
^
<https://builds.apache.org/job/kafka-trunk-jdk8/ws/core/src/main/scala/kafka/admin/AclCommand.scala>:234: method readLine in class DeprecatedConsole is deprecated: Use the method in scala.io.StdIn
Console.readLine().equalsIgnoreCase("y")
^
<https://builds.apache.org/job/kafka-trunk-jdk8/ws/core/src/main/scala/kafka/controller/ControllerChannelManager.scala>:389: class BrokerEndPoint in object UpdateMetadataRequest is deprecated: see corresponding Javadoc for more information.
new UpdateMetadataRequest.BrokerEndPoint(brokerEndPoint.id, brokerEndPoint.host, brokerEndPoint.port)
^
<https://builds.apache.org/job/kafka-trunk-jdk8/ws/core/src/main/scala/kafka/controller/ControllerChannelManager.scala>:391: constructor UpdateMetadataRequest in class UpdateMetadataRequest is deprecated: see corresponding Javadoc for more information.
new UpdateMetadataRequest(controllerId, controllerEpoch, liveBrokers.asJava, partitionStates.asJava)
^
<https://builds.apache.org/job/kafka-trunk-jdk8/ws/core/src/main/scala/kafka/network/BlockingChannel.scala>:129: method readFromReadableChannel in class NetworkReceive is deprecated: see corresponding Javadoc for more information.
response.readFromReadableChannel(channel)
^
there were 14 feature warnings; re-run with -feature for details
17 warnings found
warning: [options] bootstrap class path not set in conjunction with -source 1.7
1 warning
:kafka-trunk-jdk8:core:processResources UP-TO-DATE
:kafka-trunk-jdk8:core:classes
:kafka-trunk-jdk8:log4j-appender:javadoc
:kafka-trunk-jdk8:core:javadoc<https://builds.apache.org/job/kafka-trunk-jdk8/ws/core/src/main/scala/kafka/javaapi/consumer/ConsumerConnector.java>:42: warning: no @param for <K>
createMessageStreams(Map<String, Integer> topicCountMap, Decoder<K> keyDecoder, Decoder<V> valueDecoder);
^
<https://builds.apache.org/job/kafka-trunk-jdk8/ws/core/src/main/scala/kafka/javaapi/consumer/ConsumerConnector.java>:42: warning: no @param for <V>
createMessageStreams(Map<String, Integer> topicCountMap, Decoder<K> keyDecoder, Decoder<V> valueDecoder);
^
<https://builds.apache.org/job/kafka-trunk-jdk8/ws/core/src/main/scala/kafka/javaapi/consumer/ConsumerConnector.java>:58: warning: no @param for <K>
createMessageStreamsByFilter(TopicFilter topicFilter, int numStreams, Decoder<K> keyDecoder, Decoder<V> valueDecoder);
^
<https://builds.apache.org/job/kafka-trunk-jdk8/ws/core/src/main/scala/kafka/javaapi/consumer/ConsumerConnector.java>:58: warning: no @param for <V>
createMessageStreamsByFilter(TopicFilter topicFilter, int numStreams, Decoder<K> keyDecoder, Decoder<V> valueDecoder);
^
4 warnings
:kafka-trunk-jdk8:core:javadocJar
:kafka-trunk-jdk8:core:scaladoc
[ant:scaladoc] Element '<https://builds.apache.org/job/kafka-trunk-jdk8/ws/core/build/resources/main'> does not exist.
[ant:scaladoc] <https://builds.apache.org/job/kafka-trunk-jdk8/ws/core/src/main/scala/kafka/server/KafkaServer.scala>:277: warning: a pure expression does nothing in statement position; you may be omitting necessary parentheses
[ant:scaladoc] ControllerStats.uncleanLeaderElectionRate
[ant:scaladoc] ^
[ant:scaladoc] <https://builds.apache.org/job/kafka-trunk-jdk8/ws/core/src/main/scala/kafka/server/KafkaServer.scala>:278: warning: a pure expression does nothing in statement position; you may be omitting necessary parentheses
[ant:scaladoc] ControllerStats.leaderElectionTimer
[ant:scaladoc] ^
[ant:scaladoc] warning: there were 14 feature warnings; re-run with -feature for details
[ant:scaladoc] <https://builds.apache.org/job/kafka-trunk-jdk8/ws/core/src/main/scala/kafka/log/OffsetIndex.scala>:349: warning: Could not find any member to link for "IllegalArgumentException".
[ant:scaladoc] /**
[ant:scaladoc] ^
[ant:scaladoc] <https://builds.apache.org/job/kafka-trunk-jdk8/ws/core/src/main/scala/kafka/log/LogSegment.scala>:274: warning: Could not find any member to link for "KafkaStorageException".
[ant:scaladoc] /**
[ant:scaladoc] ^
[ant:scaladoc] <https://builds.apache.org/job/kafka-trunk-jdk8/ws/core/src/main/scala/kafka/log/Log.scala>:460: warning: Could not find any member to link for "OffsetOutOfRangeException".
[ant:scaladoc] /**
[ant:scaladoc] ^
[ant:scaladoc] <https://builds.apache.org/job/kafka-trunk-jdk8/ws/core/src/main/scala/kafka/log/Log.scala>:295: warning: Could not find any member to link for "KafkaStorageException".
[ant:scaladoc] /**
[ant:scaladoc] ^
[ant:scaladoc] <https://builds.apache.org/job/kafka-trunk-jdk8/ws/core/src/main/scala/kafka/utils/VerifiableProperties.scala>:125: warning: Could not find any member to link for "IllegalArgumentException".
[ant:scaladoc] /**
[ant:scaladoc] ^
[ant:scaladoc] <https://builds.apache.org/job/kafka-trunk-jdk8/ws/core/src/main/scala/kafka/utils/VerifiableProperties.scala>:106: warning: Could not find any member to link for "IllegalArgumentException".
[ant:scaladoc] /**
[ant:scaladoc] ^
[ant:scaladoc] <https://builds.apache.org/job/kafka-trunk-jdk8/ws/core/src/main/scala/kafka/utils/VerifiableProperties.scala>:63: warning: Could not find any member to link for "IllegalArgumentException".
[ant:scaladoc] /**
[ant:scaladoc] ^
[ant:scaladoc] <https://builds.apache.org/job/kafka-trunk-jdk8/ws/core/src/main/scala/kafka/utils/ByteBoundedBlockingQueue.scala>:97: warning: Could not find any member to link for "NullPointerException".
[ant:scaladoc] /**
[ant:scaladoc] ^
[ant:scaladoc] <https://builds.apache.org/job/kafka-trunk-jdk8/ws/core/src/main/scala/kafka/utils/ByteBoundedBlockingQueue.scala>:97: warning: Could not find any member to link for "InterruptedException".
[ant:scaladoc] /**
[ant:scaladoc] ^
[ant:scaladoc] <https://builds.apache.org/job/kafka-trunk-jdk8/ws/core/src/main/scala/kafka/utils/ByteBoundedBlockingQueue.scala>:72: warning: Could not find any member to link for "NullPointerException".
[ant:scaladoc] /**
[ant:scaladoc] ^
[ant:scaladoc] <https://builds.apache.org/job/kafka-trunk-jdk8/ws/core/src/main/scala/kafka/utils/ByteBoundedBlockingQueue.scala>:72: warning: Could not find any member to link for "InterruptedException".
[ant:scaladoc] /**
[ant:scaladoc] ^
[ant:scaladoc] <https://builds.apache.org/job/kafka-trunk-jdk8/ws/core/src/main/scala/kafka/utils/ByteBoundedBlockingQueue.scala>:32: warning: Could not find any member to link for "NullPointerException".
[ant:scaladoc] /**
[ant:scaladoc] ^
[ant:scaladoc] <https://builds.apache.org/job/kafka-trunk-jdk8/ws/core/src/main/scala/kafka/utils/ByteBoundedBlockingQueue.scala>:32: warning: Could not find any member to link for "InterruptedException".
[ant:scaladoc] /**
[ant:scaladoc] ^
[ant:scaladoc] <https://builds.apache.org/job/kafka-trunk-jdk8/ws/core/src/main/scala/kafka/server/KafkaHealthcheck.scala>:76: warning: Could not find any member to link for "Exception".
[ant:scaladoc] /**
[ant:scaladoc] ^
[ant:scaladoc] <https://builds.apache.org/job/kafka-trunk-jdk8/ws/core/src/main/scala/kafka/server/ZookeeperLeaderElector.scala>:132: warning: Could not find any member to link for "Exception".
[ant:scaladoc] /**
[ant:scaladoc] ^
[ant:scaladoc] <https://builds.apache.org/job/kafka-trunk-jdk8/ws/core/src/main/scala/kafka/server/ZookeeperLeaderElector.scala>:116: warning: Could not find any member to link for "Exception".
[ant:scaladoc] /**
[ant:scaladoc] ^
[ant:scaladoc] <https://builds.apache.org/job/kafka-trunk-jdk8/ws/core/src/main/scala/kafka/controller/PartitionLeaderSelector.scala>:28: warning: Could not find any member to link for "NoReplicaOnlineException".
[ant:scaladoc] /**
[ant:scaladoc] ^
[ant:scaladoc] <https://builds.apache.org/job/kafka-trunk-jdk8/ws/core/src/main/scala/kafka/controller/KafkaController.scala>:1335: warning: Could not find any member to link for "Exception".
[ant:scaladoc] /**
[ant:scaladoc] ^
[ant:scaladoc] <https://builds.apache.org/job/kafka-trunk-jdk8/ws/core/src/main/scala/kafka/controller/KafkaController.scala>:1294: warning: Could not find any member to link for "Exception".
[ant:scaladoc] /**
[ant:scaladoc] ^
[ant:scaladoc] <https://builds.apache.org/job/kafka-trunk-jdk8/ws/core/src/main/scala/kafka/controller/KafkaController.scala>:1439: warning: Could not find any member to link for "Exception".
[ant:scaladoc] /**
[ant:scaladoc] ^
[ant:scaladoc] <https://builds.apache.org/job/kafka-trunk-jdk8/ws/core/src/main/scala/kafka/controller/KafkaController.scala>:1416: warning: Could not find any member to link for "Exception".
[ant:scaladoc] /**
[ant:scaladoc] ^
[ant:scaladoc] <https://builds.apache.org/job/kafka-trunk-jdk8/ws/core/src/main/scala/kafka/controller/KafkaController.scala>:1277: warning: Could not find any member to link for "Exception".
[ant:scaladoc] /**
[ant:scaladoc] ^
[ant:scaladoc] <https://builds.apache.org/job/kafka-trunk-jdk8/ws/core/src/main/scala/kafka/controller/KafkaController.scala>:1251: warning: Could not find any member to link for "Exception".
[ant:scaladoc] /**
[ant:scaladoc] ^
[ant:scaladoc] <https://builds.apache.org/job/kafka-trunk-jdk8/ws/core/src/main/scala/kafka/controller/PartitionStateMachine.scala>:489: warning: Could not find any member to link for "Exception".
[ant:scaladoc] /**
[ant:scaladoc] ^
[ant:scaladoc] <https://builds.apache.org/job/kafka-trunk-jdk8/ws/core/src/main/scala/kafka/controller/PartitionStateMachine.scala>:454: warning: Could not find any member to link for "Exception".
[ant:scaladoc] /**
[ant:scaladoc] ^
[ant:scaladoc] <https://builds.apache.org/job/kafka-trunk-jdk8/ws/core/src/main/scala/kafka/controller/KafkaController.scala>:1161: warning: Could not find any member to link for "Exception".
[ant:scaladoc] /**
[ant:scaladoc] ^
[ant:scaladoc] <https://builds.apache.org/job/kafka-trunk-jdk8/ws/core/src/main/scala/kafka/utils/ByteBoundedBlockingQueue.scala>:72: warning: Could not find any member to link for "java.util.concurrent.BlockingQueue#offer".
[ant:scaladoc] /**
[ant:scaladoc] ^
[ant:scaladoc] <https://builds.apache.org/job/kafka-trunk-jdk8/ws/core/src/main/scala/kafka/utils/ByteBoundedBlockingQueue.scala>:32: warning: Could not find any member to link for "java.util.concurrent.BlockingQueue#offer".
[ant:scaladoc] /**
[ant:scaladoc] ^
[ant:scaladoc] <https://builds.apache.org/job/kafka-trunk-jdk8/ws/core/src/main/scala/kafka/utils/ByteBoundedBlockingQueue.scala>:137: warning: Could not find any member to link for "java.util.concurrent.BlockingQueue#poll".
[ant:scaladoc] /**
[ant:scaladoc] ^
[ant:scaladoc] <https://builds.apache.org/job/kafka-trunk-jdk8/ws/core/src/main/scala/kafka/utils/ByteBoundedBlockingQueue.scala>:120: warning: Could not find any member to link for "java.util.concurrent.BlockingQueue#poll".
[ant:scaladoc] /**
[ant:scaladoc] ^
[ant:scaladoc] <https://builds.apache.org/job/kafka-trunk-jdk8/ws/core/src/main/scala/kafka/utils/ByteBoundedBlockingQueue.scala>:97: warning: Could not find any member to link for "java.util.concurrent.BlockingQueue#put".
[ant:scaladoc] /**
[ant:scaladoc] ^
[ant:scaladoc] <https://builds.apache.org/job/kafka-trunk-jdk8/ws/core/src/main/scala/kafka/utils/ByteBoundedBlockingQueue.scala>:152: warning: Could not find any member to link for "java.util.concurrent.BlockingQueue#take".
[ant:scaladoc] /**
[ant:scaladoc] ^
[ant:scaladoc] 35 warnings found
:kafka-trunk-jdk8:core:scaladocJar
:kafka-trunk-jdk8:core:docsJar
:clients:docsJar
:log4j-appender:javadoc UP-TO-DATE
:core:javadoc<https://builds.apache.org/job/kafka-trunk-jdk8/ws/core/src/main/scala/kafka/javaapi/consumer/ConsumerConnector.java>:42: warning: no @param for <K>
createMessageStreams(Map<String, Integer> topicCountMap, Decoder<K> keyDecoder, Decoder<V> valueDecoder);
^
<https://builds.apache.org/job/kafka-trunk-jdk8/ws/core/src/main/scala/kafka/javaapi/consumer/ConsumerConnector.java>:42: warning: no @param for <V>
createMessageStreams(Map<String, Integer> topicCountMap, Decoder<K> keyDecoder, Decoder<V> valueDecoder);
^
<https://builds.apache.org/job/kafka-trunk-jdk8/ws/core/src/main/scala/kafka/javaapi/consumer/ConsumerConnector.java>:58: warning: no @param for <K>
createMessageStreamsByFilter(TopicFilter topicFilter, int numStreams, Decoder<K> keyDecoder, Decoder<V> valueDecoder);
^
<https://builds.apache.org/job/kafka-trunk-jdk8/ws/core/src/main/scala/kafka/javaapi/consumer/ConsumerConnector.java>:58: warning: no @param for <V>
createMessageStreamsByFilter(TopicFilter topicFilter, int numStreams, Decoder<K> keyDecoder, Decoder<V> valueDecoder);
^
4 warnings
FAILURE: Build failed with an exception.
* What went wrong:
Could not add entry ':core:javadoc' to cache taskArtifacts.bin (<https://builds.apache.org/job/kafka-trunk-jdk8/ws/.gradle/2.4/taskArtifacts/taskArtifacts.bin).>
> Corrupted DataBlock 43906 found in cache '<https://builds.apache.org/job/kafka-trunk-jdk8/ws/.gradle/2.4/taskArtifacts/taskArtifacts.bin'.>
* Try:
Run with --stacktrace option to get the stack trace. Run with --info or --debug option to get more log output.
BUILD FAILED
Total time: 5 mins 17.18 secs
Build step 'Execute shell' marked build as failure
Recording test results
Setting GRADLE_2_1_HOME=/home/jenkins/jenkins-slave/tools/hudson.plugins.gradle.GradleInstallation/Gradle_2.1
Setting JDK1_8_0_45_HOME=/home/jenkins/jenkins-slave/tools/hudson.model.JDK/jdk1.8.0_45
ERROR: Publisher 'Publish JUnit test result report' failed: No test report files were found. Configuration error?
Setting GRADLE_2_1_HOME=/home/jenkins/jenkins-slave/tools/hudson.plugins.gradle.GradleInstallation/Gradle_2.1
Setting JDK1_8_0_45_HOME=/home/jenkins/jenkins-slave/tools/hudson.model.JDK/jdk1.8.0_45
Build failed in Jenkins: kafka-trunk-jdk8 #15
Posted by Apache Jenkins Server <je...@builds.apache.org>.
See <https://builds.apache.org/job/kafka-trunk-jdk8/15/changes>
Changes:
[junrao] MINOR: Use the correct processor id in the processor thread name
------------------------------------------
[...truncated 861 lines...]
public MockProducer(boolean autoComplete, Serializer<K> keySerializer, Serializer<V> valueSerializer) {
^
<https://builds.apache.org/job/kafka-trunk-jdk8/ws/clients/src/main/java/org/apache/kafka/clients/producer/Partitioner.java>:39: warning: no @return
public int partition(String topic, Object key, byte[] keyBytes, Object value, byte[] valueBytes, Cluster cluster);
^
<https://builds.apache.org/job/kafka-trunk-jdk8/ws/clients/src/main/java/org/apache/kafka/clients/producer/ProducerRecord.java>:71: warning: no @return
public String topic() {
^
<https://builds.apache.org/job/kafka-trunk-jdk8/ws/clients/src/main/java/org/apache/kafka/clients/producer/ProducerRecord.java>:78: warning: no @return
public K key() {
^
<https://builds.apache.org/job/kafka-trunk-jdk8/ws/clients/src/main/java/org/apache/kafka/clients/producer/ProducerRecord.java>:92: warning: no @return
public Integer partition() {
^
<https://builds.apache.org/job/kafka-trunk-jdk8/ws/clients/src/main/java/org/apache/kafka/clients/producer/RecordMetadata.java>:44: warning: no @return
public long offset() {
^
<https://builds.apache.org/job/kafka-trunk-jdk8/ws/clients/src/main/java/org/apache/kafka/clients/producer/RecordMetadata.java>:51: warning: no @return
public String topic() {
^
<https://builds.apache.org/job/kafka-trunk-jdk8/ws/clients/src/main/java/org/apache/kafka/clients/producer/RecordMetadata.java>:58: warning: no @return
public int partition() {
^
76 warnings
:kafka-trunk-jdk8:log4j-appender:compileJavawarning: [options] bootstrap class path not set in conjunction with -source 1.7
1 warning
:kafka-trunk-jdk8:log4j-appender:processResources UP-TO-DATE
:kafka-trunk-jdk8:log4j-appender:classes
:kafka-trunk-jdk8:log4j-appender:jar
:kafka-trunk-jdk8:core:compileJava UP-TO-DATE
:kafka-trunk-jdk8:core:compileScalaJava HotSpot(TM) 64-Bit Server VM warning: ignoring option MaxPermSize=512m; support was removed in 8.0
<https://builds.apache.org/job/kafka-trunk-jdk8/ws/core/src/main/scala/kafka/api/OffsetCommitRequest.scala>:78: value DEFAULT_TIMESTAMP in object OffsetCommitRequest is deprecated: see corresponding Javadoc for more information.
org.apache.kafka.common.requests.OffsetCommitRequest.DEFAULT_TIMESTAMP
^
<https://builds.apache.org/job/kafka-trunk-jdk8/ws/core/src/main/scala/kafka/common/OffsetMetadataAndError.scala>:36: value DEFAULT_TIMESTAMP in object OffsetCommitRequest is deprecated: see corresponding Javadoc for more information.
commitTimestamp: Long = org.apache.kafka.common.requests.OffsetCommitRequest.DEFAULT_TIMESTAMP,
^
<https://builds.apache.org/job/kafka-trunk-jdk8/ws/core/src/main/scala/kafka/common/OffsetMetadataAndError.scala>:37: value DEFAULT_TIMESTAMP in object OffsetCommitRequest is deprecated: see corresponding Javadoc for more information.
expireTimestamp: Long = org.apache.kafka.common.requests.OffsetCommitRequest.DEFAULT_TIMESTAMP) {
^
<https://builds.apache.org/job/kafka-trunk-jdk8/ws/core/src/main/scala/kafka/server/KafkaApis.scala>:259: value DEFAULT_TIMESTAMP in object OffsetCommitRequest is deprecated: see corresponding Javadoc for more information.
if (offsetAndMetadata.commitTimestamp == org.apache.kafka.common.requests.OffsetCommitRequest.DEFAULT_TIMESTAMP)
^
<https://builds.apache.org/job/kafka-trunk-jdk8/ws/core/src/main/scala/kafka/server/KafkaServer.scala>:277: a pure expression does nothing in statement position; you may be omitting necessary parentheses
ControllerStats.uncleanLeaderElectionRate
^
<https://builds.apache.org/job/kafka-trunk-jdk8/ws/core/src/main/scala/kafka/server/KafkaServer.scala>:278: a pure expression does nothing in statement position; you may be omitting necessary parentheses
ControllerStats.leaderElectionTimer
^
<https://builds.apache.org/job/kafka-trunk-jdk8/ws/core/src/main/scala/kafka/server/OffsetManager.scala>:380: value DEFAULT_TIMESTAMP in object OffsetCommitRequest is deprecated: see corresponding Javadoc for more information.
if (value.expireTimestamp == org.apache.kafka.common.requests.OffsetCommitRequest.DEFAULT_TIMESTAMP)
^
<https://builds.apache.org/job/kafka-trunk-jdk8/ws/core/src/main/scala/kafka/tools/ConsoleProducer.scala>:115: value METADATA_FETCH_TIMEOUT_CONFIG in object ProducerConfig is deprecated: see corresponding Javadoc for more information.
props.put(ProducerConfig.METADATA_FETCH_TIMEOUT_CONFIG, config.metadataFetchTimeoutMs.toString)
^
<https://builds.apache.org/job/kafka-trunk-jdk8/ws/core/src/main/scala/kafka/tools/ConsoleProducer.scala>:117: value TIMEOUT_CONFIG in object ProducerConfig is deprecated: see corresponding Javadoc for more information.
props.put(ProducerConfig.TIMEOUT_CONFIG, config.requestTimeoutMs.toString)
^
<https://builds.apache.org/job/kafka-trunk-jdk8/ws/core/src/main/scala/kafka/tools/ConsoleProducer.scala>:121: value BLOCK_ON_BUFFER_FULL_CONFIG in object ProducerConfig is deprecated: see corresponding Javadoc for more information.
props.put(ProducerConfig.BLOCK_ON_BUFFER_FULL_CONFIG, "false")
^
<https://builds.apache.org/job/kafka-trunk-jdk8/ws/core/src/main/scala/kafka/tools/EndToEndLatency.scala>:75: value BLOCK_ON_BUFFER_FULL_CONFIG in object ProducerConfig is deprecated: see corresponding Javadoc for more information.
producerProps.put(ProducerConfig.BLOCK_ON_BUFFER_FULL_CONFIG, "true")
^
<https://builds.apache.org/job/kafka-trunk-jdk8/ws/core/src/main/scala/kafka/tools/MirrorMaker.scala>:185: value BLOCK_ON_BUFFER_FULL_CONFIG in object ProducerConfig is deprecated: see corresponding Javadoc for more information.
maybeSetDefaultProperty(producerProps, ProducerConfig.BLOCK_ON_BUFFER_FULL_CONFIG, "true")
^
<https://builds.apache.org/job/kafka-trunk-jdk8/ws/core/src/main/scala/kafka/admin/AclCommand.scala>:234: method readLine in class DeprecatedConsole is deprecated: Use the method in scala.io.StdIn
Console.readLine().equalsIgnoreCase("y")
^
<https://builds.apache.org/job/kafka-trunk-jdk8/ws/core/src/main/scala/kafka/controller/ControllerChannelManager.scala>:389: class BrokerEndPoint in object UpdateMetadataRequest is deprecated: see corresponding Javadoc for more information.
new UpdateMetadataRequest.BrokerEndPoint(brokerEndPoint.id, brokerEndPoint.host, brokerEndPoint.port)
^
<https://builds.apache.org/job/kafka-trunk-jdk8/ws/core/src/main/scala/kafka/controller/ControllerChannelManager.scala>:391: constructor UpdateMetadataRequest in class UpdateMetadataRequest is deprecated: see corresponding Javadoc for more information.
new UpdateMetadataRequest(controllerId, controllerEpoch, liveBrokers.asJava, partitionStates.asJava)
^
<https://builds.apache.org/job/kafka-trunk-jdk8/ws/core/src/main/scala/kafka/network/BlockingChannel.scala>:129: method readFromReadableChannel in class NetworkReceive is deprecated: see corresponding Javadoc for more information.
response.readFromReadableChannel(channel)
^
there were 14 feature warnings; re-run with -feature for details
17 warnings found
warning: [options] bootstrap class path not set in conjunction with -source 1.7
1 warning
:kafka-trunk-jdk8:core:processResources UP-TO-DATE
:kafka-trunk-jdk8:core:classes
:kafka-trunk-jdk8:log4j-appender:javadoc
:kafka-trunk-jdk8:core:javadoc<https://builds.apache.org/job/kafka-trunk-jdk8/ws/core/src/main/scala/kafka/javaapi/consumer/ConsumerConnector.java>:42: warning: no @param for <K>
createMessageStreams(Map<String, Integer> topicCountMap, Decoder<K> keyDecoder, Decoder<V> valueDecoder);
^
<https://builds.apache.org/job/kafka-trunk-jdk8/ws/core/src/main/scala/kafka/javaapi/consumer/ConsumerConnector.java>:42: warning: no @param for <V>
createMessageStreams(Map<String, Integer> topicCountMap, Decoder<K> keyDecoder, Decoder<V> valueDecoder);
^
<https://builds.apache.org/job/kafka-trunk-jdk8/ws/core/src/main/scala/kafka/javaapi/consumer/ConsumerConnector.java>:58: warning: no @param for <K>
createMessageStreamsByFilter(TopicFilter topicFilter, int numStreams, Decoder<K> keyDecoder, Decoder<V> valueDecoder);
^
<https://builds.apache.org/job/kafka-trunk-jdk8/ws/core/src/main/scala/kafka/javaapi/consumer/ConsumerConnector.java>:58: warning: no @param for <V>
createMessageStreamsByFilter(TopicFilter topicFilter, int numStreams, Decoder<K> keyDecoder, Decoder<V> valueDecoder);
^
4 warnings
:kafka-trunk-jdk8:core:javadocJar
:kafka-trunk-jdk8:core:scaladoc
[ant:scaladoc] Element '<https://builds.apache.org/job/kafka-trunk-jdk8/ws/core/build/resources/main'> does not exist.
[ant:scaladoc] <https://builds.apache.org/job/kafka-trunk-jdk8/ws/core/src/main/scala/kafka/server/KafkaServer.scala>:277: warning: a pure expression does nothing in statement position; you may be omitting necessary parentheses
[ant:scaladoc] ControllerStats.uncleanLeaderElectionRate
[ant:scaladoc] ^
[ant:scaladoc] <https://builds.apache.org/job/kafka-trunk-jdk8/ws/core/src/main/scala/kafka/server/KafkaServer.scala>:278: warning: a pure expression does nothing in statement position; you may be omitting necessary parentheses
[ant:scaladoc] ControllerStats.leaderElectionTimer
[ant:scaladoc] ^
[ant:scaladoc] warning: there were 14 feature warnings; re-run with -feature for details
[ant:scaladoc] <https://builds.apache.org/job/kafka-trunk-jdk8/ws/core/src/main/scala/kafka/log/LogSegment.scala>:274: warning: Could not find any member to link for "KafkaStorageException".
[ant:scaladoc] /**
[ant:scaladoc] ^
[ant:scaladoc] <https://builds.apache.org/job/kafka-trunk-jdk8/ws/core/src/main/scala/kafka/log/OffsetIndex.scala>:349: warning: Could not find any member to link for "IllegalArgumentException".
[ant:scaladoc] /**
[ant:scaladoc] ^
[ant:scaladoc] <https://builds.apache.org/job/kafka-trunk-jdk8/ws/core/src/main/scala/kafka/log/Log.scala>:460: warning: Could not find any member to link for "OffsetOutOfRangeException".
[ant:scaladoc] /**
[ant:scaladoc] ^
[ant:scaladoc] <https://builds.apache.org/job/kafka-trunk-jdk8/ws/core/src/main/scala/kafka/log/Log.scala>:295: warning: Could not find any member to link for "KafkaStorageException".
[ant:scaladoc] /**
[ant:scaladoc] ^
[ant:scaladoc] <https://builds.apache.org/job/kafka-trunk-jdk8/ws/core/src/main/scala/kafka/server/KafkaHealthcheck.scala>:76: warning: Could not find any member to link for "Exception".
[ant:scaladoc] /**
[ant:scaladoc] ^
[ant:scaladoc] <https://builds.apache.org/job/kafka-trunk-jdk8/ws/core/src/main/scala/kafka/server/ZookeeperLeaderElector.scala>:132: warning: Could not find any member to link for "Exception".
[ant:scaladoc] /**
[ant:scaladoc] ^
[ant:scaladoc] <https://builds.apache.org/job/kafka-trunk-jdk8/ws/core/src/main/scala/kafka/server/ZookeeperLeaderElector.scala>:116: warning: Could not find any member to link for "Exception".
[ant:scaladoc] /**
[ant:scaladoc] ^
[ant:scaladoc] <https://builds.apache.org/job/kafka-trunk-jdk8/ws/core/src/main/scala/kafka/utils/VerifiableProperties.scala>:125: warning: Could not find any member to link for "IllegalArgumentException".
[ant:scaladoc] /**
[ant:scaladoc] ^
[ant:scaladoc] <https://builds.apache.org/job/kafka-trunk-jdk8/ws/core/src/main/scala/kafka/utils/VerifiableProperties.scala>:106: warning: Could not find any member to link for "IllegalArgumentException".
[ant:scaladoc] /**
[ant:scaladoc] ^
[ant:scaladoc] <https://builds.apache.org/job/kafka-trunk-jdk8/ws/core/src/main/scala/kafka/utils/VerifiableProperties.scala>:63: warning: Could not find any member to link for "IllegalArgumentException".
[ant:scaladoc] /**
[ant:scaladoc] ^
[ant:scaladoc] <https://builds.apache.org/job/kafka-trunk-jdk8/ws/core/src/main/scala/kafka/utils/ByteBoundedBlockingQueue.scala>:97: warning: Could not find any member to link for "NullPointerException".
[ant:scaladoc] /**
[ant:scaladoc] ^
[ant:scaladoc] <https://builds.apache.org/job/kafka-trunk-jdk8/ws/core/src/main/scala/kafka/utils/ByteBoundedBlockingQueue.scala>:97: warning: Could not find any member to link for "InterruptedException".
[ant:scaladoc] /**
[ant:scaladoc] ^
[ant:scaladoc] <https://builds.apache.org/job/kafka-trunk-jdk8/ws/core/src/main/scala/kafka/utils/ByteBoundedBlockingQueue.scala>:72: warning: Could not find any member to link for "NullPointerException".
[ant:scaladoc] /**
[ant:scaladoc] ^
[ant:scaladoc] <https://builds.apache.org/job/kafka-trunk-jdk8/ws/core/src/main/scala/kafka/utils/ByteBoundedBlockingQueue.scala>:72: warning: Could not find any member to link for "InterruptedException".
[ant:scaladoc] /**
[ant:scaladoc] ^
[ant:scaladoc] <https://builds.apache.org/job/kafka-trunk-jdk8/ws/core/src/main/scala/kafka/utils/ByteBoundedBlockingQueue.scala>:32: warning: Could not find any member to link for "NullPointerException".
[ant:scaladoc] /**
[ant:scaladoc] ^
[ant:scaladoc] <https://builds.apache.org/job/kafka-trunk-jdk8/ws/core/src/main/scala/kafka/utils/ByteBoundedBlockingQueue.scala>:32: warning: Could not find any member to link for "InterruptedException".
[ant:scaladoc] /**
[ant:scaladoc] ^
[ant:scaladoc] <https://builds.apache.org/job/kafka-trunk-jdk8/ws/core/src/main/scala/kafka/controller/PartitionLeaderSelector.scala>:28: warning: Could not find any member to link for "NoReplicaOnlineException".
[ant:scaladoc] /**
[ant:scaladoc] ^
[ant:scaladoc] <https://builds.apache.org/job/kafka-trunk-jdk8/ws/core/src/main/scala/kafka/controller/KafkaController.scala>:1335: warning: Could not find any member to link for "Exception".
[ant:scaladoc] /**
[ant:scaladoc] ^
[ant:scaladoc] <https://builds.apache.org/job/kafka-trunk-jdk8/ws/core/src/main/scala/kafka/controller/KafkaController.scala>:1294: warning: Could not find any member to link for "Exception".
[ant:scaladoc] /**
[ant:scaladoc] ^
[ant:scaladoc] <https://builds.apache.org/job/kafka-trunk-jdk8/ws/core/src/main/scala/kafka/controller/KafkaController.scala>:1277: warning: Could not find any member to link for "Exception".
[ant:scaladoc] /**
[ant:scaladoc] ^
[ant:scaladoc] <https://builds.apache.org/job/kafka-trunk-jdk8/ws/core/src/main/scala/kafka/controller/KafkaController.scala>:1251: warning: Could not find any member to link for "Exception".
[ant:scaladoc] /**
[ant:scaladoc] ^
[ant:scaladoc] <https://builds.apache.org/job/kafka-trunk-jdk8/ws/core/src/main/scala/kafka/controller/PartitionStateMachine.scala>:489: warning: Could not find any member to link for "Exception".
[ant:scaladoc] /**
[ant:scaladoc] ^
[ant:scaladoc] <https://builds.apache.org/job/kafka-trunk-jdk8/ws/core/src/main/scala/kafka/controller/PartitionStateMachine.scala>:454: warning: Could not find any member to link for "Exception".
[ant:scaladoc] /**
[ant:scaladoc] ^
[ant:scaladoc] <https://builds.apache.org/job/kafka-trunk-jdk8/ws/core/src/main/scala/kafka/controller/KafkaController.scala>:1439: warning: Could not find any member to link for "Exception".
[ant:scaladoc] /**
[ant:scaladoc] ^
[ant:scaladoc] <https://builds.apache.org/job/kafka-trunk-jdk8/ws/core/src/main/scala/kafka/controller/KafkaController.scala>:1416: warning: Could not find any member to link for "Exception".
[ant:scaladoc] /**
[ant:scaladoc] ^
[ant:scaladoc] <https://builds.apache.org/job/kafka-trunk-jdk8/ws/core/src/main/scala/kafka/controller/KafkaController.scala>:1161: warning: Could not find any member to link for "Exception".
[ant:scaladoc] /**
[ant:scaladoc] ^
[ant:scaladoc] <https://builds.apache.org/job/kafka-trunk-jdk8/ws/core/src/main/scala/kafka/utils/ByteBoundedBlockingQueue.scala>:72: warning: Could not find any member to link for "java.util.concurrent.BlockingQueue#offer".
[ant:scaladoc] /**
[ant:scaladoc] ^
[ant:scaladoc] <https://builds.apache.org/job/kafka-trunk-jdk8/ws/core/src/main/scala/kafka/utils/ByteBoundedBlockingQueue.scala>:32: warning: Could not find any member to link for "java.util.concurrent.BlockingQueue#offer".
[ant:scaladoc] /**
[ant:scaladoc] ^
[ant:scaladoc] <https://builds.apache.org/job/kafka-trunk-jdk8/ws/core/src/main/scala/kafka/utils/ByteBoundedBlockingQueue.scala>:137: warning: Could not find any member to link for "java.util.concurrent.BlockingQueue#poll".
[ant:scaladoc] /**
[ant:scaladoc] ^
[ant:scaladoc] <https://builds.apache.org/job/kafka-trunk-jdk8/ws/core/src/main/scala/kafka/utils/ByteBoundedBlockingQueue.scala>:120: warning: Could not find any member to link for "java.util.concurrent.BlockingQueue#poll".
[ant:scaladoc] /**
[ant:scaladoc] ^
[ant:scaladoc] <https://builds.apache.org/job/kafka-trunk-jdk8/ws/core/src/main/scala/kafka/utils/ByteBoundedBlockingQueue.scala>:97: warning: Could not find any member to link for "java.util.concurrent.BlockingQueue#put".
[ant:scaladoc] /**
[ant:scaladoc] ^
[ant:scaladoc] <https://builds.apache.org/job/kafka-trunk-jdk8/ws/core/src/main/scala/kafka/utils/ByteBoundedBlockingQueue.scala>:152: warning: Could not find any member to link for "java.util.concurrent.BlockingQueue#take".
[ant:scaladoc] /**
[ant:scaladoc] ^
[ant:scaladoc] 35 warnings found
:kafka-trunk-jdk8:core:scaladocJar
:kafka-trunk-jdk8:core:docsJar
:clients:docsJar
:log4j-appender:javadoc UP-TO-DATE
:core:javadoc
cache fileHashes.bin (<https://builds.apache.org/job/kafka-trunk-jdk8/ws/.gradle/2.4/taskArtifacts/fileHashes.bin)> is corrupt. Discarding.
<https://builds.apache.org/job/kafka-trunk-jdk8/ws/core/src/main/scala/kafka/javaapi/consumer/ConsumerConnector.java>:42: warning: no @param for <K>
createMessageStreams(Map<String, Integer> topicCountMap, Decoder<K> keyDecoder, Decoder<V> valueDecoder);
^
<https://builds.apache.org/job/kafka-trunk-jdk8/ws/core/src/main/scala/kafka/javaapi/consumer/ConsumerConnector.java>:42: warning: no @param for <V>
createMessageStreams(Map<String, Integer> topicCountMap, Decoder<K> keyDecoder, Decoder<V> valueDecoder);
^
<https://builds.apache.org/job/kafka-trunk-jdk8/ws/core/src/main/scala/kafka/javaapi/consumer/ConsumerConnector.java>:58: warning: no @param for <K>
createMessageStreamsByFilter(TopicFilter topicFilter, int numStreams, Decoder<K> keyDecoder, Decoder<V> valueDecoder);
^
<https://builds.apache.org/job/kafka-trunk-jdk8/ws/core/src/main/scala/kafka/javaapi/consumer/ConsumerConnector.java>:58: warning: no @param for <V>
createMessageStreamsByFilter(TopicFilter topicFilter, int numStreams, Decoder<K> keyDecoder, Decoder<V> valueDecoder);
^
4 warnings
FAILURE: Build failed with an exception.
* What went wrong:
Could not add entry ':core:javadoc' to cache taskArtifacts.bin (<https://builds.apache.org/job/kafka-trunk-jdk8/ws/.gradle/2.4/taskArtifacts/taskArtifacts.bin).>
> Corrupted DataBlock 43906 found in cache '<https://builds.apache.org/job/kafka-trunk-jdk8/ws/.gradle/2.4/taskArtifacts/taskArtifacts.bin'.>
* Try:
Run with --stacktrace option to get the stack trace. Run with --info or --debug option to get more log output.
BUILD FAILED
Total time: 5 mins 23.754 secs
Build step 'Execute shell' marked build as failure
Recording test results
Setting GRADLE_2_1_HOME=/home/jenkins/jenkins-slave/tools/hudson.plugins.gradle.GradleInstallation/Gradle_2.1
Setting JDK1_8_0_45_HOME=/home/jenkins/jenkins-slave/tools/hudson.model.JDK/jdk1.8.0_45
ERROR: Publisher 'Publish JUnit test result report' failed: No test report files were found. Configuration error?
Setting GRADLE_2_1_HOME=/home/jenkins/jenkins-slave/tools/hudson.plugins.gradle.GradleInstallation/Gradle_2.1
Setting JDK1_8_0_45_HOME=/home/jenkins/jenkins-slave/tools/hudson.model.JDK/jdk1.8.0_45
Build failed in Jenkins: kafka-trunk-jdk8 #14
Posted by Apache Jenkins Server <je...@builds.apache.org>.
See <https://builds.apache.org/job/kafka-trunk-jdk8/14/changes>
Changes:
[junrao] KAFKA-2614; No more clients can connect after
------------------------------------------
[...truncated 3238 lines...]
kafka.api.ConsumerTest > testSeek PASSED
kafka.log.LogCleanerIntegrationTest > cleanerTest[3] PASSED
kafka.integration.SslTopicMetadataTest > testGetAllTopicMetadata PASSED
kafka.integration.PrimitiveApiTest > testDefaultEncoderProducerAndFetch PASSED
kafka.api.SSLConsumerTest > testSimpleConsumption PASSED
kafka.integration.PrimitiveApiTest > testFetchRequestCanProperlySerialize PASSED
kafka.api.ConsumerTest > testUnsubscribeTopic PASSED
kafka.integration.PrimitiveApiTest > testPipelinedProduceRequests PASSED
kafka.integration.SslTopicMetadataTest > testAliveBrokersListWithNoTopicsAfterNewBrokerStartup PASSED
kafka.integration.PrimitiveApiTest > testProduceAndMultiFetch PASSED
kafka.api.ConsumerTest > testAutoCommitOnClose PASSED
kafka.integration.SslTopicMetadataTest > testBasicTopicMetadata PASSED
kafka.api.SSLConsumerTest > testAutoOffsetReset PASSED
kafka.integration.PrimitiveApiTest > testDefaultEncoderProducerAndFetchWithCompression PASSED
kafka.integration.PrimitiveApiTest > testConsumerEmptyTopic PASSED
kafka.integration.SslTopicMetadataTest > testTopicMetadataRequest PASSED
kafka.integration.PrimitiveApiTest > testEmptyFetchRequest PASSED
kafka.utils.ByteBoundedBlockingQueueTest > testByteBoundedBlockingQueue PASSED
kafka.coordinator.PartitionAssignorTest > testRoundRobinAssignorOneConsumerNonexistentTopic PASSED
kafka.coordinator.PartitionAssignorTest > testRangeAssignorOnlyAssignsPartitionsFromSubscribedTopics PASSED
kafka.coordinator.PartitionAssignorTest > testRangeAssignorOneConsumerNoTopic PASSED
kafka.coordinator.PartitionAssignorTest > testRangeAssignorOneConsumerMultipleTopics PASSED
kafka.coordinator.PartitionAssignorTest > testRoundRobinAssignorOnlyAssignsPartitionsFromSubscribedTopics PASSED
kafka.coordinator.PartitionAssignorTest > testRoundRobinAssignorTwoConsumersOneTopicOnePartition PASSED
kafka.coordinator.PartitionAssignorTest > testRangeAssignorTwoConsumersOneTopicTwoPartitions PASSED
kafka.coordinator.PartitionAssignorTest > testRoundRobinAssignorTwoConsumersOneTopicTwoPartitions PASSED
kafka.coordinator.PartitionAssignorTest > testRoundRobinAssignorMultipleConsumersMixedTopics PASSED
kafka.coordinator.PartitionAssignorTest > testRangeAssignorTwoConsumersOneTopicOnePartition PASSED
kafka.coordinator.PartitionAssignorTest > testRangeAssignorMultipleConsumersMixedTopics PASSED
kafka.coordinator.PartitionAssignorTest > testRoundRobinAssignorOneConsumerNoTopic PASSED
kafka.coordinator.PartitionAssignorTest > testRoundRobinAssignorOneConsumerOneTopic PASSED
kafka.coordinator.PartitionAssignorTest > testRangeAssignorOneConsumerOneTopic PASSED
kafka.coordinator.PartitionAssignorTest > testRangeAssignorOneConsumerNonexistentTopic PASSED
kafka.coordinator.PartitionAssignorTest > testRoundRobinAssignorOneConsumerMultipleTopics PASSED
kafka.coordinator.PartitionAssignorTest > testRoundRobinAssignorTwoConsumersTwoTopicsSixPartitions PASSED
kafka.coordinator.PartitionAssignorTest > testRangeAssignorTwoConsumersTwoTopicsSixPartitions PASSED
kafka.api.ConsumerTest > testListTopics PASSED
kafka.integration.SslTopicMetadataTest > testAliveBrokersListWithNoTopicsAfterABrokerShutdown PASSED
kafka.utils.timer.TimerTest > testAlreadyExpiredTask PASSED
kafka.integration.PlaintextTopicMetadataTest > testIsrAfterBrokerShutDownAndJoinsBack PASSED
kafka.api.ConsumerTest > testExpandingTopicSubscriptions PASSED
kafka.utils.timer.TimerTest > testTaskExpiration PASSED
kafka.javaapi.message.ByteBufferMessageSetTest > testSizeInBytesWithCompression PASSED
kafka.javaapi.message.ByteBufferMessageSetTest > testIteratorIsConsistentWithCompression PASSED
kafka.javaapi.message.ByteBufferMessageSetTest > testIteratorIsConsistent PASSED
kafka.javaapi.message.ByteBufferMessageSetTest > testEqualsWithCompression PASSED
kafka.javaapi.message.ByteBufferMessageSetTest > testWrittenEqualsRead PASSED
kafka.javaapi.message.ByteBufferMessageSetTest > testEquals PASSED
kafka.javaapi.message.ByteBufferMessageSetTest > testSizeInBytes PASSED
kafka.integration.PlaintextTopicMetadataTest > testAutoCreateTopicWithCollision PASSED
kafka.integration.PlaintextTopicMetadataTest > testAliveBrokerListWithNoTopics PASSED
kafka.integration.PlaintextTopicMetadataTest > testAutoCreateTopic PASSED
kafka.api.ConsumerTest > testPatternUnsubscription PASSED
kafka.integration.PlaintextTopicMetadataTest > testGetAllTopicMetadata PASSED
kafka.api.ConsumerTest > testGroupConsumption PASSED
kafka.integration.PlaintextTopicMetadataTest > testAliveBrokersListWithNoTopicsAfterNewBrokerStartup PASSED
kafka.integration.PlaintextTopicMetadataTest > testBasicTopicMetadata PASSED
kafka.api.ConsumerTest > testPartitionsFor PASSED
kafka.integration.PlaintextTopicMetadataTest > testTopicMetadataRequest PASSED
kafka.api.ConsumerTest > testAutoCommitOnRebalance PASSED
kafka.integration.PlaintextTopicMetadataTest > testAliveBrokersListWithNoTopicsAfterABrokerShutdown PASSED
kafka.utils.timer.TimerTaskListTest > testAll PASSED
kafka.coordinator.CoordinatorMetadataTest > testBindGroupToTopicsAlreadyListenedOn PASSED
kafka.coordinator.CoordinatorMetadataTest > testGetGroup PASSED
kafka.coordinator.CoordinatorMetadataTest > testBindNonexistentGroupToTopics PASSED
kafka.coordinator.CoordinatorMetadataTest > testBindGroupToTopicsNotListenedOn PASSED
kafka.coordinator.CoordinatorMetadataTest > testUnbindNonexistentGroupFromTopics PASSED
kafka.coordinator.CoordinatorMetadataTest > testAddGroupReturnsPreexistingGroupIfItAlreadyExists PASSED
kafka.coordinator.CoordinatorMetadataTest > testUnbindGroupFromTopicsListenedOnByNoOtherGroup PASSED
kafka.coordinator.CoordinatorMetadataTest > testRemoveNonexistentGroup PASSED
kafka.coordinator.CoordinatorMetadataTest > testUnbindGroupFromTopicsNotListenedOn PASSED
kafka.coordinator.CoordinatorMetadataTest > testUnbindGroupFromTopicsListenedOnByOtherGroups PASSED
kafka.coordinator.CoordinatorMetadataTest > testRemoveGroupWithNoOtherGroupsBoundToItsTopics PASSED
kafka.coordinator.CoordinatorMetadataTest > testRemoveGroupWithOtherGroupsBoundToItsTopics PASSED
kafka.coordinator.CoordinatorMetadataTest > testGetNonexistentGroup PASSED
kafka.api.ConsumerTest > testSimpleConsumption PASSED
kafka.api.ConsumerTest > testPartitionPauseAndResume PASSED
kafka.api.ConsumerTest > testPartitionReassignmentCallback PASSED
kafka.api.ConsumerTest > testAutoOffsetReset PASSED
kafka.api.ConsumerTest > testCommitSpecifiedOffsets PASSED
kafka.api.ConsumerTest > testCommitMetadata PASSED
kafka.api.ConsumerTest > testPatternSubscription PASSED
kafka.security.auth.SimpleAclAuthorizerTest > testAllowAllAccess PASSED
kafka.security.auth.SimpleAclAuthorizerTest > testNoAclFound PASSED
kafka.security.auth.SimpleAclAuthorizerTest > testAclManagementAPIs PASSED
kafka.security.auth.SimpleAclAuthorizerTest > testWildCardAcls PASSED
kafka.security.auth.SimpleAclAuthorizerTest > testTopicAcl PASSED
kafka.security.auth.SimpleAclAuthorizerTest > testSuperUserHasAccess PASSED
kafka.security.auth.SimpleAclAuthorizerTest > testDenyTakesPrecedence PASSED
kafka.security.auth.SimpleAclAuthorizerTest > testNoAclFoundOverride PASSED
kafka.security.auth.SimpleAclAuthorizerTest > testLoadCache PASSED
kafka.utils.ReplicationUtilsTest > testUpdateLeaderAndIsr PASSED
kafka.utils.ReplicationUtilsTest > testGetLeaderIsrAndEpochForPartition PASSED
kafka.coordinator.ConsumerGroupMetadataTest > testDeadToRebalancingIllegalTransition PASSED
kafka.coordinator.ConsumerGroupMetadataTest > testPreparingRebalanceToRebalancingTransition PASSED
kafka.coordinator.ConsumerGroupMetadataTest > testRebalancingToDeadIllegalTransition PASSED
kafka.coordinator.ConsumerGroupMetadataTest > testPreparingRebalanceToStableIllegalTransition PASSED
kafka.coordinator.ConsumerGroupMetadataTest > testRebalancingToPreparingRebalanceTransition PASSED
kafka.coordinator.ConsumerGroupMetadataTest > testCannotRebalanceWhenDead PASSED
kafka.coordinator.ConsumerGroupMetadataTest > testStableToDeadIllegalTransition PASSED
kafka.coordinator.ConsumerGroupMetadataTest > testCannotRebalanceWhenPreparingRebalance PASSED
kafka.coordinator.ConsumerGroupMetadataTest > testDeadToPreparingRebalanceIllegalTransition PASSED
kafka.coordinator.ConsumerGroupMetadataTest > testStableToRebalancingIllegalTransition PASSED
kafka.coordinator.ConsumerGroupMetadataTest > testDeadToDeadIllegalTransition PASSED
kafka.coordinator.ConsumerGroupMetadataTest > testStableToPreparingRebalanceTransition PASSED
kafka.coordinator.ConsumerGroupMetadataTest > testCannotRebalanceWhenRebalancing PASSED
kafka.coordinator.ConsumerGroupMetadataTest > testPreparingRebalanceToDeadTransition PASSED
kafka.coordinator.ConsumerGroupMetadataTest > testStableToStableIllegalTransition PASSED
kafka.coordinator.ConsumerGroupMetadataTest > testRebalancingToStableTransition PASSED
kafka.coordinator.ConsumerGroupMetadataTest > testDeadToStableIllegalTransition PASSED
kafka.coordinator.ConsumerGroupMetadataTest > testCanRebalanceWhenStable PASSED
kafka.coordinator.ConsumerGroupMetadataTest > testRebalancingToRebalancingIllegalTransition PASSED
kafka.coordinator.ConsumerGroupMetadataTest > testPreparingRebalanceToPreparingRebalanceIllegalTransition PASSED
548 tests completed, 1 failed
:kafka-trunk-jdk8:core:test FAILED
:test_core_2_11_7 FAILED
FAILURE: Build failed with an exception.
* What went wrong:
Execution failed for task ':core:test'.
> There were failing tests. See the report at: file://<https://builds.apache.org/job/kafka-trunk-jdk8/ws/core/build/reports/tests/index.html>
* Try:
Run with --stacktrace option to get the stack trace. Run with --info or --debug option to get more log output.
BUILD FAILED
Total time: 13 mins 54.738 secs
Build step 'Execute shell' marked build as failure
Recording test results
Setting GRADLE_2_1_HOME=/home/jenkins/jenkins-slave/tools/hudson.plugins.gradle.GradleInstallation/Gradle_2.1
Setting JDK1_8_0_45_HOME=/home/jenkins/jenkins-slave/tools/hudson.model.JDK/jdk1.8.0_45
Setting GRADLE_2_1_HOME=/home/jenkins/jenkins-slave/tools/hudson.plugins.gradle.GradleInstallation/Gradle_2.1
Setting JDK1_8_0_45_HOME=/home/jenkins/jenkins-slave/tools/hudson.model.JDK/jdk1.8.0_45