You are viewing a plain text version of this content. The canonical link for it is here.
Posted to builds@solr.apache.org by Apache Jenkins Server <je...@builds.apache.org> on 2023/09/17 06:01:52 UTC

[JENKINS] Solr ยป Solr-Smoketest-9.x - Build # 180 - Still Failing!

Build: https://ci-builds.apache.org/job/Solr/job/Solr-Smoketest-9.x/180/

Log: 
Started by timer
Running as SYSTEM
[EnvInject] - Loading node environment variables.
Building remotely on lucene-solr-2 (solr lucene) in workspace /home/jenkins/jenkins-slave/workspace/Solr/Solr-Smoketest-9.x
The recommended git tool is: NONE
No credentials specified
 > git rev-parse --resolve-git-dir /home/jenkins/jenkins-slave/workspace/Solr/Solr-Smoketest-9.x/.git # timeout=10
Fetching changes from the remote Git repository
 > git config remote.origin.url https://github.com/apache/solr.git # timeout=10
Cleaning workspace
 > git rev-parse --verify HEAD # timeout=10
Resetting working tree
 > git reset --hard # timeout=10
 > git clean -fdx # timeout=10
Fetching upstream changes from https://github.com/apache/solr.git
 > git --version # timeout=10
 > git --version # 'git version 2.25.1'
 > git fetch --tags --force --progress -- https://github.com/apache/solr.git +refs/heads/*:refs/remotes/origin/* # timeout=10
 > git rev-parse origin/branch_9x^{commit} # timeout=10
Checking out Revision ca3c81ce37cb9160dff5384e1ab72afd900abb47 (origin/branch_9x)
 > git config core.sparsecheckout # timeout=10
 > git checkout -f ca3c81ce37cb9160dff5384e1ab72afd900abb47 # timeout=10
Commit message: "SOLR-16971 RealTimeGet with Composite router throws NPE (#1914)"
 > git rev-list --no-walk ca3c81ce37cb9160dff5384e1ab72afd900abb47 # timeout=10
No emails were triggered.
provisioning config files...
copy managed file [gradle.properties] to file:/home/jenkins/jenkins-slave/workspace/Solr/Solr-Smoketest-9.x/gradle.properties
[Gradle] - Launching build.
[Solr-Smoketest-9.x] $ /home/jenkins/jenkins-slave/workspace/Solr/Solr-Smoketest-9.x/gradlew -Dversion.suffix= -Dgradle.user.home=/home/jenkins/jenkins-slave/workspace/Solr/.gradle -Porg.gradle.daemon=false -Pvalidation.git.failOnModified=false --continue -x signJarsPublication clean assembleRelease
Downloading gradle-wrapper.jar from https://raw.githubusercontent.com/gradle/gradle/v7.6.0/gradle/wrapper/gradle-wrapper.jar
To honour the JVM settings for this build a single-use Daemon process will be forked. See https://docs.gradle.org/7.6/userguide/gradle_daemon.html#sec:disabling_the_daemon.
Daemon will be stopped at the end of the build 
> Task :buildSrc:compileJava
> Task :buildSrc:compileGroovy NO-SOURCE
> Task :buildSrc:processResources NO-SOURCE
> Task :buildSrc:classes
> Task :buildSrc:jar
> Task :buildSrc:assemble
> Task :buildSrc:compileTestJava NO-SOURCE
> Task :buildSrc:compileTestGroovy NO-SOURCE
> Task :buildSrc:processTestResources NO-SOURCE
> Task :buildSrc:testClasses UP-TO-DATE
> Task :buildSrc:test NO-SOURCE
> Task :buildSrc:check UP-TO-DATE
> Task :buildSrc:build
> Task :clean
> Task :solr:clean UP-TO-DATE
> Task :solr:api:clean
> Task :solr:benchmark:clean
> Task :solr:core:clean
> Task :solr:distribution:clean UP-TO-DATE
> Task :solr:docker:clean UP-TO-DATE
> Task :solr:documentation:clean UP-TO-DATE
> Task :solr:example:clean UP-TO-DATE
> Task :solr:modules:clean UP-TO-DATE
> Task :solr:packaging:clean UP-TO-DATE
> Task :solr:prometheus-exporter:clean
> Task :solr:server:clean
> Task :solr:solr-ref-guide:clean
> Task :solr:solrj:clean
> Task :solr:solrj-streaming:clean
> Task :solr:solrj-zookeeper:clean
> Task :solr:test-framework:clean
> Task :solr:webapp:clean
> Task :solr:modules:analysis-extras:clean
> Task :solr:modules:analytics:clean
> Task :solr:modules:clustering:clean
> Task :solr:modules:extraction:clean
> Task :solr:modules:gcs-repository:clean
> Task :solr:modules:hadoop-auth:clean
> Task :solr:modules:hdfs:clean
> Task :solr:modules:jaegertracer-configurator:clean
> Task :solr:modules:jwt-auth:clean
> Task :solr:modules:langid:clean
> Task :solr:modules:ltr:clean
> Task :solr:modules:opentelemetry:clean
> Task :solr:modules:s3-repository:clean
> Task :solr:modules:scripting:clean
> Task :solr:modules:sql:clean
> Task :mavenLocalClean UP-TO-DATE
> Task :solr-missing-doclet:compileJava
> Task :solr-missing-doclet:processResources NO-SOURCE
> Task :solr-missing-doclet:classes
> Task :solr-missing-doclet:jar
> Task :gitStatus
> Task :checkJdkInternalsExportedToGradle
> Task :solr:api:compileJava
> Task :solr:api:processResources NO-SOURCE
> Task :solr:api:classes
> Task :solr:api:jar
> Task :solr:api:generateMetadataFileForJarsPublication SKIPPED
> Task :solr:api:generatePomFileForJarsPublication
> Task :solr:api:renderJavadoc
> Task :solr:api:javadoc SKIPPED
> Task :solr:api:javadocJar
> Task :solr:api:sourcesJar
> Task :solr:api:publishJarsPublicationToBuildRepository

> Task :solr:api:resolve
SLF4J: No SLF4J providers were found.
SLF4J: Defaulting to no-operation (NOP) logger implementation
SLF4J: See https://www.slf4j.org/codes.html#noProviders for further details.

> Task :solr:solrj:openApiGenerate
################################################################################
# Thanks for using OpenAPI Generator.                                          #
# Please consider donation to help us maintain this project ๐Ÿ™                 #
# https://opencollective.com/openapi_generator/donate                          #
################################################################################
Successfully generated code to /home/jenkins/jenkins-slave/workspace/Solr/Solr-Smoketest-9.x/solr/solrj/build/generated/

> Task :spotlessInternalRegisterDependencies
> Task :solr:solrj:generatedSpotlessHelper
> Task :solr:solrj:generatedSpotless

> Task :solr:solrj:compileJava
Note: Some input files use or override a deprecated API.
Note: Recompile with -Xlint:deprecation for details.

> Task :solr:solrj-streaming:compileJava
Note: Some input files use or override a deprecated API.
Note: Recompile with -Xlint:deprecation for details.

> Task :solr:solrj-zookeeper:compileJava
Note: Some input files use or override a deprecated API.
Note: Recompile with -Xlint:deprecation for details.

> Task :solr:core:compileJava
Note: Some input files use or override a deprecated API.
Note: Recompile with -Xlint:deprecation for details.

> Task :solr:core:processResources
> Task :solr:core:classes
> Task :solr:core:jar
> Task :solr:core:generateMetadataFileForJarsPublication SKIPPED
> Task :solr:core:generatePomFileForJarsPublication
> Task :solr:solrj:renderJavadoc
> Task :solr:solrj-streaming:renderJavadoc
> Task :solr:solrj-zookeeper:renderJavadoc
> Task :solr:core:renderJavadoc
> Task :solr:core:javadoc SKIPPED
> Task :solr:core:javadocJar
> Task :solr:core:sourcesJar
> Task :solr:core:publishJarsPublicationToBuildRepository

> Task :solr:prometheus-exporter:compileJava
Note: Some input files use or override a deprecated API.
Note: Recompile with -Xlint:deprecation for details.

> Task :solr:prometheus-exporter:processResources NO-SOURCE
> Task :solr:prometheus-exporter:classes
> Task :solr:prometheus-exporter:jar
> Task :solr:prometheus-exporter:generateMetadataFileForJarsPublication SKIPPED
> Task :solr:prometheus-exporter:generatePomFileForJarsPublication
> Task :solr:prometheus-exporter:renderJavadoc
> Task :solr:prometheus-exporter:javadoc SKIPPED
> Task :solr:prometheus-exporter:javadocJar
> Task :solr:prometheus-exporter:sourcesJar
> Task :solr:prometheus-exporter:publishJarsPublicationToBuildRepository
> Task :solr:solrj:processResources
> Task :solr:solrj:classes
> Task :solr:solrj:jar
> Task :solr:solrj:generateMetadataFileForJarsPublication SKIPPED
> Task :solr:solrj:generatePomFileForJarsPublication
> Task :solr:solrj:javadoc SKIPPED
> Task :solr:solrj:javadocJar
> Task :solr:solrj:sourcesJar
> Task :solr:solrj:publishJarsPublicationToBuildRepository
> Task :solr:solrj-streaming:processResources
> Task :solr:solrj-streaming:classes
> Task :solr:solrj-streaming:jar
> Task :solr:solrj-streaming:generateMetadataFileForJarsPublication SKIPPED
> Task :solr:solrj-streaming:generatePomFileForJarsPublication
> Task :solr:solrj-streaming:javadoc SKIPPED
> Task :solr:solrj-streaming:javadocJar
> Task :solr:solrj-streaming:sourcesJar
> Task :solr:solrj-streaming:publishJarsPublicationToBuildRepository
> Task :solr:solrj-zookeeper:processResources NO-SOURCE
> Task :solr:solrj-zookeeper:classes
> Task :solr:solrj-zookeeper:jar
> Task :solr:solrj-zookeeper:generateMetadataFileForJarsPublication SKIPPED
> Task :solr:solrj-zookeeper:generatePomFileForJarsPublication
> Task :solr:solrj-zookeeper:javadoc SKIPPED
> Task :solr:solrj-zookeeper:javadocJar
> Task :solr:solrj-zookeeper:sourcesJar
> Task :solr:solrj-zookeeper:publishJarsPublicationToBuildRepository

> Task :solr:test-framework:compileJava
Note: Some input files use or override a deprecated API.
Note: Recompile with -Xlint:deprecation for details.

> Task :solr:test-framework:processResources
> Task :solr:test-framework:classes
> Task :solr:test-framework:jar
> Task :solr:test-framework:generateMetadataFileForJarsPublication SKIPPED
> Task :solr:test-framework:generatePomFileForJarsPublication
> Task :solr:test-framework:renderJavadoc
> Task :solr:test-framework:javadoc SKIPPED
> Task :solr:test-framework:javadocJar
> Task :solr:test-framework:sourcesJar
> Task :solr:test-framework:publishJarsPublicationToBuildRepository

> Task :solr:modules:analysis-extras:compileJava
Note: /home/jenkins/jenkins-slave/workspace/Solr/Solr-Smoketest-9.x/solr/modules/analysis-extras/src/java/org/apache/solr/schema/ICUCollationField.java uses or overrides a deprecated API.
Note: Recompile with -Xlint:deprecation for details.

> Task :solr:modules:analysis-extras:processResources NO-SOURCE
> Task :solr:modules:analysis-extras:classes
> Task :solr:modules:analysis-extras:jar
> Task :solr:modules:analysis-extras:generateMetadataFileForJarsPublication SKIPPED
> Task :solr:modules:analysis-extras:generatePomFileForJarsPublication
> Task :solr:modules:analysis-extras:renderJavadoc
> Task :solr:modules:analysis-extras:javadoc SKIPPED
> Task :solr:modules:analysis-extras:javadocJar
> Task :solr:modules:analysis-extras:sourcesJar
> Task :solr:modules:analysis-extras:publishJarsPublicationToBuildRepository

> Task :solr:modules:analytics:compileJava
Note: Some input files use or override a deprecated API.
Note: Recompile with -Xlint:deprecation for details.

> Task :solr:modules:analytics:processResources NO-SOURCE
> Task :solr:modules:analytics:classes
> Task :solr:modules:analytics:jar
> Task :solr:modules:analytics:generateMetadataFileForJarsPublication SKIPPED
> Task :solr:modules:analytics:generatePomFileForJarsPublication
> Task :solr:modules:analytics:renderJavadoc
> Task :solr:modules:analytics:javadoc SKIPPED
> Task :solr:modules:analytics:javadocJar
> Task :solr:modules:analytics:sourcesJar
> Task :solr:modules:analytics:publishJarsPublicationToBuildRepository
> Task :solr:modules:clustering:compileJava
> Task :solr:modules:clustering:processResources NO-SOURCE
> Task :solr:modules:clustering:classes
> Task :solr:modules:clustering:jar
> Task :solr:modules:clustering:generateMetadataFileForJarsPublication SKIPPED
> Task :solr:modules:clustering:generatePomFileForJarsPublication
> Task :solr:modules:clustering:renderJavadoc
> Task :solr:modules:clustering:javadoc SKIPPED
> Task :solr:modules:clustering:javadocJar
> Task :solr:modules:clustering:sourcesJar
> Task :solr:modules:clustering:publishJarsPublicationToBuildRepository

> Task :solr:modules:extraction:compileJava
Note: /home/jenkins/jenkins-slave/workspace/Solr/Solr-Smoketest-9.x/solr/modules/extraction/src/java/org/apache/solr/handler/extraction/ExtractingDocumentLoader.java uses or overrides a deprecated API.
Note: Recompile with -Xlint:deprecation for details.

> Task :solr:modules:extraction:processResources
> Task :solr:modules:extraction:classes
> Task :solr:modules:extraction:jar
> Task :solr:modules:extraction:generateMetadataFileForJarsPublication SKIPPED
> Task :solr:modules:extraction:generatePomFileForJarsPublication
> Task :solr:modules:extraction:renderJavadoc
> Task :solr:modules:extraction:javadoc SKIPPED
> Task :solr:modules:extraction:javadocJar
> Task :solr:modules:extraction:sourcesJar
> Task :solr:modules:extraction:publishJarsPublicationToBuildRepository

> Task :solr:modules:gcs-repository:compileJava
Note: /home/jenkins/jenkins-slave/workspace/Solr/Solr-Smoketest-9.x/solr/modules/gcs-repository/src/java/org/apache/solr/gcs/GCSConfigParser.java uses or overrides a deprecated API.
Note: Recompile with -Xlint:deprecation for details.

> Task :solr:modules:gcs-repository:processResources NO-SOURCE
> Task :solr:modules:gcs-repository:classes
> Task :solr:modules:gcs-repository:jar
> Task :solr:modules:gcs-repository:generateMetadataFileForJarsPublication SKIPPED
> Task :solr:modules:gcs-repository:generatePomFileForJarsPublication
> Task :solr:modules:gcs-repository:renderJavadoc
> Task :solr:modules:gcs-repository:javadoc SKIPPED
> Task :solr:modules:gcs-repository:javadocJar
> Task :solr:modules:gcs-repository:sourcesJar
> Task :solr:modules:gcs-repository:publishJarsPublicationToBuildRepository

> Task :solr:modules:hadoop-auth:compileJava
Note: Some input files use or override a deprecated API.
Note: Recompile with -Xlint:deprecation for details.

> Task :solr:modules:hadoop-auth:processResources NO-SOURCE
> Task :solr:modules:hadoop-auth:classes
> Task :solr:modules:hadoop-auth:jar
> Task :solr:modules:hadoop-auth:generateMetadataFileForJarsPublication SKIPPED
> Task :solr:modules:hadoop-auth:generatePomFileForJarsPublication
> Task :solr:modules:hadoop-auth:renderJavadoc
> Task :solr:modules:hadoop-auth:javadoc SKIPPED
> Task :solr:modules:hadoop-auth:javadocJar
> Task :solr:modules:hadoop-auth:sourcesJar
> Task :solr:modules:hadoop-auth:publishJarsPublicationToBuildRepository

> Task :solr:modules:hdfs:compileJava
Note: Some input files use or override a deprecated API.
Note: Recompile with -Xlint:deprecation for details.

> Task :solr:modules:hdfs:processResources NO-SOURCE
> Task :solr:modules:hdfs:classes
> Task :solr:modules:hdfs:jar
> Task :solr:modules:hdfs:generateMetadataFileForJarsPublication SKIPPED
> Task :solr:modules:hdfs:generatePomFileForJarsPublication
> Task :solr:modules:hdfs:renderJavadoc
> Task :solr:modules:hdfs:javadoc SKIPPED
> Task :solr:modules:hdfs:javadocJar
> Task :solr:modules:hdfs:sourcesJar
> Task :solr:modules:hdfs:publishJarsPublicationToBuildRepository
> Task :solr:modules:jaegertracer-configurator:compileJava
> Task :solr:modules:jaegertracer-configurator:processResources NO-SOURCE
> Task :solr:modules:jaegertracer-configurator:classes
> Task :solr:modules:jaegertracer-configurator:jar
> Task :solr:modules:jaegertracer-configurator:generateMetadataFileForJarsPublication SKIPPED
> Task :solr:modules:jaegertracer-configurator:generatePomFileForJarsPublication
> Task :solr:modules:jaegertracer-configurator:renderJavadoc
> Task :solr:modules:jaegertracer-configurator:javadoc SKIPPED
> Task :solr:modules:jaegertracer-configurator:javadocJar
> Task :solr:modules:jaegertracer-configurator:sourcesJar
> Task :solr:modules:jaegertracer-configurator:publishJarsPublicationToBuildRepository

> Task :solr:modules:jwt-auth:compileJava
Note: /home/jenkins/jenkins-slave/workspace/Solr/Solr-Smoketest-9.x/solr/modules/jwt-auth/src/java/org/apache/solr/security/jwt/JWTAuthPlugin.java uses or overrides a deprecated API.
Note: Recompile with -Xlint:deprecation for details.

> Task :solr:modules:jwt-auth:processResources NO-SOURCE
> Task :solr:modules:jwt-auth:classes
> Task :solr:modules:jwt-auth:jar
> Task :solr:modules:jwt-auth:generateMetadataFileForJarsPublication SKIPPED
> Task :solr:modules:jwt-auth:generatePomFileForJarsPublication
> Task :solr:modules:jwt-auth:renderJavadoc
> Task :solr:modules:jwt-auth:javadoc SKIPPED
> Task :solr:modules:jwt-auth:javadocJar
> Task :solr:modules:jwt-auth:sourcesJar
> Task :solr:modules:jwt-auth:publishJarsPublicationToBuildRepository

> Task :solr:modules:langid:compileJava
Note: Some input files use or override a deprecated API.
Note: Recompile with -Xlint:deprecation for details.

> Task :solr:modules:langid:processResources
> Task :solr:modules:langid:classes
> Task :solr:modules:langid:jar
> Task :solr:modules:langid:generateMetadataFileForJarsPublication SKIPPED
> Task :solr:modules:langid:generatePomFileForJarsPublication
> Task :solr:modules:langid:renderJavadoc
> Task :solr:modules:langid:javadoc SKIPPED
> Task :solr:modules:langid:javadocJar
> Task :solr:modules:langid:sourcesJar
> Task :solr:modules:langid:publishJarsPublicationToBuildRepository

> Task :solr:modules:ltr:compileJava
Note: Some input files use or override a deprecated API.
Note: Recompile with -Xlint:deprecation for details.

> Task :solr:modules:ltr:processResources NO-SOURCE
> Task :solr:modules:ltr:classes
> Task :solr:modules:ltr:jar
> Task :solr:modules:ltr:generateMetadataFileForJarsPublication SKIPPED
> Task :solr:modules:ltr:generatePomFileForJarsPublication
> Task :solr:modules:ltr:renderJavadoc
> Task :solr:modules:ltr:javadoc SKIPPED
> Task :solr:modules:ltr:javadocJar
> Task :solr:modules:ltr:sourcesJar
> Task :solr:modules:ltr:publishJarsPublicationToBuildRepository
> Task :solr:modules:opentelemetry:compileJava
> Task :solr:modules:opentelemetry:processResources NO-SOURCE
> Task :solr:modules:opentelemetry:classes
> Task :solr:modules:opentelemetry:jar
> Task :solr:modules:opentelemetry:generateMetadataFileForJarsPublication SKIPPED
> Task :solr:modules:opentelemetry:generatePomFileForJarsPublication
> Task :solr:modules:opentelemetry:renderJavadoc
> Task :solr:modules:opentelemetry:javadoc SKIPPED
> Task :solr:modules:opentelemetry:javadocJar
> Task :solr:modules:opentelemetry:sourcesJar
> Task :solr:modules:opentelemetry:publishJarsPublicationToBuildRepository
> Task :solr:modules:s3-repository:compileJava
> Task :solr:modules:s3-repository:processResources NO-SOURCE
> Task :solr:modules:s3-repository:classes
> Task :solr:modules:s3-repository:jar
> Task :solr:modules:s3-repository:generateMetadataFileForJarsPublication SKIPPED
> Task :solr:modules:s3-repository:generatePomFileForJarsPublication
> Task :solr:modules:s3-repository:renderJavadoc
> Task :solr:modules:s3-repository:javadoc SKIPPED
> Task :solr:modules:s3-repository:javadocJar
> Task :solr:modules:s3-repository:sourcesJar
> Task :solr:modules:s3-repository:publishJarsPublicationToBuildRepository

> Task :solr:modules:scripting:compileJava
Note: /home/jenkins/jenkins-slave/workspace/Solr/Solr-Smoketest-9.x/solr/modules/scripting/src/java/org/apache/solr/scripting/xslt/XSLTUpdateRequestHandler.java uses or overrides a deprecated API.
Note: Recompile with -Xlint:deprecation for details.

> Task :solr:modules:scripting:processResources NO-SOURCE
> Task :solr:modules:scripting:classes
> Task :solr:modules:scripting:jar
> Task :solr:modules:scripting:generateMetadataFileForJarsPublication SKIPPED
> Task :solr:modules:scripting:generatePomFileForJarsPublication
> Task :solr:modules:scripting:renderJavadoc
> Task :solr:modules:scripting:javadoc SKIPPED
> Task :solr:modules:scripting:javadocJar
> Task :solr:modules:scripting:sourcesJar
> Task :solr:modules:scripting:publishJarsPublicationToBuildRepository

> Task :solr:modules:sql:compileJava
Note: Some input files use or override a deprecated API.
Note: Recompile with -Xlint:deprecation for details.

> Task :solr:modules:sql:processResources
> Task :solr:modules:sql:classes
> Task :solr:modules:sql:jar
> Task :solr:modules:sql:generateMetadataFileForJarsPublication SKIPPED
> Task :solr:modules:sql:generatePomFileForJarsPublication
> Task :solr:modules:sql:renderJavadoc
> Task :solr:modules:sql:javadoc SKIPPED
> Task :solr:modules:sql:javadocJar
> Task :solr:modules:sql:sourcesJar
> Task :solr:modules:sql:publishJarsPublicationToBuildRepository

> Task :mavenToLocalFolder
Local maven artifacts (poms, jars) created at: /home/jenkins/jenkins-slave/workspace/Solr/Solr-Smoketest-9.x/build/maven-local

> Task :checkWorkingCopyClean
> Task :solr:distribution:assembleSourceTgz
> Task :solr:docker:createBodySnippetDockerfile
> Task :solr:docker:createDockerfileLocal
> Task :solr:docker:assemblePackaging
> Task :solr:documentation:changesToHtml
> Task :solr:documentation:copyDocumentationAssets
> Task :solr:documentation:markdownToHtml
> Task :solr:documentation:copyChangesToHtmlForMiniSite
> Task :solr:documentation:copyMiniDocumentationAssets
> Task :solr:documentation:createMiniDocumentationIndex
> Task :solr:documentation:documentationMinimal
> Task :solr:core:assemblePostJar
> Task :solr:example:assemblePackaging
> Task :solr:prometheus-exporter:assemblePackaging
> Task :solr:webapp:compileJava NO-SOURCE
> Task :solr:webapp:processResources NO-SOURCE
> Task :solr:webapp:classes UP-TO-DATE
> Task :solr:webapp:war
> Task :solr:server:assemblePackaging
> Task :solr:modules:analysis-extras:assemblePackaging
> Task :solr:modules:analytics:assemblePackaging
> Task :solr:modules:clustering:assemblePackaging
> Task :solr:modules:extraction:assemblePackaging
> Task :solr:modules:gcs-repository:assemblePackaging
> Task :solr:modules:hadoop-auth:assemblePackaging
> Task :solr:modules:hdfs:assemblePackaging
> Task :solr:modules:jaegertracer-configurator:assemblePackaging
> Task :solr:modules:jwt-auth:assemblePackaging
> Task :solr:modules:langid:assemblePackaging
> Task :solr:modules:ltr:assemblePackaging
> Task :solr:modules:opentelemetry:assemblePackaging
> Task :solr:modules:s3-repository:assemblePackaging
> Task :solr:modules:scripting:assemblePackaging
> Task :solr:modules:sql:assemblePackaging
> Task :solr:packaging:fullDistTar
> Task :solr:packaging:slimDistTar
> Task :solr:distribution:computeChecksums
> Task :solr:distribution:prepareGitRev
> Task :solr:docker:createDockerfileOfficialFull
> Task :solr:docker:createDockerfileOfficialSlim
> Task :solr:distribution:assembleRelease

Deprecated Gradle features were used in this build, making it incompatible with Gradle 8.0.

You can use '--warning-mode all' to show the individual deprecation warnings and determine if they come from your own scripts or plugins.

See https://docs.gradle.org/7.6/userguide/command_line_interface.html#sec:command_line_warnings

BUILD SUCCESSFUL in 5m 1s
246 actionable tasks: 238 executed, 8 up-to-date
Build step 'Invoke Gradle script' changed build result to SUCCESS
Run condition [Always] enabling perform for step [Execute shell]
[Solr-Smoketest-9.x] $ /bin/bash /tmp/jenkins1282519766290720904.sh
Installing Python script requirements
Defaulting to user installation because normal site-packages is not writeable
Requirement already satisfied: six~=1.16.0 in /home/jenkins/.local/lib/python3.8/site-packages (from -r dev-tools/scripts/requirements.txt (line 1)) (1.16.0)
Requirement already satisfied: Jinja2~=3.1.1 in /home/jenkins/.local/lib/python3.8/site-packages (from -r dev-tools/scripts/requirements.txt (line 2)) (3.1.2)
Requirement already satisfied: PyYAML~=6.0 in /home/jenkins/.local/lib/python3.8/site-packages (from -r dev-tools/scripts/requirements.txt (line 3)) (6.0)
Requirement already satisfied: holidays~=0.16 in /home/jenkins/.local/lib/python3.8/site-packages (from -r dev-tools/scripts/requirements.txt (line 4)) (0.21)
Requirement already satisfied: ics~=0.7.2 in /home/jenkins/.local/lib/python3.8/site-packages (from -r dev-tools/scripts/requirements.txt (line 5)) (0.7.2)
Requirement already satisfied: console-menu~=0.7.1 in /home/jenkins/.local/lib/python3.8/site-packages (from -r dev-tools/scripts/requirements.txt (line 6)) (0.7.1)
Requirement already satisfied: PyGithub~=1.56 in /home/jenkins/.local/lib/python3.8/site-packages (from -r dev-tools/scripts/requirements.txt (line 7)) (1.58.0)
Requirement already satisfied: jira~=3.4.1 in /home/jenkins/.local/lib/python3.8/site-packages (from -r dev-tools/scripts/requirements.txt (line 8)) (3.4.1)
Requirement already satisfied: MarkupSafe>=2.0 in /home/jenkins/.local/lib/python3.8/site-packages (from Jinja2~=3.1.1->-r dev-tools/scripts/requirements.txt (line 2)) (2.1.2)
Requirement already satisfied: PyMeeus in /home/jenkins/.local/lib/python3.8/site-packages (from holidays~=0.16->-r dev-tools/scripts/requirements.txt (line 4)) (0.5.11)
Requirement already satisfied: convertdate>=2.3.0 in /home/jenkins/.local/lib/python3.8/site-packages (from holidays~=0.16->-r dev-tools/scripts/requirements.txt (line 4)) (2.4.0)
Requirement already satisfied: hijri-converter in /home/jenkins/.local/lib/python3.8/site-packages (from holidays~=0.16->-r dev-tools/scripts/requirements.txt (line 4)) (2.2.3)
Requirement already satisfied: korean-lunar-calendar in /home/jenkins/.local/lib/python3.8/site-packages (from holidays~=0.16->-r dev-tools/scripts/requirements.txt (line 4)) (0.2.1)
Requirement already satisfied: python-dateutil in /usr/lib/python3/dist-packages (from holidays~=0.16->-r dev-tools/scripts/requirements.txt (line 4)) (2.7.3)
Requirement already satisfied: backports.zoneinfo in /home/jenkins/.local/lib/python3.8/site-packages (from holidays~=0.16->-r dev-tools/scripts/requirements.txt (line 4)) (0.2.1)
Requirement already satisfied: arrow>=0.11 in /home/jenkins/.local/lib/python3.8/site-packages (from ics~=0.7.2->-r dev-tools/scripts/requirements.txt (line 5)) (0.14.7)
Requirement already satisfied: tatsu>4.2 in /home/jenkins/.local/lib/python3.8/site-packages (from ics~=0.7.2->-r dev-tools/scripts/requirements.txt (line 5)) (5.6.1)
Requirement already satisfied: attrs>=19.1.0 in /usr/lib/python3/dist-packages (from ics~=0.7.2->-r dev-tools/scripts/requirements.txt (line 5)) (19.3.0)
Requirement already satisfied: ansiwrap in /home/jenkins/.local/lib/python3.8/site-packages (from console-menu~=0.7.1->-r dev-tools/scripts/requirements.txt (line 6)) (0.8.4)
Requirement already satisfied: deprecated in /home/jenkins/.local/lib/python3.8/site-packages (from PyGithub~=1.56->-r dev-tools/scripts/requirements.txt (line 7)) (1.2.13)
Requirement already satisfied: pyjwt>=2.4.0 in /home/jenkins/.local/lib/python3.8/site-packages (from PyGithub~=1.56->-r dev-tools/scripts/requirements.txt (line 7)) (2.6.0)
Requirement already satisfied: pynacl>=1.4.0 in /home/jenkins/.local/lib/python3.8/site-packages (from PyGithub~=1.56->-r dev-tools/scripts/requirements.txt (line 7)) (1.5.0)
Requirement already satisfied: requests>=2.14.0 in /usr/lib/python3/dist-packages (from PyGithub~=1.56->-r dev-tools/scripts/requirements.txt (line 7)) (2.22.0)
Requirement already satisfied: defusedxml in /home/jenkins/.local/lib/python3.8/site-packages (from jira~=3.4.1->-r dev-tools/scripts/requirements.txt (line 8)) (0.7.1)
Requirement already satisfied: packaging in /home/jenkins/.local/lib/python3.8/site-packages (from jira~=3.4.1->-r dev-tools/scripts/requirements.txt (line 8)) (23.0)
Requirement already satisfied: requests-oauthlib>=1.1.0 in /home/jenkins/.local/lib/python3.8/site-packages (from jira~=3.4.1->-r dev-tools/scripts/requirements.txt (line 8)) (1.3.1)
Requirement already satisfied: requests-toolbelt in /home/jenkins/.local/lib/python3.8/site-packages (from jira~=3.4.1->-r dev-tools/scripts/requirements.txt (line 8)) (0.9.1)
Requirement already satisfied: typing-extensions>=3.7.4.2 in /home/jenkins/.local/lib/python3.8/site-packages (from jira~=3.4.1->-r dev-tools/scripts/requirements.txt (line 8)) (4.5.0)
Requirement already satisfied: cffi>=1.4.1 in /usr/local/lib/python3.8/dist-packages (from pynacl>=1.4.0->PyGithub~=1.56->-r dev-tools/scripts/requirements.txt (line 7)) (1.14.2)
Requirement already satisfied: oauthlib>=3.0.0 in /usr/lib/python3/dist-packages (from requests-oauthlib>=1.1.0->jira~=3.4.1->-r dev-tools/scripts/requirements.txt (line 8)) (3.1.0)
Requirement already satisfied: textwrap3>=0.9.2 in /home/jenkins/.local/lib/python3.8/site-packages (from ansiwrap->console-menu~=0.7.1->-r dev-tools/scripts/requirements.txt (line 6)) (0.9.2)
Requirement already satisfied: wrapt<2,>=1.10 in /home/jenkins/.local/lib/python3.8/site-packages (from deprecated->PyGithub~=1.56->-r dev-tools/scripts/requirements.txt (line 7)) (1.13.3)
Requirement already satisfied: pycparser in /usr/local/lib/python3.8/dist-packages (from cffi>=1.4.1->pynacl>=1.4.0->PyGithub~=1.56->-r dev-tools/scripts/requirements.txt (line 7)) (2.20)
DEPRECATION: dblatex 0.3.11py3 has a non-standard version number. pip 23.3 will enforce this behaviour change. A possible replacement is to upgrade to a newer version of dblatex or contact the author to suggest that they release a version with a conforming version number. Discussion can be found at https://github.com/pypa/pip/issues/12063
DEPRECATION: devscripts 2.20.2ubuntu2 has a non-standard version number. pip 23.3 will enforce this behaviour change. A possible replacement is to upgrade to a newer version of devscripts or contact the author to suggest that they release a version with a conforming version number. Discussion can be found at https://github.com/pypa/pip/issues/12063
Starting Smoke tester in folder /home/jenkins/jenkins-slave/workspace/Solr/Solr-Smoketest-9.x
Java 11 JAVA_HOME=/home/jenkins/tools/java/latest11
NOTE: output encoding is utf-8
NOTE: Not running @Nightly or @BadApple tests. Please verify that recent Jenkins runs have passed.

Load release URL "file:///home/jenkins/jenkins-slave/workspace/Solr/Solr-Smoketest-9.x/solr/distribution/build/release"...

Get KEYS...
    Downloading online KEYS file https://archive.apache.org/dist/solr/KEYS
Downloading https://archive.apache.org/dist/solr/KEYS
    0.3 MB in 1.08 sec (0.3 MB/sec)

Test Solr...
  test basics...
  check changes HTML...
  download solr-9.4.0-slim.tgz...
Downloading file:///home/jenkins/jenkins-slave/workspace/Solr/Solr-Smoketest-9.x/solr/distribution/build/release/solr-9.4.0-slim.tgz
    59.8 MB in 0.05 sec (1292.7 MB/sec)
    verify sha512 digest
  download solr-9.4.0-src.tgz...
Downloading file:///home/jenkins/jenkins-slave/workspace/Solr/Solr-Smoketest-9.x/solr/distribution/build/release/solr-9.4.0-src.tgz
    85.9 MB in 0.07 sec (1264.1 MB/sec)
    verify sha512 digest
  download solr-9.4.0.tgz...
Downloading file:///home/jenkins/jenkins-slave/workspace/Solr/Solr-Smoketest-9.x/solr/distribution/build/release/solr-9.4.0.tgz
    264.8 MB in 0.21 sec (1271.3 MB/sec)
    verify sha512 digest
  unpack solr-9.4.0.tgz...
  solr-9.4.0.tgz
    Checking LICENSE.txt
    Checking NOTICE.txt
    Checking README.txt
    Checking CHANGES.txt
    Checking bin
    Checking modules
    Checking docker
    Checking prometheus-exporter
    Checking docs
    Checking example
    Checking licenses
    Checking server
    Checking lib
    verify JAR metadata/identity/no javax.* or java.* classes...
      **WARNING**: skipping check of /home/jenkins/jenkins-slave/workspace/Solr/Solr-Smoketest-9.x/_tmp/smoke_1694930119/unpack/solr-9.4.0/modules/extraction/lib/unit-api-1.0.jar: it has javax.* classes
      **WARNING**: skipping check of /home/jenkins/jenkins-slave/workspace/Solr/Solr-Smoketest-9.x/_tmp/smoke_1694930119/unpack/solr-9.4.0/modules/extraction/lib/jakarta.activation-1.2.2.jar: it has javax.* classes
      **WARNING**: skipping check of /home/jenkins/jenkins-slave/workspace/Solr/Solr-Smoketest-9.x/_tmp/smoke_1694930119/unpack/solr-9.4.0/server/solr-webapp/webapp/WEB-INF/lib/jakarta.inject-2.6.1.jar: it has javax.* classes
      **WARNING**: skipping check of /home/jenkins/jenkins-slave/workspace/Solr/Solr-Smoketest-9.x/_tmp/smoke_1694930119/unpack/solr-9.4.0/server/solr-webapp/webapp/WEB-INF/lib/jakarta.activation-api-1.2.2.jar: it has javax.* classes
      **WARNING**: skipping check of /home/jenkins/jenkins-slave/workspace/Solr/Solr-Smoketest-9.x/_tmp/smoke_1694930119/unpack/solr-9.4.0/server/solr-webapp/webapp/WEB-INF/lib/jakarta.validation-api-2.0.2.jar: it has javax.* classes
      **WARNING**: skipping check of /home/jenkins/jenkins-slave/workspace/Solr/Solr-Smoketest-9.x/_tmp/smoke_1694930119/unpack/solr-9.4.0/server/solr-webapp/webapp/WEB-INF/lib/jakarta.annotation-api-1.3.5.jar: it has javax.* classes
      **WARNING**: skipping check of /home/jenkins/jenkins-slave/workspace/Solr/Solr-Smoketest-9.x/_tmp/smoke_1694930119/unpack/solr-9.4.0/server/solr-webapp/webapp/WEB-INF/lib/jakarta.ws.rs-api-2.1.6.jar: it has javax.* classes
      **WARNING**: skipping check of /home/jenkins/jenkins-slave/workspace/Solr/Solr-Smoketest-9.x/_tmp/smoke_1694930119/unpack/solr-9.4.0/server/solr-webapp/webapp/WEB-INF/lib/jakarta.xml.bind-api-2.3.3.jar: it has javax.* classes
      **WARNING**: skipping check of /home/jenkins/jenkins-slave/workspace/Solr/Solr-Smoketest-9.x/_tmp/smoke_1694930119/unpack/solr-9.4.0/server/lib/ext/jetty-servlet-api-4.0.6.jar: it has javax.* classes
    copying unpacked distribution for Java 11 ...
    test solr example w/ Java 11...
      start Solr instance (log=/home/jenkins/jenkins-slave/workspace/Solr/Solr-Smoketest-9.x/_tmp/smoke_1694930119/unpack/solr-9.4.0-java11/solr-example.log)...
Sending stop command to Solr running on port 8983 ... waiting up to 180 seconds to allow Jetty process 672875 to stop gracefully.
java.net.ConnectException: Connection refused (Connection refused)
	at java.base/java.net.PlainSocketImpl.socketConnect(Native Method)
	at java.base/java.net.AbstractPlainSocketImpl.doConnect(AbstractPlainSocketImpl.java:412)
	at java.base/java.net.AbstractPlainSocketImpl.connectToAddress(AbstractPlainSocketImpl.java:255)
	at java.base/java.net.AbstractPlainSocketImpl.connect(AbstractPlainSocketImpl.java:237)
	at java.base/java.net.SocksSocketImpl.connect(SocksSocketImpl.java:392)
	at java.base/java.net.Socket.connect(Socket.java:609)
	at java.base/java.net.Socket.connect(Socket.java:558)
	at java.base/java.net.Socket.<init>(Socket.java:454)
	at java.base/java.net.Socket.<init>(Socket.java:264)
	at org.eclipse.jetty.start.Main.stop(Main.java:613)
	at org.eclipse.jetty.start.Main.stop(Main.java:589)
	at org.eclipse.jetty.start.Main.doStop(Main.java:576)
	at org.eclipse.jetty.start.Main.start(Main.java:449)
	at org.eclipse.jetty.start.Main.main(Main.java:76)

Usage: java -jar $JETTY_HOME/start.jar [options] [properties] [configs]
       java -jar $JETTY_HOME/start.jar --help  # for more information
 [|]   [/]   [-]   [\]   [|]   [/]   [-]   [\]   [|]   [/]   [-]   [\]   [|]   [/]   [-]   [\]   [|]   [/]   [-]   [\]   [|]   [/]   [-]   [\]   [|]   [/]   [-]   [\]   [|]   [/]   [-]   [\]   [|]   [/]   [-]   [\]   [|]   [/]   [-]   [\]   [|]   [/]   [-]   [\]   [|]   [/]   [-]   [\]   [|]   [/]   [-]   [\]   [|]   [/]   [-]   [\]   [|]   [/]   [-]   [\]   [|]   [/]   [-]   [\]   [|]   [/]   [-]   [\]   [|]   [/]   [-]   [\]   [|]   [/]   [-]   [\]   [|]   [/]   [-]   [\]   [|]   [/]   [-]   [\]   [|]   [/]   [-]   [\]   [|]   [/]   [-]   [\]   [|]   [/]   [-]   [\]   [|]   [/]   [-]   [\]   [|]   [/]   [-]   [\]   [|]   [/]   [-]   [\]   [|]   [/]   [-]   [\]   [|]   [/]   [-]   [\]   [|]   [/]   [-]   [\]   [|]   [/]   [-]   [\]   [|]   [/]   [-]   [\]   [|]   [/]   [-]   [\]   [|]   [/]   [-]   [\]   [|]   [/]   [-]   [\]   [|]   [/]   [-]   [\]   [|]   [/]   [-]   [\]   [|]   [/]   [-]   [\]   [|]   [/]   [-]   [\]   [|]   [/]   [-]   [\]   [|]   [/]   [-]   [\]   [|]   [/]   [-]   [\]   [|]   [/]   [-]   [\]   [|]   [/]   [-]   [\]   [|]   [/]   [-]   [\]   [|]   [/]   [-]   [\]   [|]   [/]   [-]   [\]   [|]   [/]   [-]   [\]   [|]   [/]   [-]   [\]   [|]   [/]   [-]   [\]   [|]   [/]   [-]   [\]   [|]   [/]   [-]   [\]   [|]   [/]   [-]   [\]   [|]   [/]   [-]   [\]   [|]   [/]   [-]   [\]   [|]   [/]   [-]   [\]   [|]   [/]   [-]   [\]   [|]   [/]   [-]   [\]   [|]   [/]   [-]   [\]   [|]   [/]   [-]   [\]   [|]   [/]   [-]   [\]   [|]   [/]   [-]   [\]   [|]   [/]   [-]   [\]   [|]   [/]   [-]   [\]   [|]   [/]   [-]   [\]   [|]   [/]   [-]   [\]   [|]   [/]   [-]   [\]   [|]   [/]   [-]   [\]   [|]   [/]   [-]   [\]   [|]   [/]   [-]   [\]   [|]   [/]   [-]   [\]   [|]   [/]   [-]   [\]   [|]   [/]   [-]   [\]   [|]   [/]   [-]   [\]   [|]   [/]   [-]   [\]   [|]   [/]   [-]   [\]   [|]   [/]   [-]   [\]   [|]   [/]   [-]   [\]   [|]   [/]   [-]   [\]   [|]   [/]   [-]   [\]   [|]   [/]   [-]   [\]   [|]   [/]   [-]   [\]   [|]   [/]   [-]   [\]   [|]   [/]   [-]   [\]   [|]   [/]   [-]   [\]   [|]   [/]   [-]   [\]   [|]   [/]   [-]   [\]   [|]   [/]   [-]   [\]   [|]   [/]   [-]   [\]   [|]      Solr process 672875 is still running; jstacking it now.
672875: Permission denied
Solr process 672875 is still running; forcefully killing it now.
bin/solr: line 925: kill: (672875) - Operation not permitted
Killed process 672875
ERROR: Failed to kill previous Solr Java process 672875 ... script fails.
      Running techproducts example on port 8983 from /home/jenkins/jenkins-slave/workspace/Solr/Solr-Smoketest-9.x/_tmp/smoke_1694930119/unpack/solr-9.4.0-java11
*** [WARN] *** Your open file limit is currently 60000.  
 It should be set to 65000 to avoid operational disruption. 
 If you no longer wish to see this warning, set SOLR_ULIMIT_CHECKS to false in your profile or solr.in.sh
*** [WARN] ***  Your Max Processes Limit is currently 30000. 
 It should be set to 65000 to avoid operational disruption. 
 If you no longer wish to see this warning, set SOLR_ULIMIT_CHECKS to false in your profile or solr.in.sh
Creating Solr home directory /home/jenkins/jenkins-slave/workspace/Solr/Solr-Smoketest-9.x/_tmp/smoke_1694930119/unpack/solr-9.4.0-java11/example/techproducts/solr

Starting up Solr on port 8983 using command:
"bin/solr" start -p 8983 -s "example/techproducts/solr"

*** [WARN] *** Your open file limit is currently 60000.  
 It should be set to 65000 to avoid operational disruption. 
 If you no longer wish to see this warning, set SOLR_ULIMIT_CHECKS to false in your profile or solr.in.sh
*** [WARN] ***  Your Max Processes Limit is currently 30000. 
 It should be set to 65000 to avoid operational disruption. 
 If you no longer wish to see this warning, set SOLR_ULIMIT_CHECKS to false in your profile or solr.in.sh

Port 8983 is already being used by another process (pid: 672875)
Please choose a different port using the -p option.


ERROR: Failed to start Solr using command: "bin/solr" start -p 8983 -s "example/techproducts/solr" Exception : org.apache.commons.exec.ExecuteException: Process exited with an error: 1 (Exit value: 1)

      stop server using: bin/solr stop -p 8983
Sending stop command to Solr running on port 8983 ... waiting up to 180 seconds to allow Jetty process 672875 to stop gracefully.
java.net.ConnectException: Connection refused (Connection refused)
	at java.base/java.net.PlainSocketImpl.socketConnect(Native Method)
	at java.base/java.net.AbstractPlainSocketImpl.doConnect(AbstractPlainSocketImpl.java:412)
	at java.base/java.net.AbstractPlainSocketImpl.connectToAddress(AbstractPlainSocketImpl.java:255)
	at java.base/java.net.AbstractPlainSocketImpl.connect(AbstractPlainSocketImpl.java:237)
	at java.base/java.net.SocksSocketImpl.connect(SocksSocketImpl.java:392)
	at java.base/java.net.Socket.connect(Socket.java:609)
	at java.base/java.net.Socket.connect(Socket.java:558)
	at java.base/java.net.Socket.<init>(Socket.java:454)
	at java.base/java.net.Socket.<init>(Socket.java:264)
	at org.eclipse.jetty.start.Main.stop(Main.java:613)
	at org.eclipse.jetty.start.Main.stop(Main.java:589)
	at org.eclipse.jetty.start.Main.doStop(Main.java:576)
	at org.eclipse.jetty.start.Main.start(Main.java:449)
	at org.eclipse.jetty.start.Main.main(Main.java:76)

Usage: java -jar $JETTY_HOME/start.jar [options] [properties] [configs]
       java -jar $JETTY_HOME/start.jar --help  # for more information
 [|]   [/]   [-]   [\]   [|]   [/]   [-]   [\]   [|]   [/]   [-]   [\]   [|]   [/]   [-]   [\]   [|]   [/]   [-]   [\]   [|]   [/]   [-]   [\]   [|]   [/]   [-]   [\]   [|]   [/]   [-]   [\]   [|]   [/]   [-]   [\]   [|]   [/]   [-]   [\]   [|]   [/]   [-]   [\]   [|]   [/]   [-]   [\]   [|]   [/]   [-]   [\]   [|]   [/]   [-]   [\]   [|]   [/]   [-]   [\]   [|]   [/]   [-]   [\]   [|]   [/]   [-]   [\]   [|]   [/]   [-]   [\]   [|]   [/]   [-]   [\]   [|]   [/]   [-]   [\]   [|]   [/]   [-]   [\]   [|]   [/]   [-]   [\]   [|]   [/]   [-]   [\]   [|]   [/]   [-]   [\]   [|]   [/]   [-]   [\]   [|]   [/]   [-]   [\]   [|]   [/]   [-]   [\]   [|]   [/]   [-]   [\]   [|]   [/]   [-]   [\]   [|]   [/]   [-]   [\]   [|]   [/]   [-]   [\]   [|]   [/]   [-]   [\]   [|]   [/]   [-]   [\]   [|]   [/]   [-]   [\]   [|]   [/]   [-]   [\]   [|]   [/]   [-]   [\]   [|]   [/]   [-]   [\]   [|]   [/]   [-]   [\]   [|]   [/]   [-]   [\]   [|]   [/]   [-]   [\]   [|]   [/]   [-]   [\]   [|]   [/]   [-]   [\]   [|]   [/]   [-]   [\]   [|]   [/]   [-]   [\]   [|]   [/]   [-]   [\]   [|]   [/]   [-]   [\]   [|]   [/]   [-]   [\]   [|]   [/]   [-]   [\]   [|]   [/]   [-]   [\]   [|]   [/]   [-]   [\]   [|]   [/]   [-]   [\]   [|]   [/]   [-]   [\]   [|]   [/]   [-]   [\]   [|]   [/]   [-]   [\]   [|]   [/]   [-]   [\]   [|]   [/]   [-]   [\]   [|]   [/]   [-]   [\]   [|]   [/]   [-]   [\]   [|]   [/]   [-]   [\]   [|]   [/]   [-]   [\]   [|]   [/]   [-]   [\]   [|]   [/]   [-]   [\]   [|]   [/]   [-]   [\]   [|]   [/]   [-]   [\]   [|]   [/]   [-]   [\]   [|]   [/]   [-]   [\]   [|]   [/]   [-]   [\]   [|]   [/]   [-]   [\]   [|]   [/]   [-]   [\]   [|]   [/]   [-]   [\]   [|]   [/]   [-]   [\]   [|]   [/]   [-]   [\]   [|]   [/]   [-]   [\]   [|]   [/]   [-]   [\]   [|]   [/]   [-]   [\]   [|]   [/]   [-]   [\]   [|]   [/]   [-]   [\]   [|]   [/]   [-]   [\]   [|]   [/]   [-]   [\]   [|]   [/]   [-]   [\]   [|]   [/]   [-]   [\]   [|]   [/]   [-]   [\]   [|]   [/]   [-]   [\]   [|]   [/]   [-]   [\]   [|]   [/]   [-]   [\]   [|]   [/]   [-]   [\]   [|]   [/]   [-]   [\]   [|]   [/]   [-]   [\]   [|]   [/]   [-]   [\]   [|]      Solr process 672875 is still running; jstacking it now.
672875: Permission denied
Solr process 672875 is still running; forcefully killing it now.
bin/solr: line 925: kill: (672875) - Operation not permitted
Killed process 672875
ERROR: Failed to kill previous Solr Java process 672875 ... script fails.
Traceback (most recent call last):
  File "dev-tools/scripts/smokeTestRelease.py", line 1174, in <module>
    main()
  File "dev-tools/scripts/smokeTestRelease.py", line 1100, in main
    smokeTest(c.java, c.url, c.revision, c.version, c.tmp_dir, c.is_signed, c.local_keys, ' '.join(c.test_args),
  File "dev-tools/scripts/smokeTestRelease.py", line 1160, in smokeTest
    unpackAndVerify(java, tmpDir, 'solr-%s.tgz' % version, gitRevision, version, testArgs)
  File "dev-tools/scripts/smokeTestRelease.py", line 553, in unpackAndVerify
    verifyUnpacked(java, artifact, unpackPath, gitRevision, version, testArgs)
  File "dev-tools/scripts/smokeTestRelease.py", line 671, in verifyUnpacked
    testSolrExample(java11UnpackPath, java.java11_home)
  File "dev-tools/scripts/smokeTestRelease.py", line 752, in testSolrExample
    raise RuntimeError('Failed to run the techproducts example, check log for previous errors.')
RuntimeError: Failed to run the techproducts example, check log for previous errors.
Build step 'Run with timeout' marked build as failure
Email was triggered for: Failure - Any
Sending email for trigger: Failure - Any

[JENKINS] Solr ยป Solr-Smoketest-9.x - Build # 183 - Still Failing!

Posted by Apache Jenkins Server <je...@builds.apache.org>.
Build: https://ci-builds.apache.org/job/Solr/job/Solr-Smoketest-9.x/183/

Log: 
Started by timer
Running as SYSTEM
[EnvInject] - Loading node environment variables.
Building remotely on lucene-solr-2 (solr lucene) in workspace /home/jenkins/jenkins-slave/workspace/Solr/Solr-Smoketest-9.x
The recommended git tool is: NONE
No credentials specified
 > git rev-parse --resolve-git-dir /home/jenkins/jenkins-slave/workspace/Solr/Solr-Smoketest-9.x/.git # timeout=10
Fetching changes from the remote Git repository
 > git config remote.origin.url https://github.com/apache/solr.git # timeout=10
Cleaning workspace
 > git rev-parse --verify HEAD # timeout=10
Resetting working tree
 > git reset --hard # timeout=10
 > git clean -fdx # timeout=10
Fetching upstream changes from https://github.com/apache/solr.git
 > git --version # timeout=10
 > git --version # 'git version 2.25.1'
 > git fetch --tags --force --progress -- https://github.com/apache/solr.git +refs/heads/*:refs/remotes/origin/* # timeout=10
 > git rev-parse origin/branch_9x^{commit} # timeout=10
Checking out Revision a9cbf2c7faf543faa47eaf53129a1c8567f16cf5 (origin/branch_9x)
 > git config core.sparsecheckout # timeout=10
 > git checkout -f a9cbf2c7faf543faa47eaf53129a1c8567f16cf5 # timeout=10
Commit message: "QueryElevationComponent: declare some methods as protected (#1901)"
 > git rev-list --no-walk 16239193dd52ec860ef76a0b02631d6cbec53a0b # timeout=10
No emails were triggered.
provisioning config files...
copy managed file [gradle.properties] to file:/home/jenkins/jenkins-slave/workspace/Solr/Solr-Smoketest-9.x/gradle.properties
[Gradle] - Launching build.
[Solr-Smoketest-9.x] $ /home/jenkins/jenkins-slave/workspace/Solr/Solr-Smoketest-9.x/gradlew -Dversion.suffix= -Dgradle.user.home=/home/jenkins/jenkins-slave/workspace/Solr/.gradle -Porg.gradle.daemon=false -Pvalidation.git.failOnModified=false --continue -x signJarsPublication clean assembleRelease
Downloading gradle-wrapper.jar from https://raw.githubusercontent.com/gradle/gradle/v7.6.0/gradle/wrapper/gradle-wrapper.jar
To honour the JVM settings for this build a single-use Daemon process will be forked. See https://docs.gradle.org/7.6/userguide/gradle_daemon.html#sec:disabling_the_daemon.
Daemon will be stopped at the end of the build 
> Task :buildSrc:compileJava
> Task :buildSrc:compileGroovy NO-SOURCE
> Task :buildSrc:processResources NO-SOURCE
> Task :buildSrc:classes
> Task :buildSrc:jar
> Task :buildSrc:assemble
> Task :buildSrc:compileTestJava NO-SOURCE
> Task :buildSrc:compileTestGroovy NO-SOURCE
> Task :buildSrc:processTestResources NO-SOURCE
> Task :buildSrc:testClasses UP-TO-DATE
> Task :buildSrc:test NO-SOURCE
> Task :buildSrc:check UP-TO-DATE
> Task :buildSrc:build
> Task :clean
> Task :solr:clean UP-TO-DATE
> Task :solr:api:clean
> Task :solr:benchmark:clean
> Task :solr:core:clean
> Task :solr:distribution:clean UP-TO-DATE
> Task :solr:docker:clean UP-TO-DATE
> Task :solr:documentation:clean UP-TO-DATE
> Task :solr:example:clean UP-TO-DATE
> Task :solr:modules:clean UP-TO-DATE
> Task :solr:packaging:clean UP-TO-DATE
> Task :solr:prometheus-exporter:clean
> Task :solr:server:clean
> Task :solr:solr-ref-guide:clean
> Task :solr:solrj:clean
> Task :solr:solrj-streaming:clean
> Task :solr:solrj-zookeeper:clean
> Task :solr:test-framework:clean
> Task :solr:webapp:clean
> Task :solr:modules:analysis-extras:clean
> Task :solr:modules:analytics:clean
> Task :solr:modules:clustering:clean
> Task :solr:modules:extraction:clean
> Task :solr:modules:gcs-repository:clean
> Task :solr:modules:hadoop-auth:clean
> Task :solr:modules:hdfs:clean
> Task :solr:modules:jaegertracer-configurator:clean
> Task :solr:modules:jwt-auth:clean
> Task :solr:modules:langid:clean
> Task :solr:modules:ltr:clean
> Task :solr:modules:opentelemetry:clean
> Task :solr:modules:s3-repository:clean
> Task :solr:modules:scripting:clean
> Task :solr:modules:sql:clean
> Task :mavenLocalClean UP-TO-DATE
> Task :solr-missing-doclet:compileJava
> Task :solr-missing-doclet:processResources NO-SOURCE
> Task :solr-missing-doclet:classes
> Task :solr-missing-doclet:jar
> Task :gitStatus
> Task :checkJdkInternalsExportedToGradle
> Task :solr:api:compileJava
> Task :solr:api:processResources NO-SOURCE
> Task :solr:api:classes
> Task :solr:api:jar
> Task :solr:api:generateMetadataFileForJarsPublication SKIPPED
> Task :solr:api:generatePomFileForJarsPublication
> Task :solr:api:renderJavadoc
> Task :solr:api:javadoc SKIPPED
> Task :solr:api:javadocJar
> Task :solr:api:sourcesJar
> Task :solr:api:publishJarsPublicationToBuildRepository

> Task :solr:api:resolve
SLF4J: No SLF4J providers were found.
SLF4J: Defaulting to no-operation (NOP) logger implementation
SLF4J: See https://www.slf4j.org/codes.html#noProviders for further details.

> Task :solr:solrj:openApiGenerate
################################################################################
# Thanks for using OpenAPI Generator.                                          #
# Please consider donation to help us maintain this project ๐Ÿ™                 #
# https://opencollective.com/openapi_generator/donate                          #
################################################################################
Successfully generated code to /home/jenkins/jenkins-slave/workspace/Solr/Solr-Smoketest-9.x/solr/solrj/build/generated/

> Task :spotlessInternalRegisterDependencies
> Task :solr:solrj:generatedSpotlessHelper
> Task :solr:solrj:generatedSpotless

> Task :solr:solrj:compileJava
Note: Some input files use or override a deprecated API.
Note: Recompile with -Xlint:deprecation for details.

> Task :solr:solrj-streaming:compileJava
Note: Some input files use or override a deprecated API.
Note: Recompile with -Xlint:deprecation for details.

> Task :solr:solrj-zookeeper:compileJava
Note: Some input files use or override a deprecated API.
Note: Recompile with -Xlint:deprecation for details.

> Task :solr:core:compileJava
Note: Some input files use or override a deprecated API.
Note: Recompile with -Xlint:deprecation for details.

> Task :solr:core:processResources
> Task :solr:core:classes
> Task :solr:core:jar
> Task :solr:core:generateMetadataFileForJarsPublication SKIPPED
> Task :solr:core:generatePomFileForJarsPublication
> Task :solr:solrj:renderJavadoc
> Task :solr:solrj-streaming:renderJavadoc
> Task :solr:solrj-zookeeper:renderJavadoc
> Task :solr:core:renderJavadoc
> Task :solr:core:javadoc SKIPPED
> Task :solr:core:javadocJar
> Task :solr:core:sourcesJar
> Task :solr:core:publishJarsPublicationToBuildRepository

> Task :solr:prometheus-exporter:compileJava
Note: Some input files use or override a deprecated API.
Note: Recompile with -Xlint:deprecation for details.

> Task :solr:prometheus-exporter:processResources NO-SOURCE
> Task :solr:prometheus-exporter:classes
> Task :solr:prometheus-exporter:jar
> Task :solr:prometheus-exporter:generateMetadataFileForJarsPublication SKIPPED
> Task :solr:prometheus-exporter:generatePomFileForJarsPublication
> Task :solr:prometheus-exporter:renderJavadoc
> Task :solr:prometheus-exporter:javadoc SKIPPED
> Task :solr:prometheus-exporter:javadocJar
> Task :solr:prometheus-exporter:sourcesJar
> Task :solr:prometheus-exporter:publishJarsPublicationToBuildRepository
> Task :solr:solrj:processResources
> Task :solr:solrj:classes
> Task :solr:solrj:jar
> Task :solr:solrj:generateMetadataFileForJarsPublication SKIPPED
> Task :solr:solrj:generatePomFileForJarsPublication
> Task :solr:solrj:javadoc SKIPPED
> Task :solr:solrj:javadocJar
> Task :solr:solrj:sourcesJar
> Task :solr:solrj:publishJarsPublicationToBuildRepository
> Task :solr:solrj-streaming:processResources
> Task :solr:solrj-streaming:classes
> Task :solr:solrj-streaming:jar
> Task :solr:solrj-streaming:generateMetadataFileForJarsPublication SKIPPED
> Task :solr:solrj-streaming:generatePomFileForJarsPublication
> Task :solr:solrj-streaming:javadoc SKIPPED
> Task :solr:solrj-streaming:javadocJar
> Task :solr:solrj-streaming:sourcesJar
> Task :solr:solrj-streaming:publishJarsPublicationToBuildRepository
> Task :solr:solrj-zookeeper:processResources NO-SOURCE
> Task :solr:solrj-zookeeper:classes
> Task :solr:solrj-zookeeper:jar
> Task :solr:solrj-zookeeper:generateMetadataFileForJarsPublication SKIPPED
> Task :solr:solrj-zookeeper:generatePomFileForJarsPublication
> Task :solr:solrj-zookeeper:javadoc SKIPPED
> Task :solr:solrj-zookeeper:javadocJar
> Task :solr:solrj-zookeeper:sourcesJar
> Task :solr:solrj-zookeeper:publishJarsPublicationToBuildRepository

> Task :solr:test-framework:compileJava
Note: Some input files use or override a deprecated API.
Note: Recompile with -Xlint:deprecation for details.

> Task :solr:test-framework:processResources
> Task :solr:test-framework:classes
> Task :solr:test-framework:jar
> Task :solr:test-framework:generateMetadataFileForJarsPublication SKIPPED
> Task :solr:test-framework:generatePomFileForJarsPublication
> Task :solr:test-framework:renderJavadoc
> Task :solr:test-framework:javadoc SKIPPED
> Task :solr:test-framework:javadocJar
> Task :solr:test-framework:sourcesJar
> Task :solr:test-framework:publishJarsPublicationToBuildRepository

> Task :solr:modules:analysis-extras:compileJava
Note: /home/jenkins/jenkins-slave/workspace/Solr/Solr-Smoketest-9.x/solr/modules/analysis-extras/src/java/org/apache/solr/schema/ICUCollationField.java uses or overrides a deprecated API.
Note: Recompile with -Xlint:deprecation for details.

> Task :solr:modules:analysis-extras:processResources NO-SOURCE
> Task :solr:modules:analysis-extras:classes
> Task :solr:modules:analysis-extras:jar
> Task :solr:modules:analysis-extras:generateMetadataFileForJarsPublication SKIPPED
> Task :solr:modules:analysis-extras:generatePomFileForJarsPublication
> Task :solr:modules:analysis-extras:renderJavadoc
> Task :solr:modules:analysis-extras:javadoc SKIPPED
> Task :solr:modules:analysis-extras:javadocJar
> Task :solr:modules:analysis-extras:sourcesJar
> Task :solr:modules:analysis-extras:publishJarsPublicationToBuildRepository

> Task :solr:modules:analytics:compileJava
Note: Some input files use or override a deprecated API.
Note: Recompile with -Xlint:deprecation for details.

> Task :solr:modules:analytics:processResources NO-SOURCE
> Task :solr:modules:analytics:classes
> Task :solr:modules:analytics:jar
> Task :solr:modules:analytics:generateMetadataFileForJarsPublication SKIPPED
> Task :solr:modules:analytics:generatePomFileForJarsPublication
> Task :solr:modules:analytics:renderJavadoc
> Task :solr:modules:analytics:javadoc SKIPPED
> Task :solr:modules:analytics:javadocJar
> Task :solr:modules:analytics:sourcesJar
> Task :solr:modules:analytics:publishJarsPublicationToBuildRepository
> Task :solr:modules:clustering:compileJava
> Task :solr:modules:clustering:processResources NO-SOURCE
> Task :solr:modules:clustering:classes
> Task :solr:modules:clustering:jar
> Task :solr:modules:clustering:generateMetadataFileForJarsPublication SKIPPED
> Task :solr:modules:clustering:generatePomFileForJarsPublication
> Task :solr:modules:clustering:renderJavadoc
> Task :solr:modules:clustering:javadoc SKIPPED
> Task :solr:modules:clustering:javadocJar
> Task :solr:modules:clustering:sourcesJar
> Task :solr:modules:clustering:publishJarsPublicationToBuildRepository

> Task :solr:modules:extraction:compileJava
Note: /home/jenkins/jenkins-slave/workspace/Solr/Solr-Smoketest-9.x/solr/modules/extraction/src/java/org/apache/solr/handler/extraction/ExtractingDocumentLoader.java uses or overrides a deprecated API.
Note: Recompile with -Xlint:deprecation for details.

> Task :solr:modules:extraction:processResources
> Task :solr:modules:extraction:classes
> Task :solr:modules:extraction:jar
> Task :solr:modules:extraction:generateMetadataFileForJarsPublication SKIPPED
> Task :solr:modules:extraction:generatePomFileForJarsPublication
> Task :solr:modules:extraction:renderJavadoc
> Task :solr:modules:extraction:javadoc SKIPPED
> Task :solr:modules:extraction:javadocJar
> Task :solr:modules:extraction:sourcesJar
> Task :solr:modules:extraction:publishJarsPublicationToBuildRepository

> Task :solr:modules:gcs-repository:compileJava
Note: /home/jenkins/jenkins-slave/workspace/Solr/Solr-Smoketest-9.x/solr/modules/gcs-repository/src/java/org/apache/solr/gcs/GCSConfigParser.java uses or overrides a deprecated API.
Note: Recompile with -Xlint:deprecation for details.

> Task :solr:modules:gcs-repository:processResources NO-SOURCE
> Task :solr:modules:gcs-repository:classes
> Task :solr:modules:gcs-repository:jar
> Task :solr:modules:gcs-repository:generateMetadataFileForJarsPublication SKIPPED
> Task :solr:modules:gcs-repository:generatePomFileForJarsPublication
> Task :solr:modules:gcs-repository:renderJavadoc
> Task :solr:modules:gcs-repository:javadoc SKIPPED
> Task :solr:modules:gcs-repository:javadocJar
> Task :solr:modules:gcs-repository:sourcesJar
> Task :solr:modules:gcs-repository:publishJarsPublicationToBuildRepository

> Task :solr:modules:hadoop-auth:compileJava
Note: Some input files use or override a deprecated API.
Note: Recompile with -Xlint:deprecation for details.

> Task :solr:modules:hadoop-auth:processResources NO-SOURCE
> Task :solr:modules:hadoop-auth:classes
> Task :solr:modules:hadoop-auth:jar
> Task :solr:modules:hadoop-auth:generateMetadataFileForJarsPublication SKIPPED
> Task :solr:modules:hadoop-auth:generatePomFileForJarsPublication
> Task :solr:modules:hadoop-auth:renderJavadoc
> Task :solr:modules:hadoop-auth:javadoc SKIPPED
> Task :solr:modules:hadoop-auth:javadocJar
> Task :solr:modules:hadoop-auth:sourcesJar
> Task :solr:modules:hadoop-auth:publishJarsPublicationToBuildRepository

> Task :solr:modules:hdfs:compileJava
Note: Some input files use or override a deprecated API.
Note: Recompile with -Xlint:deprecation for details.

> Task :solr:modules:hdfs:processResources NO-SOURCE
> Task :solr:modules:hdfs:classes
> Task :solr:modules:hdfs:jar
> Task :solr:modules:hdfs:generateMetadataFileForJarsPublication SKIPPED
> Task :solr:modules:hdfs:generatePomFileForJarsPublication
> Task :solr:modules:hdfs:renderJavadoc
> Task :solr:modules:hdfs:javadoc SKIPPED
> Task :solr:modules:hdfs:javadocJar
> Task :solr:modules:hdfs:sourcesJar
> Task :solr:modules:hdfs:publishJarsPublicationToBuildRepository
> Task :solr:modules:jaegertracer-configurator:compileJava
> Task :solr:modules:jaegertracer-configurator:processResources NO-SOURCE
> Task :solr:modules:jaegertracer-configurator:classes
> Task :solr:modules:jaegertracer-configurator:jar
> Task :solr:modules:jaegertracer-configurator:generateMetadataFileForJarsPublication SKIPPED
> Task :solr:modules:jaegertracer-configurator:generatePomFileForJarsPublication
> Task :solr:modules:jaegertracer-configurator:renderJavadoc
> Task :solr:modules:jaegertracer-configurator:javadoc SKIPPED
> Task :solr:modules:jaegertracer-configurator:javadocJar
> Task :solr:modules:jaegertracer-configurator:sourcesJar
> Task :solr:modules:jaegertracer-configurator:publishJarsPublicationToBuildRepository

> Task :solr:modules:jwt-auth:compileJava
Note: /home/jenkins/jenkins-slave/workspace/Solr/Solr-Smoketest-9.x/solr/modules/jwt-auth/src/java/org/apache/solr/security/jwt/JWTAuthPlugin.java uses or overrides a deprecated API.
Note: Recompile with -Xlint:deprecation for details.

> Task :solr:modules:jwt-auth:processResources NO-SOURCE
> Task :solr:modules:jwt-auth:classes
> Task :solr:modules:jwt-auth:jar
> Task :solr:modules:jwt-auth:generateMetadataFileForJarsPublication SKIPPED
> Task :solr:modules:jwt-auth:generatePomFileForJarsPublication
> Task :solr:modules:jwt-auth:renderJavadoc
> Task :solr:modules:jwt-auth:javadoc SKIPPED
> Task :solr:modules:jwt-auth:javadocJar
> Task :solr:modules:jwt-auth:sourcesJar
> Task :solr:modules:jwt-auth:publishJarsPublicationToBuildRepository

> Task :solr:modules:langid:compileJava
Note: Some input files use or override a deprecated API.
Note: Recompile with -Xlint:deprecation for details.

> Task :solr:modules:langid:processResources
> Task :solr:modules:langid:classes
> Task :solr:modules:langid:jar
> Task :solr:modules:langid:generateMetadataFileForJarsPublication SKIPPED
> Task :solr:modules:langid:generatePomFileForJarsPublication
> Task :solr:modules:langid:renderJavadoc
> Task :solr:modules:langid:javadoc SKIPPED
> Task :solr:modules:langid:javadocJar
> Task :solr:modules:langid:sourcesJar
> Task :solr:modules:langid:publishJarsPublicationToBuildRepository

> Task :solr:modules:ltr:compileJava
Note: Some input files use or override a deprecated API.
Note: Recompile with -Xlint:deprecation for details.

> Task :solr:modules:ltr:processResources NO-SOURCE
> Task :solr:modules:ltr:classes
> Task :solr:modules:ltr:jar
> Task :solr:modules:ltr:generateMetadataFileForJarsPublication SKIPPED
> Task :solr:modules:ltr:generatePomFileForJarsPublication
> Task :solr:modules:ltr:renderJavadoc
> Task :solr:modules:ltr:javadoc SKIPPED
> Task :solr:modules:ltr:javadocJar
> Task :solr:modules:ltr:sourcesJar
> Task :solr:modules:ltr:publishJarsPublicationToBuildRepository
> Task :solr:modules:opentelemetry:compileJava
> Task :solr:modules:opentelemetry:processResources NO-SOURCE
> Task :solr:modules:opentelemetry:classes
> Task :solr:modules:opentelemetry:jar
> Task :solr:modules:opentelemetry:generateMetadataFileForJarsPublication SKIPPED
> Task :solr:modules:opentelemetry:generatePomFileForJarsPublication
> Task :solr:modules:opentelemetry:renderJavadoc
> Task :solr:modules:opentelemetry:javadoc SKIPPED
> Task :solr:modules:opentelemetry:javadocJar
> Task :solr:modules:opentelemetry:sourcesJar
> Task :solr:modules:opentelemetry:publishJarsPublicationToBuildRepository
> Task :solr:modules:s3-repository:compileJava
> Task :solr:modules:s3-repository:processResources NO-SOURCE
> Task :solr:modules:s3-repository:classes
> Task :solr:modules:s3-repository:jar
> Task :solr:modules:s3-repository:generateMetadataFileForJarsPublication SKIPPED
> Task :solr:modules:s3-repository:generatePomFileForJarsPublication
> Task :solr:modules:s3-repository:renderJavadoc
> Task :solr:modules:s3-repository:javadoc SKIPPED
> Task :solr:modules:s3-repository:javadocJar
> Task :solr:modules:s3-repository:sourcesJar
> Task :solr:modules:s3-repository:publishJarsPublicationToBuildRepository

> Task :solr:modules:scripting:compileJava
Note: /home/jenkins/jenkins-slave/workspace/Solr/Solr-Smoketest-9.x/solr/modules/scripting/src/java/org/apache/solr/scripting/xslt/XSLTUpdateRequestHandler.java uses or overrides a deprecated API.
Note: Recompile with -Xlint:deprecation for details.

> Task :solr:modules:scripting:processResources NO-SOURCE
> Task :solr:modules:scripting:classes
> Task :solr:modules:scripting:jar
> Task :solr:modules:scripting:generateMetadataFileForJarsPublication SKIPPED
> Task :solr:modules:scripting:generatePomFileForJarsPublication
> Task :solr:modules:scripting:renderJavadoc
> Task :solr:modules:scripting:javadoc SKIPPED
> Task :solr:modules:scripting:javadocJar
> Task :solr:modules:scripting:sourcesJar
> Task :solr:modules:scripting:publishJarsPublicationToBuildRepository

> Task :solr:modules:sql:compileJava
Note: Some input files use or override a deprecated API.
Note: Recompile with -Xlint:deprecation for details.

> Task :solr:modules:sql:processResources
> Task :solr:modules:sql:classes
> Task :solr:modules:sql:jar
> Task :solr:modules:sql:generateMetadataFileForJarsPublication SKIPPED
> Task :solr:modules:sql:generatePomFileForJarsPublication
> Task :solr:modules:sql:renderJavadoc
> Task :solr:modules:sql:javadoc SKIPPED
> Task :solr:modules:sql:javadocJar
> Task :solr:modules:sql:sourcesJar
> Task :solr:modules:sql:publishJarsPublicationToBuildRepository

> Task :mavenToLocalFolder
Local maven artifacts (poms, jars) created at: /home/jenkins/jenkins-slave/workspace/Solr/Solr-Smoketest-9.x/build/maven-local

> Task :checkWorkingCopyClean
> Task :solr:distribution:assembleSourceTgz
> Task :solr:docker:createBodySnippetDockerfile
> Task :solr:docker:createDockerfileLocal
> Task :solr:docker:assemblePackaging
> Task :solr:documentation:changesToHtml
> Task :solr:documentation:copyDocumentationAssets
> Task :solr:documentation:markdownToHtml
> Task :solr:documentation:copyChangesToHtmlForMiniSite
> Task :solr:documentation:copyMiniDocumentationAssets
> Task :solr:documentation:createMiniDocumentationIndex
> Task :solr:documentation:documentationMinimal
> Task :solr:core:assemblePostJar
> Task :solr:example:assemblePackaging
> Task :solr:prometheus-exporter:assemblePackaging
> Task :solr:webapp:compileJava NO-SOURCE
> Task :solr:webapp:processResources NO-SOURCE
> Task :solr:webapp:classes UP-TO-DATE
> Task :solr:webapp:war
> Task :solr:server:assemblePackaging
> Task :solr:modules:analysis-extras:assemblePackaging
> Task :solr:modules:analytics:assemblePackaging
> Task :solr:modules:clustering:assemblePackaging
> Task :solr:modules:extraction:assemblePackaging
> Task :solr:modules:gcs-repository:assemblePackaging
> Task :solr:modules:hadoop-auth:assemblePackaging
> Task :solr:modules:hdfs:assemblePackaging
> Task :solr:modules:jaegertracer-configurator:assemblePackaging
> Task :solr:modules:jwt-auth:assemblePackaging
> Task :solr:modules:langid:assemblePackaging
> Task :solr:modules:ltr:assemblePackaging
> Task :solr:modules:opentelemetry:assemblePackaging
> Task :solr:modules:s3-repository:assemblePackaging
> Task :solr:modules:scripting:assemblePackaging
> Task :solr:modules:sql:assemblePackaging
> Task :solr:packaging:fullDistTar
> Task :solr:packaging:slimDistTar
> Task :solr:distribution:computeChecksums
> Task :solr:distribution:prepareGitRev
> Task :solr:docker:createDockerfileOfficialFull
> Task :solr:docker:createDockerfileOfficialSlim
> Task :solr:distribution:assembleRelease

Deprecated Gradle features were used in this build, making it incompatible with Gradle 8.0.

You can use '--warning-mode all' to show the individual deprecation warnings and determine if they come from your own scripts or plugins.

See https://docs.gradle.org/7.6/userguide/command_line_interface.html#sec:command_line_warnings

BUILD SUCCESSFUL in 4m 33s
246 actionable tasks: 238 executed, 8 up-to-date
Build step 'Invoke Gradle script' changed build result to SUCCESS
Run condition [Always] enabling perform for step [Execute shell]
[Solr-Smoketest-9.x] $ /bin/bash /tmp/jenkins8771239299441880635.sh
Installing Python script requirements
Defaulting to user installation because normal site-packages is not writeable
Requirement already satisfied: six~=1.16.0 in /home/jenkins/.local/lib/python3.8/site-packages (from -r dev-tools/scripts/requirements.txt (line 1)) (1.16.0)
Requirement already satisfied: Jinja2~=3.1.1 in /home/jenkins/.local/lib/python3.8/site-packages (from -r dev-tools/scripts/requirements.txt (line 2)) (3.1.2)
Requirement already satisfied: PyYAML~=6.0 in /home/jenkins/.local/lib/python3.8/site-packages (from -r dev-tools/scripts/requirements.txt (line 3)) (6.0)
Requirement already satisfied: holidays~=0.16 in /home/jenkins/.local/lib/python3.8/site-packages (from -r dev-tools/scripts/requirements.txt (line 4)) (0.21)
Requirement already satisfied: ics~=0.7.2 in /home/jenkins/.local/lib/python3.8/site-packages (from -r dev-tools/scripts/requirements.txt (line 5)) (0.7.2)
Requirement already satisfied: console-menu~=0.7.1 in /home/jenkins/.local/lib/python3.8/site-packages (from -r dev-tools/scripts/requirements.txt (line 6)) (0.7.1)
Requirement already satisfied: PyGithub~=1.56 in /home/jenkins/.local/lib/python3.8/site-packages (from -r dev-tools/scripts/requirements.txt (line 7)) (1.58.0)
Requirement already satisfied: jira~=3.4.1 in /home/jenkins/.local/lib/python3.8/site-packages (from -r dev-tools/scripts/requirements.txt (line 8)) (3.4.1)
Requirement already satisfied: MarkupSafe>=2.0 in /home/jenkins/.local/lib/python3.8/site-packages (from Jinja2~=3.1.1->-r dev-tools/scripts/requirements.txt (line 2)) (2.1.2)
Requirement already satisfied: PyMeeus in /home/jenkins/.local/lib/python3.8/site-packages (from holidays~=0.16->-r dev-tools/scripts/requirements.txt (line 4)) (0.5.11)
Requirement already satisfied: convertdate>=2.3.0 in /home/jenkins/.local/lib/python3.8/site-packages (from holidays~=0.16->-r dev-tools/scripts/requirements.txt (line 4)) (2.4.0)
Requirement already satisfied: hijri-converter in /home/jenkins/.local/lib/python3.8/site-packages (from holidays~=0.16->-r dev-tools/scripts/requirements.txt (line 4)) (2.2.3)
Requirement already satisfied: korean-lunar-calendar in /home/jenkins/.local/lib/python3.8/site-packages (from holidays~=0.16->-r dev-tools/scripts/requirements.txt (line 4)) (0.2.1)
Requirement already satisfied: python-dateutil in /usr/lib/python3/dist-packages (from holidays~=0.16->-r dev-tools/scripts/requirements.txt (line 4)) (2.7.3)
Requirement already satisfied: backports.zoneinfo in /home/jenkins/.local/lib/python3.8/site-packages (from holidays~=0.16->-r dev-tools/scripts/requirements.txt (line 4)) (0.2.1)
Requirement already satisfied: arrow>=0.11 in /home/jenkins/.local/lib/python3.8/site-packages (from ics~=0.7.2->-r dev-tools/scripts/requirements.txt (line 5)) (0.14.7)
Requirement already satisfied: tatsu>4.2 in /home/jenkins/.local/lib/python3.8/site-packages (from ics~=0.7.2->-r dev-tools/scripts/requirements.txt (line 5)) (5.6.1)
Requirement already satisfied: attrs>=19.1.0 in /usr/lib/python3/dist-packages (from ics~=0.7.2->-r dev-tools/scripts/requirements.txt (line 5)) (19.3.0)
Requirement already satisfied: ansiwrap in /home/jenkins/.local/lib/python3.8/site-packages (from console-menu~=0.7.1->-r dev-tools/scripts/requirements.txt (line 6)) (0.8.4)
Requirement already satisfied: deprecated in /home/jenkins/.local/lib/python3.8/site-packages (from PyGithub~=1.56->-r dev-tools/scripts/requirements.txt (line 7)) (1.2.13)
Requirement already satisfied: pyjwt>=2.4.0 in /home/jenkins/.local/lib/python3.8/site-packages (from PyGithub~=1.56->-r dev-tools/scripts/requirements.txt (line 7)) (2.6.0)
Requirement already satisfied: pynacl>=1.4.0 in /home/jenkins/.local/lib/python3.8/site-packages (from PyGithub~=1.56->-r dev-tools/scripts/requirements.txt (line 7)) (1.5.0)
Requirement already satisfied: requests>=2.14.0 in /usr/lib/python3/dist-packages (from PyGithub~=1.56->-r dev-tools/scripts/requirements.txt (line 7)) (2.22.0)
Requirement already satisfied: defusedxml in /home/jenkins/.local/lib/python3.8/site-packages (from jira~=3.4.1->-r dev-tools/scripts/requirements.txt (line 8)) (0.7.1)
Requirement already satisfied: packaging in /home/jenkins/.local/lib/python3.8/site-packages (from jira~=3.4.1->-r dev-tools/scripts/requirements.txt (line 8)) (23.0)
Requirement already satisfied: requests-oauthlib>=1.1.0 in /home/jenkins/.local/lib/python3.8/site-packages (from jira~=3.4.1->-r dev-tools/scripts/requirements.txt (line 8)) (1.3.1)
Requirement already satisfied: requests-toolbelt in /home/jenkins/.local/lib/python3.8/site-packages (from jira~=3.4.1->-r dev-tools/scripts/requirements.txt (line 8)) (0.9.1)
Requirement already satisfied: typing-extensions>=3.7.4.2 in /home/jenkins/.local/lib/python3.8/site-packages (from jira~=3.4.1->-r dev-tools/scripts/requirements.txt (line 8)) (4.5.0)
Requirement already satisfied: cffi>=1.4.1 in /usr/local/lib/python3.8/dist-packages (from pynacl>=1.4.0->PyGithub~=1.56->-r dev-tools/scripts/requirements.txt (line 7)) (1.14.2)
Requirement already satisfied: oauthlib>=3.0.0 in /usr/lib/python3/dist-packages (from requests-oauthlib>=1.1.0->jira~=3.4.1->-r dev-tools/scripts/requirements.txt (line 8)) (3.1.0)
Requirement already satisfied: textwrap3>=0.9.2 in /home/jenkins/.local/lib/python3.8/site-packages (from ansiwrap->console-menu~=0.7.1->-r dev-tools/scripts/requirements.txt (line 6)) (0.9.2)
Requirement already satisfied: wrapt<2,>=1.10 in /home/jenkins/.local/lib/python3.8/site-packages (from deprecated->PyGithub~=1.56->-r dev-tools/scripts/requirements.txt (line 7)) (1.13.3)
Requirement already satisfied: pycparser in /usr/local/lib/python3.8/dist-packages (from cffi>=1.4.1->pynacl>=1.4.0->PyGithub~=1.56->-r dev-tools/scripts/requirements.txt (line 7)) (2.20)
DEPRECATION: dblatex 0.3.11py3 has a non-standard version number. pip 23.3 will enforce this behaviour change. A possible replacement is to upgrade to a newer version of dblatex or contact the author to suggest that they release a version with a conforming version number. Discussion can be found at https://github.com/pypa/pip/issues/12063
DEPRECATION: devscripts 2.20.2ubuntu2 has a non-standard version number. pip 23.3 will enforce this behaviour change. A possible replacement is to upgrade to a newer version of devscripts or contact the author to suggest that they release a version with a conforming version number. Discussion can be found at https://github.com/pypa/pip/issues/12063
Starting Smoke tester in folder /home/jenkins/jenkins-slave/workspace/Solr/Solr-Smoketest-9.x
Java 11 JAVA_HOME=/home/jenkins/tools/java/latest11
NOTE: output encoding is utf-8
NOTE: Not running @Nightly or @BadApple tests. Please verify that recent Jenkins runs have passed.

Load release URL "file:///home/jenkins/jenkins-slave/workspace/Solr/Solr-Smoketest-9.x/solr/distribution/build/release"...

Get KEYS...
    Downloading online KEYS file https://archive.apache.org/dist/solr/KEYS
Downloading https://archive.apache.org/dist/solr/KEYS
    0.3 MB in 1.20 sec (0.2 MB/sec)

Test Solr...
  test basics...
  check changes HTML...
  download solr-9.4.0-slim.tgz...
Downloading file:///home/jenkins/jenkins-slave/workspace/Solr/Solr-Smoketest-9.x/solr/distribution/build/release/solr-9.4.0-slim.tgz
    59.8 MB in 0.05 sec (1160.0 MB/sec)
    verify sha512 digest
  download solr-9.4.0-src.tgz...
Downloading file:///home/jenkins/jenkins-slave/workspace/Solr/Solr-Smoketest-9.x/solr/distribution/build/release/solr-9.4.0-src.tgz
    85.9 MB in 0.08 sec (1060.2 MB/sec)
    verify sha512 digest
  download solr-9.4.0.tgz...
Downloading file:///home/jenkins/jenkins-slave/workspace/Solr/Solr-Smoketest-9.x/solr/distribution/build/release/solr-9.4.0.tgz
    264.8 MB in 0.24 sec (1089.5 MB/sec)
    verify sha512 digest
  unpack solr-9.4.0.tgz...
  solr-9.4.0.tgz
    Checking LICENSE.txt
    Checking NOTICE.txt
    Checking README.txt
    Checking CHANGES.txt
    Checking bin
    Checking modules
    Checking docker
    Checking prometheus-exporter
    Checking docs
    Checking example
    Checking licenses
    Checking server
    Checking lib
    verify JAR metadata/identity/no javax.* or java.* classes...
      **WARNING**: skipping check of /home/jenkins/jenkins-slave/workspace/Solr/Solr-Smoketest-9.x/_tmp/smoke_1695188300/unpack/solr-9.4.0/modules/extraction/lib/unit-api-1.0.jar: it has javax.* classes
      **WARNING**: skipping check of /home/jenkins/jenkins-slave/workspace/Solr/Solr-Smoketest-9.x/_tmp/smoke_1695188300/unpack/solr-9.4.0/modules/extraction/lib/jakarta.activation-1.2.2.jar: it has javax.* classes
      **WARNING**: skipping check of /home/jenkins/jenkins-slave/workspace/Solr/Solr-Smoketest-9.x/_tmp/smoke_1695188300/unpack/solr-9.4.0/server/solr-webapp/webapp/WEB-INF/lib/jakarta.inject-2.6.1.jar: it has javax.* classes
      **WARNING**: skipping check of /home/jenkins/jenkins-slave/workspace/Solr/Solr-Smoketest-9.x/_tmp/smoke_1695188300/unpack/solr-9.4.0/server/solr-webapp/webapp/WEB-INF/lib/jakarta.activation-api-1.2.2.jar: it has javax.* classes
      **WARNING**: skipping check of /home/jenkins/jenkins-slave/workspace/Solr/Solr-Smoketest-9.x/_tmp/smoke_1695188300/unpack/solr-9.4.0/server/solr-webapp/webapp/WEB-INF/lib/jakarta.validation-api-2.0.2.jar: it has javax.* classes
      **WARNING**: skipping check of /home/jenkins/jenkins-slave/workspace/Solr/Solr-Smoketest-9.x/_tmp/smoke_1695188300/unpack/solr-9.4.0/server/solr-webapp/webapp/WEB-INF/lib/jakarta.annotation-api-1.3.5.jar: it has javax.* classes
      **WARNING**: skipping check of /home/jenkins/jenkins-slave/workspace/Solr/Solr-Smoketest-9.x/_tmp/smoke_1695188300/unpack/solr-9.4.0/server/solr-webapp/webapp/WEB-INF/lib/jakarta.ws.rs-api-2.1.6.jar: it has javax.* classes
      **WARNING**: skipping check of /home/jenkins/jenkins-slave/workspace/Solr/Solr-Smoketest-9.x/_tmp/smoke_1695188300/unpack/solr-9.4.0/server/solr-webapp/webapp/WEB-INF/lib/jakarta.xml.bind-api-2.3.3.jar: it has javax.* classes
      **WARNING**: skipping check of /home/jenkins/jenkins-slave/workspace/Solr/Solr-Smoketest-9.x/_tmp/smoke_1695188300/unpack/solr-9.4.0/server/lib/ext/jetty-servlet-api-4.0.6.jar: it has javax.* classes
    copying unpacked distribution for Java 11 ...
    test solr example w/ Java 11...
      start Solr instance (log=/home/jenkins/jenkins-slave/workspace/Solr/Solr-Smoketest-9.x/_tmp/smoke_1695188300/unpack/solr-9.4.0-java11/solr-example.log)...
Sending stop command to Solr running on port 8983 ... waiting up to 180 seconds to allow Jetty process 1609657 to stop gracefully.
java.net.ConnectException: Connection refused (Connection refused)
	at java.base/java.net.PlainSocketImpl.socketConnect(Native Method)
	at java.base/java.net.AbstractPlainSocketImpl.doConnect(AbstractPlainSocketImpl.java:412)
	at java.base/java.net.AbstractPlainSocketImpl.connectToAddress(AbstractPlainSocketImpl.java:255)
	at java.base/java.net.AbstractPlainSocketImpl.connect(AbstractPlainSocketImpl.java:237)
	at java.base/java.net.SocksSocketImpl.connect(SocksSocketImpl.java:392)
	at java.base/java.net.Socket.connect(Socket.java:609)
	at java.base/java.net.Socket.connect(Socket.java:558)
	at java.base/java.net.Socket.<init>(Socket.java:454)
	at java.base/java.net.Socket.<init>(Socket.java:264)
	at org.eclipse.jetty.start.Main.stop(Main.java:613)
	at org.eclipse.jetty.start.Main.stop(Main.java:589)
	at org.eclipse.jetty.start.Main.doStop(Main.java:576)
	at org.eclipse.jetty.start.Main.start(Main.java:449)
	at org.eclipse.jetty.start.Main.main(Main.java:76)

Usage: java -jar $JETTY_HOME/start.jar [options] [properties] [configs]
       java -jar $JETTY_HOME/start.jar --help  # for more information
 [|]   [/]   [-]   [\]   [|]   [/]   [-]   [\]   [|]   [/]   [-]   [\]   [|]   [/]   [-]   [\]   [|]   [/]   [-]   [\]   [|]   [/]   [-]   [\]   [|]   [/]   [-]   [\]   [|]   [/]   [-]   [\]   [|]   [/]   [-]   [\]   [|]   [/]   [-]   [\]   [|]   [/]   [-]   [\]   [|]   [/]   [-]   [\]   [|]   [/]   [-]   [\]   [|]   [/]   [-]   [\]   [|]   [/]   [-]   [\]   [|]   [/]   [-]   [\]   [|]   [/]   [-]   [\]   [|]   [/]   [-]   [\]   [|]   [/]   [-]   [\]   [|]   [/]   [-]   [\]   [|]   [/]   [-]   [\]   [|]   [/]   [-]   [\]   [|]   [/]   [-]   [\]   [|]   [/]   [-]   [\]   [|]   [/]   [-]   [\]   [|]   [/]   [-]   [\]   [|]   [/]   [-]   [\]   [|]   [/]   [-]   [\]   [|]   [/]   [-]   [\]   [|]   [/]   [-]   [\]   [|]   [/]   [-]   [\]   [|]   [/]   [-]   [\]   [|]   [/]   [-]   [\]   [|]   [/]   [-]   [\]   [|]   [/]   [-]   [\]   [|]   [/]   [-]   [\]   [|]   [/]   [-]   [\]   [|]   [/]   [-]   [\]   [|]   [/]   [-]   [\]   [|]   [/]   [-]   [\]   [|]   [/]   [-]   [\]   [|]   [/]   [-]   [\]   [|]   [/]   [-]   [\]   [|]   [/]   [-]   [\]   [|]   [/]   [-]   [\]   [|]   [/]   [-]   [\]   [|]   [/]   [-]   [\]   [|]   [/]   [-]   [\]   [|]   [/]   [-]   [\]   [|]   [/]   [-]   [\]   [|]   [/]   [-]   [\]   [|]   [/]   [-]   [\]   [|]   [/]   [-]   [\]   [|]   [/]   [-]   [\]   [|]   [/]   [-]   [\]   [|]   [/]   [-]   [\]   [|]   [/]   [-]   [\]   [|]   [/]   [-]   [\]   [|]   [/]   [-]   [\]   [|]   [/]   [-]   [\]   [|]   [/]   [-]   [\]   [|]   [/]   [-]   [\]   [|]   [/]   [-]   [\]   [|]   [/]   [-]   [\]   [|]   [/]   [-]   [\]   [|]   [/]   [-]   [\]   [|]   [/]   [-]   [\]   [|]   [/]   [-]   [\]   [|]   [/]   [-]   [\]   [|]   [/]   [-]   [\]   [|]   [/]   [-]   [\]   [|]   [/]   [-]   [\]   [|]   [/]   [-]   [\]   [|]   [/]   [-]   [\]   [|]   [/]   [-]   [\]   [|]   [/]   [-]   [\]   [|]   [/]   [-]   [\]   [|]   [/]   [-]   [\]   [|]   [/]   [-]   [\]   [|]   [/]   [-]   [\]   [|]   [/]   [-]   [\]   [|]   [/]   [-]   [\]   [|]   [/]   [-]   [\]   [|]   [/]   [-]   [\]   [|]   [/]   [-]   [\]   [|]   [/]   [-]   [\]   [|]   [/]   [-]   [\]   [|]   [/]   [-]   [\]   [|]   [/]   [-]   [\]   [|]      Solr process 1609657 is still running; jstacking it now.
1609657: Permission denied
Solr process 1609657 is still running; forcefully killing it now.
bin/solr: line 925: kill: (1609657) - Operation not permitted
Killed process 1609657
ERROR: Failed to kill previous Solr Java process 1609657 ... script fails.
      Running techproducts example on port 8983 from /home/jenkins/jenkins-slave/workspace/Solr/Solr-Smoketest-9.x/_tmp/smoke_1695188300/unpack/solr-9.4.0-java11
*** [WARN] *** Your open file limit is currently 60000.  
 It should be set to 65000 to avoid operational disruption. 
 If you no longer wish to see this warning, set SOLR_ULIMIT_CHECKS to false in your profile or solr.in.sh
*** [WARN] ***  Your Max Processes Limit is currently 30000. 
 It should be set to 65000 to avoid operational disruption. 
 If you no longer wish to see this warning, set SOLR_ULIMIT_CHECKS to false in your profile or solr.in.sh
Creating Solr home directory /home/jenkins/jenkins-slave/workspace/Solr/Solr-Smoketest-9.x/_tmp/smoke_1695188300/unpack/solr-9.4.0-java11/example/techproducts/solr

Starting up Solr on port 8983 using command:
"bin/solr" start -p 8983 -s "example/techproducts/solr"

*** [WARN] *** Your open file limit is currently 60000.  
 It should be set to 65000 to avoid operational disruption. 
 If you no longer wish to see this warning, set SOLR_ULIMIT_CHECKS to false in your profile or solr.in.sh
*** [WARN] ***  Your Max Processes Limit is currently 30000. 
 It should be set to 65000 to avoid operational disruption. 
 If you no longer wish to see this warning, set SOLR_ULIMIT_CHECKS to false in your profile or solr.in.sh

Port 8983 is already being used by another process (pid: 1609657)
Please choose a different port using the -p option.


ERROR: Failed to start Solr using command: "bin/solr" start -p 8983 -s "example/techproducts/solr" Exception : org.apache.commons.exec.ExecuteException: Process exited with an error: 1 (Exit value: 1)

      stop server using: bin/solr stop -p 8983
Sending stop command to Solr running on port 8983 ... waiting up to 180 seconds to allow Jetty process 1609657 to stop gracefully.
java.net.ConnectException: Connection refused (Connection refused)
	at java.base/java.net.PlainSocketImpl.socketConnect(Native Method)
	at java.base/java.net.AbstractPlainSocketImpl.doConnect(AbstractPlainSocketImpl.java:412)
	at java.base/java.net.AbstractPlainSocketImpl.connectToAddress(AbstractPlainSocketImpl.java:255)
	at java.base/java.net.AbstractPlainSocketImpl.connect(AbstractPlainSocketImpl.java:237)
	at java.base/java.net.SocksSocketImpl.connect(SocksSocketImpl.java:392)
	at java.base/java.net.Socket.connect(Socket.java:609)
	at java.base/java.net.Socket.connect(Socket.java:558)
	at java.base/java.net.Socket.<init>(Socket.java:454)
	at java.base/java.net.Socket.<init>(Socket.java:264)
	at org.eclipse.jetty.start.Main.stop(Main.java:613)
	at org.eclipse.jetty.start.Main.stop(Main.java:589)
	at org.eclipse.jetty.start.Main.doStop(Main.java:576)
	at org.eclipse.jetty.start.Main.start(Main.java:449)
	at org.eclipse.jetty.start.Main.main(Main.java:76)

Usage: java -jar $JETTY_HOME/start.jar [options] [properties] [configs]
       java -jar $JETTY_HOME/start.jar --help  # for more information
 [|]   [/]   [-]   [\]   [|]   [/]   [-]   [\]   [|]   [/]   [-]   [\]   [|]   [/]   [-]   [\]   [|]   [/]   [-]   [\]   [|]   [/]   [-]   [\]   [|]   [/]   [-]   [\]   [|]   [/]   [-]   [\]   [|]   [/]   [-]   [\]   [|]   [/]   [-]   [\]   [|]   [/]   [-]   [\]   [|]   [/]   [-]   [\]   [|]   [/]   [-]   [\]   [|]   [/]   [-]   [\]   [|]   [/]   [-]   [\]   [|]   [/]   [-]   [\]   [|]   [/]   [-]   [\]   [|]   [/]   [-]   [\]   [|]   [/]   [-]   [\]   [|]   [/]   [-]   [\]   [|]   [/]   [-]   [\]   [|]   [/]   [-]   [\]   [|]   [/]   [-]   [\]   [|]   [/]   [-]   [\]   [|]   [/]   [-]   [\]   [|]   [/]   [-]   [\]   [|]   [/]   [-]   [\]   [|]   [/]   [-]   [\]   [|]   [/]   [-]   [\]   [|]   [/]   [-]   [\]   [|]   [/]   [-]   [\]   [|]   [/]   [-]   [\]   [|]   [/]   [-]   [\]   [|]   [/]   [-]   [\]   [|]   [/]   [-]   [\]   [|]   [/]   [-]   [\]   [|]   [/]   [-]   [\]   [|]   [/]   [-]   [\]   [|]   [/]   [-]   [\]   [|]   [/]   [-]   [\]   [|]   [/]   [-]   [\]   [|]   [/]   [-]   [\]   [|]   [/]   [-]   [\]   [|]   [/]   [-]   [\]   [|]   [/]   [-]   [\]   [|]   [/]   [-]   [\]   [|]   [/]   [-]   [\]   [|]   [/]   [-]   [\]   [|]   [/]   [-]   [\]   [|]   [/]   [-]   [\]   [|]   [/]   [-]   [\]   [|]   [/]   [-]   [\]   [|]   [/]   [-]   [\]   [|]   [/]   [-]   [\]   [|]   [/]   [-]   [\]   [|]   [/]   [-]   [\]   [|]   [/]   [-]   [\]   [|]   [/]   [-]   [\]   [|]   [/]   [-]   [\]   [|]   [/]   [-]   [\]   [|]   [/]   [-]   [\]   [|]   [/]   [-]   [\]   [|]   [/]   [-]   [\]   [|]   [/]   [-]   [\]   [|]   [/]   [-]   [\]   [|]   [/]   [-]   [\]   [|]   [/]   [-]   [\]   [|]   [/]   [-]   [\]   [|]   [/]   [-]   [\]   [|]   [/]   [-]   [\]   [|]   [/]   [-]   [\]   [|]   [/]   [-]   [\]   [|]   [/]   [-]   [\]   [|]   [/]   [-]   [\]   [|]   [/]   [-]   [\]   [|]   [/]   [-]   [\]   [|]   [/]   [-]   [\]   [|]   [/]   [-]   [\]   [|]   [/]   [-]   [\]   [|]   [/]   [-]   [\]   [|]   [/]   [-]   [\]   [|]   [/]   [-]   [\]   [|]   [/]   [-]   [\]   [|]   [/]   [-]   [\]   [|]   [/]   [-]   [\]   [|]   [/]   [-]   [\]   [|]   [/]   [-]   [\]   [|]   [/]   [-]   [\]   [|]   [/]   [-]   [\]   [|]   [/]      Solr process 1609657 is still running; jstacking it now.
1609657: Permission denied
Solr process 1609657 is still running; forcefully killing it now.
bin/solr: line 925: kill: (1609657) - Operation not permitted
Killed process 1609657
ERROR: Failed to kill previous Solr Java process 1609657 ... script fails.
Traceback (most recent call last):
  File "dev-tools/scripts/smokeTestRelease.py", line 1174, in <module>
    main()
  File "dev-tools/scripts/smokeTestRelease.py", line 1100, in main
    smokeTest(c.java, c.url, c.revision, c.version, c.tmp_dir, c.is_signed, c.local_keys, ' '.join(c.test_args),
  File "dev-tools/scripts/smokeTestRelease.py", line 1160, in smokeTest
    unpackAndVerify(java, tmpDir, 'solr-%s.tgz' % version, gitRevision, version, testArgs)
  File "dev-tools/scripts/smokeTestRelease.py", line 553, in unpackAndVerify
    verifyUnpacked(java, artifact, unpackPath, gitRevision, version, testArgs)
  File "dev-tools/scripts/smokeTestRelease.py", line 671, in verifyUnpacked
    testSolrExample(java11UnpackPath, java.java11_home)
  File "dev-tools/scripts/smokeTestRelease.py", line 752, in testSolrExample
    raise RuntimeError('Failed to run the techproducts example, check log for previous errors.')
RuntimeError: Failed to run the techproducts example, check log for previous errors.
Build step 'Run with timeout' marked build as failure
Email was triggered for: Failure - Any
Sending email for trigger: Failure - Any

[JENKINS] Solr ยป Solr-Smoketest-9.x - Build # 182 - Still Failing!

Posted by Apache Jenkins Server <je...@builds.apache.org>.
Build: https://ci-builds.apache.org/job/Solr/job/Solr-Smoketest-9.x/182/

Log: 
Started by timer
Running as SYSTEM
[EnvInject] - Loading node environment variables.
Building remotely on lucene-solr-1 (solr lucene) in workspace /home/jenkins/jenkins-slave/workspace/Solr/Solr-Smoketest-9.x
The recommended git tool is: NONE
No credentials specified
 > git rev-parse --resolve-git-dir /home/jenkins/jenkins-slave/workspace/Solr/Solr-Smoketest-9.x/.git # timeout=10
Fetching changes from the remote Git repository
 > git config remote.origin.url https://github.com/apache/solr.git # timeout=10
Cleaning workspace
 > git rev-parse --verify HEAD # timeout=10
Resetting working tree
 > git reset --hard # timeout=10
 > git clean -fdx # timeout=10
Fetching upstream changes from https://github.com/apache/solr.git
 > git --version # timeout=10
 > git --version # 'git version 2.17.1'
 > git fetch --tags --progress -- https://github.com/apache/solr.git +refs/heads/*:refs/remotes/origin/* # timeout=10
 > git rev-parse origin/branch_9x^{commit} # timeout=10
Checking out Revision 16239193dd52ec860ef76a0b02631d6cbec53a0b (origin/branch_9x)
 > git config core.sparsecheckout # timeout=10
 > git checkout -f 16239193dd52ec860ef76a0b02631d6cbec53a0b # timeout=10
Commit message: "No Jira: Reduce logging level for slice -> shard mapping in RTG (#1932)"
 > git rev-list --no-walk ca3c81ce37cb9160dff5384e1ab72afd900abb47 # timeout=10
No emails were triggered.
provisioning config files...
copy managed file [gradle.properties] to file:/home/jenkins/jenkins-slave/workspace/Solr/Solr-Smoketest-9.x/gradle.properties
[Gradle] - Launching build.
[Solr-Smoketest-9.x] $ /home/jenkins/jenkins-slave/workspace/Solr/Solr-Smoketest-9.x/gradlew -Dversion.suffix= -Dgradle.user.home=/home/jenkins/jenkins-slave/workspace/Solr/.gradle -Porg.gradle.daemon=false -Pvalidation.git.failOnModified=false --continue -x signJarsPublication clean assembleRelease
Downloading gradle-wrapper.jar from https://raw.githubusercontent.com/gradle/gradle/v7.6.0/gradle/wrapper/gradle-wrapper.jar
To honour the JVM settings for this build a single-use Daemon process will be forked. See https://docs.gradle.org/7.6/userguide/gradle_daemon.html#sec:disabling_the_daemon.
Daemon will be stopped at the end of the build 
> Task :buildSrc:compileJava
> Task :buildSrc:compileGroovy NO-SOURCE
> Task :buildSrc:processResources NO-SOURCE
> Task :buildSrc:classes
> Task :buildSrc:jar
> Task :buildSrc:assemble
> Task :buildSrc:compileTestJava NO-SOURCE
> Task :buildSrc:compileTestGroovy NO-SOURCE
> Task :buildSrc:processTestResources NO-SOURCE
> Task :buildSrc:testClasses UP-TO-DATE
> Task :buildSrc:test NO-SOURCE
> Task :buildSrc:check UP-TO-DATE
> Task :buildSrc:build
> Task :clean
> Task :solr:clean UP-TO-DATE
> Task :solr:api:clean
> Task :solr:benchmark:clean
> Task :solr:core:clean
> Task :solr:distribution:clean UP-TO-DATE
> Task :solr:docker:clean UP-TO-DATE
> Task :solr:documentation:clean UP-TO-DATE
> Task :solr:example:clean UP-TO-DATE
> Task :solr:modules:clean UP-TO-DATE
> Task :solr:packaging:clean UP-TO-DATE
> Task :solr:prometheus-exporter:clean
> Task :solr:server:clean
> Task :solr:solr-ref-guide:clean
> Task :solr:solrj:clean
> Task :solr:solrj-streaming:clean
> Task :solr:solrj-zookeeper:clean
> Task :solr:test-framework:clean
> Task :solr:webapp:clean
> Task :solr:modules:analysis-extras:clean
> Task :solr:modules:analytics:clean
> Task :solr:modules:clustering:clean
> Task :solr:modules:extraction:clean
> Task :solr:modules:gcs-repository:clean
> Task :solr:modules:hadoop-auth:clean
> Task :solr:modules:hdfs:clean
> Task :solr:modules:jaegertracer-configurator:clean
> Task :solr:modules:jwt-auth:clean
> Task :solr:modules:langid:clean
> Task :solr:modules:ltr:clean
> Task :solr:modules:opentelemetry:clean
> Task :solr:modules:s3-repository:clean
> Task :solr:modules:scripting:clean
> Task :solr:modules:sql:clean
> Task :mavenLocalClean UP-TO-DATE
> Task :solr-missing-doclet:compileJava
> Task :solr-missing-doclet:processResources NO-SOURCE
> Task :solr-missing-doclet:classes
> Task :solr-missing-doclet:jar
> Task :gitStatus
> Task :checkJdkInternalsExportedToGradle
> Task :solr:api:compileJava
> Task :solr:api:processResources NO-SOURCE
> Task :solr:api:classes
> Task :solr:api:jar
> Task :solr:api:generateMetadataFileForJarsPublication SKIPPED
> Task :solr:api:generatePomFileForJarsPublication
> Task :solr:api:renderJavadoc
> Task :solr:api:javadoc SKIPPED
> Task :solr:api:javadocJar
> Task :solr:api:sourcesJar
> Task :solr:api:publishJarsPublicationToBuildRepository

> Task :solr:api:resolve
SLF4J: No SLF4J providers were found.
SLF4J: Defaulting to no-operation (NOP) logger implementation
SLF4J: See https://www.slf4j.org/codes.html#noProviders for further details.

> Task :solr:solrj:openApiGenerate
################################################################################
# Thanks for using OpenAPI Generator.                                          #
# Please consider donation to help us maintain this project ๐Ÿ™                 #
# https://opencollective.com/openapi_generator/donate                          #
################################################################################
Successfully generated code to /home/jenkins/jenkins-slave/workspace/Solr/Solr-Smoketest-9.x/solr/solrj/build/generated/

> Task :spotlessInternalRegisterDependencies
> Task :solr:solrj:generatedSpotlessHelper
> Task :solr:solrj:generatedSpotless

> Task :solr:solrj:compileJava
Note: Some input files use or override a deprecated API.
Note: Recompile with -Xlint:deprecation for details.

> Task :solr:solrj-streaming:compileJava
Note: Some input files use or override a deprecated API.
Note: Recompile with -Xlint:deprecation for details.

> Task :solr:solrj-zookeeper:compileJava
Note: Some input files use or override a deprecated API.
Note: Recompile with -Xlint:deprecation for details.

> Task :solr:core:compileJava
Note: Some input files use or override a deprecated API.
Note: Recompile with -Xlint:deprecation for details.

> Task :solr:core:processResources
> Task :solr:core:classes
> Task :solr:core:jar
> Task :solr:core:generateMetadataFileForJarsPublication SKIPPED
> Task :solr:core:generatePomFileForJarsPublication
> Task :solr:solrj:renderJavadoc
> Task :solr:solrj-streaming:renderJavadoc
> Task :solr:solrj-zookeeper:renderJavadoc
> Task :solr:core:renderJavadoc
> Task :solr:core:javadoc SKIPPED
> Task :solr:core:javadocJar
> Task :solr:core:sourcesJar
> Task :solr:core:publishJarsPublicationToBuildRepository

> Task :solr:prometheus-exporter:compileJava
Note: Some input files use or override a deprecated API.
Note: Recompile with -Xlint:deprecation for details.

> Task :solr:prometheus-exporter:processResources NO-SOURCE
> Task :solr:prometheus-exporter:classes
> Task :solr:prometheus-exporter:jar
> Task :solr:prometheus-exporter:generateMetadataFileForJarsPublication SKIPPED
> Task :solr:prometheus-exporter:generatePomFileForJarsPublication
> Task :solr:prometheus-exporter:renderJavadoc
> Task :solr:prometheus-exporter:javadoc SKIPPED
> Task :solr:prometheus-exporter:javadocJar
> Task :solr:prometheus-exporter:sourcesJar
> Task :solr:prometheus-exporter:publishJarsPublicationToBuildRepository
> Task :solr:solrj:processResources
> Task :solr:solrj:classes
> Task :solr:solrj:jar
> Task :solr:solrj:generateMetadataFileForJarsPublication SKIPPED
> Task :solr:solrj:generatePomFileForJarsPublication
> Task :solr:solrj:javadoc SKIPPED
> Task :solr:solrj:javadocJar
> Task :solr:solrj:sourcesJar
> Task :solr:solrj:publishJarsPublicationToBuildRepository
> Task :solr:solrj-streaming:processResources
> Task :solr:solrj-streaming:classes
> Task :solr:solrj-streaming:jar
> Task :solr:solrj-streaming:generateMetadataFileForJarsPublication SKIPPED
> Task :solr:solrj-streaming:generatePomFileForJarsPublication
> Task :solr:solrj-streaming:javadoc SKIPPED
> Task :solr:solrj-streaming:javadocJar
> Task :solr:solrj-streaming:sourcesJar
> Task :solr:solrj-streaming:publishJarsPublicationToBuildRepository
> Task :solr:solrj-zookeeper:processResources NO-SOURCE
> Task :solr:solrj-zookeeper:classes
> Task :solr:solrj-zookeeper:jar
> Task :solr:solrj-zookeeper:generateMetadataFileForJarsPublication SKIPPED
> Task :solr:solrj-zookeeper:generatePomFileForJarsPublication
> Task :solr:solrj-zookeeper:javadoc SKIPPED
> Task :solr:solrj-zookeeper:javadocJar
> Task :solr:solrj-zookeeper:sourcesJar
> Task :solr:solrj-zookeeper:publishJarsPublicationToBuildRepository

> Task :solr:test-framework:compileJava
Note: Some input files use or override a deprecated API.
Note: Recompile with -Xlint:deprecation for details.

> Task :solr:test-framework:processResources
> Task :solr:test-framework:classes
> Task :solr:test-framework:jar
> Task :solr:test-framework:generateMetadataFileForJarsPublication SKIPPED
> Task :solr:test-framework:generatePomFileForJarsPublication
> Task :solr:test-framework:renderJavadoc
> Task :solr:test-framework:javadoc SKIPPED
> Task :solr:test-framework:javadocJar
> Task :solr:test-framework:sourcesJar
> Task :solr:test-framework:publishJarsPublicationToBuildRepository

> Task :solr:modules:analysis-extras:compileJava
Note: /home/jenkins/jenkins-slave/workspace/Solr/Solr-Smoketest-9.x/solr/modules/analysis-extras/src/java/org/apache/solr/schema/ICUCollationField.java uses or overrides a deprecated API.
Note: Recompile with -Xlint:deprecation for details.

> Task :solr:modules:analysis-extras:processResources NO-SOURCE
> Task :solr:modules:analysis-extras:classes
> Task :solr:modules:analysis-extras:jar
> Task :solr:modules:analysis-extras:generateMetadataFileForJarsPublication SKIPPED
> Task :solr:modules:analysis-extras:generatePomFileForJarsPublication
> Task :solr:modules:analysis-extras:renderJavadoc
> Task :solr:modules:analysis-extras:javadoc SKIPPED
> Task :solr:modules:analysis-extras:javadocJar
> Task :solr:modules:analysis-extras:sourcesJar
> Task :solr:modules:analysis-extras:publishJarsPublicationToBuildRepository

> Task :solr:modules:analytics:compileJava
Note: Some input files use or override a deprecated API.
Note: Recompile with -Xlint:deprecation for details.

> Task :solr:modules:analytics:processResources NO-SOURCE
> Task :solr:modules:analytics:classes
> Task :solr:modules:analytics:jar
> Task :solr:modules:analytics:generateMetadataFileForJarsPublication SKIPPED
> Task :solr:modules:analytics:generatePomFileForJarsPublication
> Task :solr:modules:analytics:renderJavadoc
> Task :solr:modules:analytics:javadoc SKIPPED
> Task :solr:modules:analytics:javadocJar
> Task :solr:modules:analytics:sourcesJar
> Task :solr:modules:analytics:publishJarsPublicationToBuildRepository
> Task :solr:modules:clustering:compileJava
> Task :solr:modules:clustering:processResources NO-SOURCE
> Task :solr:modules:clustering:classes
> Task :solr:modules:clustering:jar
> Task :solr:modules:clustering:generateMetadataFileForJarsPublication SKIPPED
> Task :solr:modules:clustering:generatePomFileForJarsPublication
> Task :solr:modules:clustering:renderJavadoc
> Task :solr:modules:clustering:javadoc SKIPPED
> Task :solr:modules:clustering:javadocJar
> Task :solr:modules:clustering:sourcesJar
> Task :solr:modules:clustering:publishJarsPublicationToBuildRepository

> Task :solr:modules:extraction:compileJava
Note: /home/jenkins/jenkins-slave/workspace/Solr/Solr-Smoketest-9.x/solr/modules/extraction/src/java/org/apache/solr/handler/extraction/ExtractingDocumentLoader.java uses or overrides a deprecated API.
Note: Recompile with -Xlint:deprecation for details.

> Task :solr:modules:extraction:processResources
> Task :solr:modules:extraction:classes
> Task :solr:modules:extraction:jar
> Task :solr:modules:extraction:generateMetadataFileForJarsPublication SKIPPED
> Task :solr:modules:extraction:generatePomFileForJarsPublication
> Task :solr:modules:extraction:renderJavadoc
> Task :solr:modules:extraction:javadoc SKIPPED
> Task :solr:modules:extraction:javadocJar
> Task :solr:modules:extraction:sourcesJar
> Task :solr:modules:extraction:publishJarsPublicationToBuildRepository

> Task :solr:modules:gcs-repository:compileJava
Note: /home/jenkins/jenkins-slave/workspace/Solr/Solr-Smoketest-9.x/solr/modules/gcs-repository/src/java/org/apache/solr/gcs/GCSConfigParser.java uses or overrides a deprecated API.
Note: Recompile with -Xlint:deprecation for details.

> Task :solr:modules:gcs-repository:processResources NO-SOURCE
> Task :solr:modules:gcs-repository:classes
> Task :solr:modules:gcs-repository:jar
> Task :solr:modules:gcs-repository:generateMetadataFileForJarsPublication SKIPPED
> Task :solr:modules:gcs-repository:generatePomFileForJarsPublication
> Task :solr:modules:gcs-repository:renderJavadoc
> Task :solr:modules:gcs-repository:javadoc SKIPPED
> Task :solr:modules:gcs-repository:javadocJar
> Task :solr:modules:gcs-repository:sourcesJar
> Task :solr:modules:gcs-repository:publishJarsPublicationToBuildRepository

> Task :solr:modules:hadoop-auth:compileJava
Note: Some input files use or override a deprecated API.
Note: Recompile with -Xlint:deprecation for details.

> Task :solr:modules:hadoop-auth:processResources NO-SOURCE
> Task :solr:modules:hadoop-auth:classes
> Task :solr:modules:hadoop-auth:jar
> Task :solr:modules:hadoop-auth:generateMetadataFileForJarsPublication SKIPPED
> Task :solr:modules:hadoop-auth:generatePomFileForJarsPublication
> Task :solr:modules:hadoop-auth:renderJavadoc
> Task :solr:modules:hadoop-auth:javadoc SKIPPED
> Task :solr:modules:hadoop-auth:javadocJar
> Task :solr:modules:hadoop-auth:sourcesJar
> Task :solr:modules:hadoop-auth:publishJarsPublicationToBuildRepository

> Task :solr:modules:hdfs:compileJava
Note: Some input files use or override a deprecated API.
Note: Recompile with -Xlint:deprecation for details.

> Task :solr:modules:hdfs:processResources NO-SOURCE
> Task :solr:modules:hdfs:classes
> Task :solr:modules:hdfs:jar
> Task :solr:modules:hdfs:generateMetadataFileForJarsPublication SKIPPED
> Task :solr:modules:hdfs:generatePomFileForJarsPublication
> Task :solr:modules:hdfs:renderJavadoc
> Task :solr:modules:hdfs:javadoc SKIPPED
> Task :solr:modules:hdfs:javadocJar
> Task :solr:modules:hdfs:sourcesJar
> Task :solr:modules:hdfs:publishJarsPublicationToBuildRepository
> Task :solr:modules:jaegertracer-configurator:compileJava
> Task :solr:modules:jaegertracer-configurator:processResources NO-SOURCE
> Task :solr:modules:jaegertracer-configurator:classes
> Task :solr:modules:jaegertracer-configurator:jar
> Task :solr:modules:jaegertracer-configurator:generateMetadataFileForJarsPublication SKIPPED
> Task :solr:modules:jaegertracer-configurator:generatePomFileForJarsPublication
> Task :solr:modules:jaegertracer-configurator:renderJavadoc
> Task :solr:modules:jaegertracer-configurator:javadoc SKIPPED
> Task :solr:modules:jaegertracer-configurator:javadocJar
> Task :solr:modules:jaegertracer-configurator:sourcesJar
> Task :solr:modules:jaegertracer-configurator:publishJarsPublicationToBuildRepository

> Task :solr:modules:jwt-auth:compileJava
Note: /home/jenkins/jenkins-slave/workspace/Solr/Solr-Smoketest-9.x/solr/modules/jwt-auth/src/java/org/apache/solr/security/jwt/JWTAuthPlugin.java uses or overrides a deprecated API.
Note: Recompile with -Xlint:deprecation for details.

> Task :solr:modules:jwt-auth:processResources NO-SOURCE
> Task :solr:modules:jwt-auth:classes
> Task :solr:modules:jwt-auth:jar
> Task :solr:modules:jwt-auth:generateMetadataFileForJarsPublication SKIPPED
> Task :solr:modules:jwt-auth:generatePomFileForJarsPublication
> Task :solr:modules:jwt-auth:renderJavadoc
> Task :solr:modules:jwt-auth:javadoc SKIPPED
> Task :solr:modules:jwt-auth:javadocJar
> Task :solr:modules:jwt-auth:sourcesJar
> Task :solr:modules:jwt-auth:publishJarsPublicationToBuildRepository

> Task :solr:modules:langid:compileJava
Note: Some input files use or override a deprecated API.
Note: Recompile with -Xlint:deprecation for details.

> Task :solr:modules:langid:processResources
> Task :solr:modules:langid:classes
> Task :solr:modules:langid:jar
> Task :solr:modules:langid:generateMetadataFileForJarsPublication SKIPPED
> Task :solr:modules:langid:generatePomFileForJarsPublication
> Task :solr:modules:langid:renderJavadoc
> Task :solr:modules:langid:javadoc SKIPPED
> Task :solr:modules:langid:javadocJar
> Task :solr:modules:langid:sourcesJar
> Task :solr:modules:langid:publishJarsPublicationToBuildRepository

> Task :solr:modules:ltr:compileJava
Note: Some input files use or override a deprecated API.
Note: Recompile with -Xlint:deprecation for details.

> Task :solr:modules:ltr:processResources NO-SOURCE
> Task :solr:modules:ltr:classes
> Task :solr:modules:ltr:jar
> Task :solr:modules:ltr:generateMetadataFileForJarsPublication SKIPPED
> Task :solr:modules:ltr:generatePomFileForJarsPublication
> Task :solr:modules:ltr:renderJavadoc
> Task :solr:modules:ltr:javadoc SKIPPED
> Task :solr:modules:ltr:javadocJar
> Task :solr:modules:ltr:sourcesJar
> Task :solr:modules:ltr:publishJarsPublicationToBuildRepository
> Task :solr:modules:opentelemetry:compileJava
> Task :solr:modules:opentelemetry:processResources NO-SOURCE
> Task :solr:modules:opentelemetry:classes
> Task :solr:modules:opentelemetry:jar
> Task :solr:modules:opentelemetry:generateMetadataFileForJarsPublication SKIPPED
> Task :solr:modules:opentelemetry:generatePomFileForJarsPublication
> Task :solr:modules:opentelemetry:renderJavadoc
> Task :solr:modules:opentelemetry:javadoc SKIPPED
> Task :solr:modules:opentelemetry:javadocJar
> Task :solr:modules:opentelemetry:sourcesJar
> Task :solr:modules:opentelemetry:publishJarsPublicationToBuildRepository
> Task :solr:modules:s3-repository:compileJava
> Task :solr:modules:s3-repository:processResources NO-SOURCE
> Task :solr:modules:s3-repository:classes
> Task :solr:modules:s3-repository:jar
> Task :solr:modules:s3-repository:generateMetadataFileForJarsPublication SKIPPED
> Task :solr:modules:s3-repository:generatePomFileForJarsPublication
> Task :solr:modules:s3-repository:renderJavadoc
> Task :solr:modules:s3-repository:javadoc SKIPPED
> Task :solr:modules:s3-repository:javadocJar
> Task :solr:modules:s3-repository:sourcesJar
> Task :solr:modules:s3-repository:publishJarsPublicationToBuildRepository

> Task :solr:modules:scripting:compileJava
Note: /home/jenkins/jenkins-slave/workspace/Solr/Solr-Smoketest-9.x/solr/modules/scripting/src/java/org/apache/solr/scripting/xslt/XSLTUpdateRequestHandler.java uses or overrides a deprecated API.
Note: Recompile with -Xlint:deprecation for details.

> Task :solr:modules:scripting:processResources NO-SOURCE
> Task :solr:modules:scripting:classes
> Task :solr:modules:scripting:jar
> Task :solr:modules:scripting:generateMetadataFileForJarsPublication SKIPPED
> Task :solr:modules:scripting:generatePomFileForJarsPublication
> Task :solr:modules:scripting:renderJavadoc
> Task :solr:modules:scripting:javadoc SKIPPED
> Task :solr:modules:scripting:javadocJar
> Task :solr:modules:scripting:sourcesJar
> Task :solr:modules:scripting:publishJarsPublicationToBuildRepository

> Task :solr:modules:sql:compileJava
Note: Some input files use or override a deprecated API.
Note: Recompile with -Xlint:deprecation for details.

> Task :solr:modules:sql:processResources
> Task :solr:modules:sql:classes
> Task :solr:modules:sql:jar
> Task :solr:modules:sql:generateMetadataFileForJarsPublication SKIPPED
> Task :solr:modules:sql:generatePomFileForJarsPublication
> Task :solr:modules:sql:renderJavadoc
> Task :solr:modules:sql:javadoc SKIPPED
> Task :solr:modules:sql:javadocJar
> Task :solr:modules:sql:sourcesJar
> Task :solr:modules:sql:publishJarsPublicationToBuildRepository

> Task :mavenToLocalFolder
Local maven artifacts (poms, jars) created at: /home/jenkins/jenkins-slave/workspace/Solr/Solr-Smoketest-9.x/build/maven-local

> Task :checkWorkingCopyClean
> Task :solr:distribution:assembleSourceTgz
> Task :solr:docker:createBodySnippetDockerfile
> Task :solr:docker:createDockerfileLocal
> Task :solr:docker:assemblePackaging
> Task :solr:documentation:changesToHtml
> Task :solr:documentation:copyDocumentationAssets
> Task :solr:documentation:markdownToHtml
> Task :solr:documentation:copyChangesToHtmlForMiniSite
> Task :solr:documentation:copyMiniDocumentationAssets
> Task :solr:documentation:createMiniDocumentationIndex
> Task :solr:documentation:documentationMinimal
> Task :solr:core:assemblePostJar
> Task :solr:example:assemblePackaging
> Task :solr:prometheus-exporter:assemblePackaging
> Task :solr:webapp:compileJava NO-SOURCE
> Task :solr:webapp:processResources NO-SOURCE
> Task :solr:webapp:classes UP-TO-DATE
> Task :solr:webapp:war
> Task :solr:server:assemblePackaging
> Task :solr:modules:analysis-extras:assemblePackaging
> Task :solr:modules:analytics:assemblePackaging
> Task :solr:modules:clustering:assemblePackaging
> Task :solr:modules:extraction:assemblePackaging
> Task :solr:modules:gcs-repository:assemblePackaging
> Task :solr:modules:hadoop-auth:assemblePackaging
> Task :solr:modules:hdfs:assemblePackaging
> Task :solr:modules:jaegertracer-configurator:assemblePackaging
> Task :solr:modules:jwt-auth:assemblePackaging
> Task :solr:modules:langid:assemblePackaging
> Task :solr:modules:ltr:assemblePackaging
> Task :solr:modules:opentelemetry:assemblePackaging
> Task :solr:modules:s3-repository:assemblePackaging
> Task :solr:modules:scripting:assemblePackaging
> Task :solr:modules:sql:assemblePackaging
> Task :solr:packaging:fullDistTar
> Task :solr:packaging:slimDistTar
> Task :solr:distribution:computeChecksums
> Task :solr:distribution:prepareGitRev
> Task :solr:docker:createDockerfileOfficialFull
> Task :solr:docker:createDockerfileOfficialSlim
> Task :solr:distribution:assembleRelease

Deprecated Gradle features were used in this build, making it incompatible with Gradle 8.0.

You can use '--warning-mode all' to show the individual deprecation warnings and determine if they come from your own scripts or plugins.

See https://docs.gradle.org/7.6/userguide/command_line_interface.html#sec:command_line_warnings

BUILD SUCCESSFUL in 5m 20s
246 actionable tasks: 238 executed, 8 up-to-date
Build step 'Invoke Gradle script' changed build result to SUCCESS
Run condition [Always] enabling perform for step [Execute shell]
[Solr-Smoketest-9.x] $ /bin/bash /tmp/jenkins10014085211712434946.sh
Installing Python script requirements
Defaulting to user installation because normal site-packages is not writeable
Collecting six~=1.16.0
  Using cached six-1.16.0-py2.py3-none-any.whl (11 kB)
ERROR: Could not find a version that satisfies the requirement Jinja2~=3.1.1 (from versions: 2.0rc1, 2.0, 2.1, 2.1.1, 2.2, 2.2.1, 2.3, 2.3.1, 2.4, 2.4.1, 2.5, 2.5.1, 2.5.2, 2.5.3, 2.5.4, 2.5.5, 2.6, 2.7, 2.7.1, 2.7.2, 2.7.3, 2.8, 2.8.1, 2.9, 2.9.1, 2.9.2, 2.9.3, 2.9.4, 2.9.5, 2.9.6, 2.10, 2.10.1, 2.10.2, 2.10.3, 2.11.0, 2.11.1, 2.11.2, 2.11.3, 3.0.0a1, 3.0.0rc1, 3.0.0rc2, 3.0.0, 3.0.1, 3.0.2, 3.0.3)
ERROR: No matching distribution found for Jinja2~=3.1.1
Starting Smoke tester in folder /home/jenkins/jenkins-slave/workspace/Solr/Solr-Smoketest-9.x
Java 11 JAVA_HOME=/home/jenkins/tools/java/latest11
NOTE: output encoding is UTF-8
NOTE: Not running @Nightly or @BadApple tests. Please verify that recent Jenkins runs have passed.

Load release URL "file:///home/jenkins/jenkins-slave/workspace/Solr/Solr-Smoketest-9.x/solr/distribution/build/release"...

Get KEYS...
    Downloading online KEYS file https://archive.apache.org/dist/solr/KEYS
Downloading https://archive.apache.org/dist/solr/KEYS
    0.3 MB in 1.10 sec (0.3 MB/sec)

Test Solr...
  test basics...
  check changes HTML...
  download solr-9.4.0-slim.tgz...
Downloading file:///home/jenkins/jenkins-slave/workspace/Solr/Solr-Smoketest-9.x/solr/distribution/build/release/solr-9.4.0-slim.tgz
    59.8 MB in 0.04 sec (1345.8 MB/sec)
    verify sha512 digest
  download solr-9.4.0-src.tgz...
Downloading file:///home/jenkins/jenkins-slave/workspace/Solr/Solr-Smoketest-9.x/solr/distribution/build/release/solr-9.4.0-src.tgz
    85.9 MB in 0.06 sec (1340.1 MB/sec)
    verify sha512 digest
  download solr-9.4.0.tgz...
Downloading file:///home/jenkins/jenkins-slave/workspace/Solr/Solr-Smoketest-9.x/solr/distribution/build/release/solr-9.4.0.tgz
    264.8 MB in 0.20 sec (1346.3 MB/sec)
    verify sha512 digest
  unpack solr-9.4.0.tgz...
  solr-9.4.0.tgz
    Checking LICENSE.txt
    Checking NOTICE.txt
    Checking README.txt
    Checking CHANGES.txt
    Checking bin
    Checking modules
    Checking docker
    Checking prometheus-exporter
    Checking docs
    Checking example
    Checking licenses
    Checking server
    Checking lib
    verify JAR metadata/identity/no javax.* or java.* classes...
      **WARNING**: skipping check of /home/jenkins/jenkins-slave/workspace/Solr/Solr-Smoketest-9.x/_tmp/smoke_1695104411/unpack/solr-9.4.0/server/solr-webapp/webapp/WEB-INF/lib/jakarta.xml.bind-api-2.3.3.jar: it has javax.* classes
      **WARNING**: skipping check of /home/jenkins/jenkins-slave/workspace/Solr/Solr-Smoketest-9.x/_tmp/smoke_1695104411/unpack/solr-9.4.0/server/solr-webapp/webapp/WEB-INF/lib/jakarta.annotation-api-1.3.5.jar: it has javax.* classes
      **WARNING**: skipping check of /home/jenkins/jenkins-slave/workspace/Solr/Solr-Smoketest-9.x/_tmp/smoke_1695104411/unpack/solr-9.4.0/server/solr-webapp/webapp/WEB-INF/lib/jakarta.activation-api-1.2.2.jar: it has javax.* classes
      **WARNING**: skipping check of /home/jenkins/jenkins-slave/workspace/Solr/Solr-Smoketest-9.x/_tmp/smoke_1695104411/unpack/solr-9.4.0/server/solr-webapp/webapp/WEB-INF/lib/jakarta.ws.rs-api-2.1.6.jar: it has javax.* classes
      **WARNING**: skipping check of /home/jenkins/jenkins-slave/workspace/Solr/Solr-Smoketest-9.x/_tmp/smoke_1695104411/unpack/solr-9.4.0/server/solr-webapp/webapp/WEB-INF/lib/jakarta.inject-2.6.1.jar: it has javax.* classes
      **WARNING**: skipping check of /home/jenkins/jenkins-slave/workspace/Solr/Solr-Smoketest-9.x/_tmp/smoke_1695104411/unpack/solr-9.4.0/server/solr-webapp/webapp/WEB-INF/lib/jakarta.validation-api-2.0.2.jar: it has javax.* classes
      **WARNING**: skipping check of /home/jenkins/jenkins-slave/workspace/Solr/Solr-Smoketest-9.x/_tmp/smoke_1695104411/unpack/solr-9.4.0/server/lib/ext/jetty-servlet-api-4.0.6.jar: it has javax.* classes
      **WARNING**: skipping check of /home/jenkins/jenkins-slave/workspace/Solr/Solr-Smoketest-9.x/_tmp/smoke_1695104411/unpack/solr-9.4.0/modules/extraction/lib/jakarta.activation-1.2.2.jar: it has javax.* classes
      **WARNING**: skipping check of /home/jenkins/jenkins-slave/workspace/Solr/Solr-Smoketest-9.x/_tmp/smoke_1695104411/unpack/solr-9.4.0/modules/extraction/lib/unit-api-1.0.jar: it has javax.* classes
    copying unpacked distribution for Java 11 ...
    test solr example w/ Java 11...
      start Solr instance (log=/home/jenkins/jenkins-slave/workspace/Solr/Solr-Smoketest-9.x/_tmp/smoke_1695104411/unpack/solr-9.4.0-java11/solr-example.log)...
No process found for Solr node running on port 8983
      Running techproducts example on port 8983 from /home/jenkins/jenkins-slave/workspace/Solr/Solr-Smoketest-9.x/_tmp/smoke_1695104411/unpack/solr-9.4.0-java11
*** [WARN] *** Your open file limit is currently 60000.  
 It should be set to 65000 to avoid operational disruption. 
 If you no longer wish to see this warning, set SOLR_ULIMIT_CHECKS to false in your profile or solr.in.sh
*** [WARN] ***  Your Max Processes Limit is currently 30000. 
 It should be set to 65000 to avoid operational disruption. 
 If you no longer wish to see this warning, set SOLR_ULIMIT_CHECKS to false in your profile or solr.in.sh
Creating Solr home directory /home/jenkins/jenkins-slave/workspace/Solr/Solr-Smoketest-9.x/_tmp/smoke_1695104411/unpack/solr-9.4.0-java11/example/techproducts/solr

Starting up Solr on port 8983 using command:
"bin/solr" start -p 8983 -s "example/techproducts/solr"

*** [WARN] *** Your open file limit is currently 60000.  
 It should be set to 65000 to avoid operational disruption. 
 If you no longer wish to see this warning, set SOLR_ULIMIT_CHECKS to false in your profile or solr.in.sh
*** [WARN] ***  Your Max Processes Limit is currently 30000. 
 It should be set to 65000 to avoid operational disruption. 
 If you no longer wish to see this warning, set SOLR_ULIMIT_CHECKS to false in your profile or solr.in.sh
Warning: Available entropy is low. As a result, use of the UUIDField, SSL, or any other features that require
RNG might not work properly. To check for the amount of available entropy, use 'cat /proc/sys/kernel/random/entropy_avail'.

Waiting up to 180 seconds to see Solr running on port 8983 [|]   [/]   [-]   [\]   [|]  
Started Solr server on port 8983 (pid=3693). Happy searching!

    
Created new core 'techproducts'
Indexing tech product example docs from /home/jenkins/jenkins-slave/workspace/Solr/Solr-Smoketest-9.x/_tmp/smoke_1695104411/unpack/solr-9.4.0-java11/example/exampledocs
SimplePostTool version 9.4.0
Posting files to [base] url http://localhost:8983/solr/techproducts/update using content-type application/xml...
POSTing file mp500.xml to [base]
POSTing file ipod_video.xml to [base]
POSTing file monitor2.xml to [base]
POSTing file gb18030-example.xml to [base]
POSTing file vidcard.xml to [base]
POSTing file money.xml to [base]
POSTing file hd.xml to [base]
POSTing file ipod_other.xml to [base]
POSTing file sd500.xml to [base]
POSTing file solr.xml to [base]
POSTing file utf8-example.xml to [base]
POSTing file monitor.xml to [base]
POSTing file manufacturers.xml to [base]
POSTing file mem.xml to [base]
14 files indexed.
COMMITting Solr index changes to http://localhost:8983/solr/techproducts/update...
Time spent: 0:00:00.854
      test utf8...
      run query...
      stop server using: bin/solr stop -p 8983
Sending stop command to Solr running on port 8983 ... waiting up to 180 seconds to allow Jetty process 3693 to stop gracefully.
 [|]   [/]   [-]   [\]        unpack solr-9.4.0-slim.tgz...
  solr-9.4.0-slim.tgz
    Checking LICENSE.txt
    Checking NOTICE.txt
    Checking README.txt
    Checking CHANGES.txt
    Checking bin
    Checking docker
    Checking docs
    Checking example
    Checking licenses
    Checking server
    Checking lib
    verify JAR metadata/identity/no javax.* or java.* classes...
      **WARNING**: skipping check of /home/jenkins/jenkins-slave/workspace/Solr/Solr-Smoketest-9.x/_tmp/smoke_1695104411/unpack/solr-9.4.0-slim/server/solr-webapp/webapp/WEB-INF/lib/jakarta.xml.bind-api-2.3.3.jar: it has javax.* classes
      **WARNING**: skipping check of /home/jenkins/jenkins-slave/workspace/Solr/Solr-Smoketest-9.x/_tmp/smoke_1695104411/unpack/solr-9.4.0-slim/server/solr-webapp/webapp/WEB-INF/lib/jakarta.annotation-api-1.3.5.jar: it has javax.* classes
      **WARNING**: skipping check of /home/jenkins/jenkins-slave/workspace/Solr/Solr-Smoketest-9.x/_tmp/smoke_1695104411/unpack/solr-9.4.0-slim/server/solr-webapp/webapp/WEB-INF/lib/jakarta.activation-api-1.2.2.jar: it has javax.* classes
      **WARNING**: skipping check of /home/jenkins/jenkins-slave/workspace/Solr/Solr-Smoketest-9.x/_tmp/smoke_1695104411/unpack/solr-9.4.0-slim/server/solr-webapp/webapp/WEB-INF/lib/jakarta.ws.rs-api-2.1.6.jar: it has javax.* classes
      **WARNING**: skipping check of /home/jenkins/jenkins-slave/workspace/Solr/Solr-Smoketest-9.x/_tmp/smoke_1695104411/unpack/solr-9.4.0-slim/server/solr-webapp/webapp/WEB-INF/lib/jakarta.inject-2.6.1.jar: it has javax.* classes
      **WARNING**: skipping check of /home/jenkins/jenkins-slave/workspace/Solr/Solr-Smoketest-9.x/_tmp/smoke_1695104411/unpack/solr-9.4.0-slim/server/solr-webapp/webapp/WEB-INF/lib/jakarta.validation-api-2.0.2.jar: it has javax.* classes
      **WARNING**: skipping check of /home/jenkins/jenkins-slave/workspace/Solr/Solr-Smoketest-9.x/_tmp/smoke_1695104411/unpack/solr-9.4.0-slim/server/lib/ext/jetty-servlet-api-4.0.6.jar: it has javax.* classes
    copying unpacked distribution for Java 11 ...
    test solr example w/ Java 11...
      start Solr instance (log=/home/jenkins/jenkins-slave/workspace/Solr/Solr-Smoketest-9.x/_tmp/smoke_1695104411/unpack/solr-9.4.0-slim-java11/solr-example.log)...
No process found for Solr node running on port 8983
      Running techproducts example on port 8983 from /home/jenkins/jenkins-slave/workspace/Solr/Solr-Smoketest-9.x/_tmp/smoke_1695104411/unpack/solr-9.4.0-slim-java11
*** [WARN] *** Your open file limit is currently 60000.  
 It should be set to 65000 to avoid operational disruption. 
 If you no longer wish to see this warning, set SOLR_ULIMIT_CHECKS to false in your profile or solr.in.sh
*** [WARN] ***  Your Max Processes Limit is currently 30000. 
 It should be set to 65000 to avoid operational disruption. 
 If you no longer wish to see this warning, set SOLR_ULIMIT_CHECKS to false in your profile or solr.in.sh
Creating Solr home directory /home/jenkins/jenkins-slave/workspace/Solr/Solr-Smoketest-9.x/_tmp/smoke_1695104411/unpack/solr-9.4.0-slim-java11/example/techproducts/solr

Starting up Solr on port 8983 using command:
"bin/solr" start -p 8983 -s "example/techproducts/solr"

*** [WARN] *** Your open file limit is currently 60000.  
 It should be set to 65000 to avoid operational disruption. 
 If you no longer wish to see this warning, set SOLR_ULIMIT_CHECKS to false in your profile or solr.in.sh
*** [WARN] ***  Your Max Processes Limit is currently 30000. 
 It should be set to 65000 to avoid operational disruption. 
 If you no longer wish to see this warning, set SOLR_ULIMIT_CHECKS to false in your profile or solr.in.sh
Warning: Available entropy is low. As a result, use of the UUIDField, SSL, or any other features that require
RNG might not work properly. To check for the amount of available entropy, use 'cat /proc/sys/kernel/random/entropy_avail'.

Waiting up to 180 seconds to see Solr running on port 8983 [|]   [/]   [-]   [\]   [|]  
Started Solr server on port 8983 (pid=4148). Happy searching!

    
Created new core 'techproducts'
Indexing tech product example docs from /home/jenkins/jenkins-slave/workspace/Solr/Solr-Smoketest-9.x/_tmp/smoke_1695104411/unpack/solr-9.4.0-slim-java11/example/exampledocs
SimplePostTool version 9.4.0
Posting files to [base] url http://localhost:8983/solr/techproducts/update using content-type application/xml...
POSTing file mp500.xml to [base]
POSTing file ipod_video.xml to [base]
POSTing file monitor2.xml to [base]
POSTing file gb18030-example.xml to [base]
POSTing file vidcard.xml to [base]
POSTing file money.xml to [base]
POSTing file hd.xml to [base]
POSTing file ipod_other.xml to [base]
POSTing file sd500.xml to [base]
POSTing file solr.xml to [base]
POSTing file utf8-example.xml to [base]
POSTing file monitor.xml to [base]
POSTing file manufacturers.xml to [base]
POSTing file mem.xml to [base]
14 files indexed.
COMMITting Solr index changes to http://localhost:8983/solr/techproducts/update...
Time spent: 0:00:00.829
      test utf8...
      run query...
      stop server using: bin/solr stop -p 8983
Sending stop command to Solr running on port 8983 ... waiting up to 180 seconds to allow Jetty process 4148 to stop gracefully.
 [|]   [/]   [-]   [\]        unpack solr-9.4.0-src.tgz...
  solr-9.4.0-src.tgz
    Checking LICENSE.txt
    Checking NOTICE.txt
    Checking README.md
    Checking CONTRIBUTING.md
    Checking CHANGES.txt
    Checking README.adoc
    Checking buildSrc
    Checking dev-docs
    Checking dev-tools
    Checking gradle
    Checking help
    Checking solr
    Checking build.gradle
    Checking gradlew
    Checking gradlew.bat
    Checking settings.gradle
    Checking versions.lock
    Checking versions.props
    Checking benchmark
    Checking bin
    Checking modules
    Checking api
    Checking core
    Checking docker
    Checking documentation
    Checking example
    Checking licenses
    Checking packaging
    Checking distribution
    Checking prometheus-exporter
    Checking server
    Checking solr-ref-guide
    Checking solrj
    Checking solrj-streaming
    Checking solrj-zookeeper
    Checking test-framework
    Checking webapp
    Checking .gitignore
    Checking .gitattributes
    Checking build.gradle
    make sure no JARs/WARs in src dist...
    run "./gradlew --no-daemon check -p solr/documentation"
    run tests w/ Java 11 and testArgs='-Dtests.nightly=false -Dtests.badapples=false '...

command "export JAVA_HOME="/home/jenkins/tools/java/latest11" PATH="/home/jenkins/tools/java/latest11/bin:$PATH" JAVACMD="/home/jenkins/tools/java/latest11/bin/java"; ./gradlew --no-daemon test -Dtests.nightly=false -Dtests.badapples=false " failed:
To honour the JVM settings for this build a single-use Daemon process will be forked. See https://docs.gradle.org/7.6/userguide/gradle_daemon.html#sec:disabling_the_daemon.
Daemon will be stopped at the end of the build 
Gradle Enterprise plugins resolution: https://plugins.gradle.org/m2
Applying com.gradle.enterprise.gradleplugin.GradleEnterprisePlugin via init script
Connection to Gradle Enterprise: https://ge.apache.org, allowUntrustedServer: false
Enforcing Gradle Enterprise: https://ge.apache.org, allowUntrustedServer: false
Applying com.gradle.CommonCustomUserDataGradlePlugin via init script
> Task :buildSrc:compileJava UP-TO-DATE
> Task :buildSrc:compileGroovy NO-SOURCE
> Task :buildSrc:processResources NO-SOURCE
> Task :buildSrc:classes UP-TO-DATE
> Task :buildSrc:jar UP-TO-DATE
> Task :buildSrc:assemble UP-TO-DATE
> Task :buildSrc:compileTestJava NO-SOURCE
> Task :buildSrc:compileTestGroovy NO-SOURCE
> Task :buildSrc:processTestResources NO-SOURCE
> Task :buildSrc:testClasses UP-TO-DATE
> Task :buildSrc:test NO-SOURCE
> Task :buildSrc:check UP-TO-DATE
> Task :buildSrc:build UP-TO-DATE
> Task :solr:api:processResources NO-SOURCE
> Task :solr:api:processTestResources
> Task :solr:core:processResources UP-TO-DATE
> Task :solr:solrj:processResources UP-TO-DATE
> Task :solr:solrj-streaming:processResources UP-TO-DATE
> Task :solr:solrj-zookeeper:processResources NO-SOURCE
> Task :solr:test-framework:processResources
> Task :solr:benchmark:processResources
> Task :solr:benchmark:processTestResources
> Task :gitStatus
> Task :checkJdkInternalsExportedToGradle
> Task :solr:api:compileJava UP-TO-DATE
> Task :solr:api:classes UP-TO-DATE
> Task :solr:api:jar UP-TO-DATE
> Task :ensureJdkSupported

> Task :randomizationInfo
Running tests with randomization seed: tests.seed=DA69AC48202B65B5

> Task :solr:api:resolve UP-TO-DATE
> Task :solr:core:processTestResources
> Task :solr:modules:analysis-extras:processResources NO-SOURCE
> Task :solr:prometheus-exporter:processResources NO-SOURCE
> Task :solr:prometheus-exporter:processTestResources
> Task :solr:server:compileJava SKIPPED
> Task :solr:server:processResources NO-SOURCE
> Task :solr:server:classes UP-TO-DATE
> Task :solr:server:compileTestJava NO-SOURCE
> Task :solr:server:processTestResources NO-SOURCE
> Task :solr:server:testClasses UP-TO-DATE
> Task :solr:server:test NO-SOURCE
> Task :solr:server:wipeTaskTemp
> Task :solr:solr-ref-guide:compileJava NO-SOURCE
> Task :solr:solr-ref-guide:processResources NO-SOURCE
> Task :solr:solr-ref-guide:classes UP-TO-DATE
> Task :solr:solr-ref-guide:copySolrjTestResources
> Task :solr:solr-ref-guide:processTestResources NO-SOURCE
> Task :solr:solrj-streaming:processTestResources
> Task :solr:modules:sql:processResources
> Task :solr:solrj-zookeeper:processTestResources
> Task :solr:test-framework:processTestResources
> Task :solr:webapp:processResources NO-SOURCE
> Task :solr:webapp:processTestResources NO-SOURCE
> Task :solr:modules:analysis-extras:processTestResources
> Task :solr:modules:analytics:processResources NO-SOURCE
> Task :solr:modules:analytics:processTestResources
> Task :solr:modules:clustering:processResources NO-SOURCE
> Task :solr:modules:clustering:processTestResources
> Task :solr:modules:extraction:processResources
> Task :solr:modules:extraction:processTestResources
> Task :solr:modules:gcs-repository:processResources NO-SOURCE
> Task :solr:modules:gcs-repository:processTestResources
> Task :solr:modules:hadoop-auth:processResources NO-SOURCE
> Task :solr:modules:hadoop-auth:copySolrCoreTestResources
> Task :solr:modules:hadoop-auth:processTestResources
> Task :solr:modules:hdfs:processResources NO-SOURCE
> Task :solr:modules:hdfs:copySolrCoreTestResources
> Task :solr:modules:hdfs:processTestResources
> Task :solr:modules:jaegertracer-configurator:processResources NO-SOURCE
> Task :solr:modules:jaegertracer-configurator:processTestResources
> Task :solr:modules:jwt-auth:processResources NO-SOURCE
> Task :solr:modules:jwt-auth:processTestResources
> Task :solr:modules:langid:processResources
> Task :solr:modules:langid:processTestResources
> Task :solr:modules:ltr:processResources NO-SOURCE
> Task :solr:modules:ltr:processTestResources
> Task :solr:modules:opentelemetry:processResources NO-SOURCE
> Task :solr:modules:opentelemetry:processTestResources
> Task :solr:modules:s3-repository:processResources NO-SOURCE
> Task :solr:modules:s3-repository:processTestResources
> Task :solr:modules:scripting:processResources NO-SOURCE
> Task :solr:modules:scripting:processTestResources
> Task :solr:modules:sql:copySolrCoreTestResources
> Task :solr:modules:sql:processTestResources

> Task :solr:solrj:openApiGenerate
################################################################################
# Thanks for using OpenAPI Generator.                                          #
# Please consider donation to help us maintain this project ๐Ÿ™                 #
# https://opencollective.com/openapi_generator/donate                          #
################################################################################
Successfully generated code to /home/jenkins/jenkins-slave/workspace/Solr/Solr-Smoketest-9.x/_tmp/smoke_1695104411/unpack/solr-9.4.0/solr/solrj/build/generated/

> Task :spotlessInternalRegisterDependencies UP-TO-DATE
> Task :solr:solrj:compileJava UP-TO-DATE
> Task :solr:solrj-streaming:compileJava UP-TO-DATE
> Task :solr:solrj-zookeeper:compileJava UP-TO-DATE
> Task :solr:core:compileJava UP-TO-DATE
> Task :solr:test-framework:compileJava UP-TO-DATE
> Task :solr:solrj:generatedSpotlessHelper
> Task :solr:solrj:generatedSpotless
> Task :solr:core:classes UP-TO-DATE
> Task :solr:core:jar UP-TO-DATE
> Task :solr:solrj:classes UP-TO-DATE
> Task :solr:solrj:jar UP-TO-DATE
> Task :solr:solrj-streaming:classes UP-TO-DATE
> Task :solr:solrj-streaming:jar UP-TO-DATE
> Task :solr:solrj-zookeeper:classes UP-TO-DATE
> Task :solr:solrj-zookeeper:jar UP-TO-DATE
> Task :solr:test-framework:classes
> Task :solr:test-framework:jar
> Task :solr:api:compileTestJava
> Task :solr:api:testClasses

> Task :solr:benchmark:compileJava
Note: /home/jenkins/jenkins-slave/workspace/Solr/Solr-Smoketest-9.x/_tmp/smoke_1695104411/unpack/solr-9.4.0/solr/benchmark/src/java/org/apache/solr/bench/search/StreamingSearch.java uses or overrides a deprecated API.
Note: Recompile with -Xlint:deprecation for details.

> Task :solr:benchmark:classes
> Task :solr:benchmark:compileTestJava
> Task :solr:benchmark:testClasses

> Task :solr:api:test
:solr:api:test (SUCCESS): 6 test(s)

> Task :solr:api:wipeTaskTemp

> Task :solr:benchmark:test
:solr:benchmark:test (SUCCESS): 11 test(s)

> Task :solr:benchmark:wipeTaskTemp

> Task :solr:modules:analysis-extras:compileJava
Note: /home/jenkins/jenkins-slave/workspace/Solr/Solr-Smoketest-9.x/_tmp/smoke_1695104411/unpack/solr-9.4.0/solr/modules/analysis-extras/src/java/org/apache/solr/schema/ICUCollationField.java uses or overrides a deprecated API.
Note: Recompile with -Xlint:deprecation for details.

> Task :solr:modules:analysis-extras:classes
> Task :solr:modules:analysis-extras:jar

> Task :solr:prometheus-exporter:compileJava
Note: Some input files use or override a deprecated API.
Note: Recompile with -Xlint:deprecation for details.

> Task :solr:prometheus-exporter:classes

> Task :solr:prometheus-exporter:compileTestJava
Note: /home/jenkins/jenkins-slave/workspace/Solr/Solr-Smoketest-9.x/_tmp/smoke_1695104411/unpack/solr-9.4.0/solr/prometheus-exporter/src/test/org/apache/solr/prometheus/exporter/MetricsQueryTemplateTest.java uses or overrides a deprecated API.
Note: Recompile with -Xlint:deprecation for details.

> Task :solr:prometheus-exporter:testClasses
> Task :solr:core:compileTestJava

> Task :solr:prometheus-exporter:test
:solr:prometheus-exporter:test (SUCCESS): 22 test(s)

> Task :solr:prometheus-exporter:wipeTaskTemp

> Task :solr:solr-ref-guide:compileTestJava
Note: Some input files use or override a deprecated API.
Note: Recompile with -Xlint:deprecation for details.

> Task :solr:solr-ref-guide:testClasses

> Task :solr:core:compileTestJava
Note: Some input files use or override a deprecated API.
Note: Recompile with -Xlint:deprecation for details.

> Task :solr:core:testClasses

> Task :solr:solr-ref-guide:test
:solr:solr-ref-guide:test (SUCCESS): 32 test(s)

> Task :solr:solr-ref-guide:wipeTaskTemp

> Task :solr:solrj:compileTestJava
Note: Some input files use or override a deprecated API.
Note: Recompile with -Xlint:deprecation for details.

> Task :solr:core:test
WARNING: Test org.apache.solr.TestRandomFaceting wrote 14,160,576 bytes of output.
WARNING: Test org.apache.solr.schema.TestCloudSchemaless wrote 12,873,932 bytes of output.

org.apache.solr.search.TestCoordinatorRole > testConfigset FAILED
    javax.net.ssl.SSLHandshakeException: PKIX path building failed: sun.security.provider.certpath.SunCertPathBuilderException: unable to find valid certification path to requested target
        at __randomizedtesting.SeedInfo.seed([DA69AC48202B65B5:C92F129214ED639D]:0)
        at java.base/sun.security.ssl.Alert.createSSLException(Alert.java:131)
        at java.base/sun.security.ssl.TransportContext.fatal(TransportContext.java:353)
        at java.base/sun.security.ssl.TransportContext.fatal(TransportContext.java:296)
        at java.base/sun.security.ssl.TransportContext.fatal(TransportContext.java:291)
        at java.base/sun.security.ssl.CertificateMessage$T13CertificateConsumer.checkServerCerts(CertificateMessage.java:1357)
        at java.base/sun.security.ssl.CertificateMessage$T13CertificateConsumer.onConsumeCertificate(CertificateMessage.java:1232)
        at java.base/sun.security.ssl.CertificateMessage$T13CertificateConsumer.consume(CertificateMessage.java:1175)
        at java.base/sun.security.ssl.SSLHandshake.consume(SSLHandshake.java:392)
        at java.base/sun.security.ssl.HandshakeContext.dispatch(HandshakeContext.java:443)
        at java.base/sun.security.ssl.HandshakeContext.dispatch(HandshakeContext.java:421)
        at java.base/sun.security.ssl.TransportContext.dispatch(TransportContext.java:183)
        at java.base/sun.security.ssl.SSLTransport.decode(SSLTransport.java:172)
        at java.base/sun.security.ssl.SSLSocketImpl.decode(SSLSocketImpl.java:1506)
        at java.base/sun.security.ssl.SSLSocketImpl.readHandshakeRecord(SSLSocketImpl.java:1416)
        at java.base/sun.security.ssl.SSLSocketImpl.startHandshake(SSLSocketImpl.java:456)
        at java.base/sun.security.ssl.SSLSocketImpl.startHandshake(SSLSocketImpl.java:427)
        at java.base/sun.net.www.protocol.https.HttpsClient.afterConnect(HttpsClient.java:572)
        at java.base/sun.net.www.protocol.https.AbstractDelegateHttpsURLConnection.connect(AbstractDelegateHttpsURLConnection.java:201)
        at java.base/sun.net.www.protocol.https.HttpsURLConnectionImpl.connect(HttpsURLConnectionImpl.java:168)
        at org.apache.solr.search.TestCoordinatorRole.testConfigset(TestCoordinatorRole.java:626)
        at java.base/jdk.internal.reflect.NativeMethodAccessorImpl.invoke0(Native Method)
        at java.base/jdk.internal.reflect.NativeMethodAccessorImpl.invoke(NativeMethodAccessorImpl.java:62)
        at java.base/jdk.internal.reflect.DelegatingMethodAccessorImpl.invoke(DelegatingMethodAccessorImpl.java:43)
        at java.base/java.lang.reflect.Method.invoke(Method.java:566)
        at com.carrotsearch.randomizedtesting.RandomizedRunner.invoke(RandomizedRunner.java:1758)
        at com.carrotsearch.randomizedtesting.RandomizedRunner$8.evaluate(RandomizedRunner.java:946)
        at com.carrotsearch.randomizedtesting.RandomizedRunner$9.evaluate(RandomizedRunner.java:982)
        at com.carrotsearch.randomizedtesting.RandomizedRunner$10.evaluate(RandomizedRunner.java:996)
        at com.carrotsearch.randomizedtesting.rules.SystemPropertiesRestoreRule$1.evaluate(SystemPropertiesRestoreRule.java:80)
        at org.junit.rules.RunRules.evaluate(RunRules.java:20)
        at org.apache.lucene.tests.util.TestRuleSetupTeardownChained$1.evaluate(TestRuleSetupTeardownChained.java:48)
        at org.apache.lucene.tests.util.AbstractBeforeAfterRule$1.evaluate(AbstractBeforeAfterRule.java:43)
        at org.apache.lucene.tests.util.TestRuleThreadAndTestName$1.evaluate(TestRuleThreadAndTestName.java:45)
        at org.apache.lucene.tests.util.TestRuleIgnoreAfterMaxFailures$1.evaluate(TestRuleIgnoreAfterMaxFailures.java:60)
        at org.apache.lucene.tests.util.TestRuleMarkFailure$1.evaluate(TestRuleMarkFailure.java:44)
        at org.junit.rules.RunRules.evaluate(RunRules.java:20)
        at com.carrotsearch.randomizedtesting.rules.StatementAdapter.evaluate(StatementAdapter.java:36)
        at com.carrotsearch.randomizedtesting.ThreadLeakControl$StatementRunner.run(ThreadLeakControl.java:390)
        at com.carrotsearch.randomizedtesting.ThreadLeakControl.forkTimeoutingTask(ThreadLeakControl.java:843)
        at com.carrotsearch.randomizedtesting.ThreadLeakControl$3.evaluate(ThreadLeakControl.java:490)
        at com.carrotsearch.randomizedtesting.RandomizedRunner.runSingleTest(RandomizedRunner.java:955)
        at com.carrotsearch.randomizedtesting.RandomizedRunner$5.evaluate(RandomizedRunner.java:840)
        at com.carrotsearch.randomizedtesting.RandomizedRunner$6.evaluate(RandomizedRunner.java:891)
        at com.carrotsearch.randomizedtesting.RandomizedRunner$7.evaluate(RandomizedRunner.java:902)
        at com.carrotsearch.randomizedtesting.rules.StatementAdapter.evaluate(StatementAdapter.java:36)
        at com.carrotsearch.randomizedtesting.rules.StatementAdapter.evaluate(StatementAdapter.java:36)
        at org.apache.lucene.tests.util.AbstractBeforeAfterRule$1.evaluate(AbstractBeforeAfterRule.java:43)
        at org.apache.lucene.tests.util.AbstractBeforeAfterRule$1.evaluate(AbstractBeforeAfterRule.java:43)
        at com.carrotsearch.randomizedtesting.rules.SystemPropertiesRestoreRule$1.evaluate(SystemPropertiesRestoreRule.java:80)
        at org.junit.rules.RunRules.evaluate(RunRules.java:20)
        at org.apache.lucene.tests.util.AbstractBeforeAfterRule$1.evaluate(AbstractBeforeAfterRule.java:43)
        at com.carrotsearch.randomizedtesting.rules.StatementAdapter.evaluate(StatementAdapter.java:36)
        at org.apache.lucene.tests.util.TestRuleStoreClassName$1.evaluate(TestRuleStoreClassName.java:38)
        at com.carrotsearch.randomizedtesting.rules.NoShadowingOrOverridesOnMethodsRule$1.evaluate(NoShadowingOrOverridesOnMethodsRule.java:40)
        at com.carrotsearch.randomizedtesting.rules.NoShadowingOrOverridesOnMethodsRule$1.evaluate(NoShadowingOrOverridesOnMethodsRule.java:40)
        at com.carrotsearch.randomizedtesting.rules.StatementAdapter.evaluate(StatementAdapter.java:36)
        at com.carrotsearch.randomizedtesting.rules.StatementAdapter.evaluate(StatementAdapter.java:36)
        at org.apache.lucene.tests.util.TestRuleAssertionsRequired$1.evaluate(TestRuleAssertionsRequired.java:53)
        at org.apache.lucene.tests.util.AbstractBeforeAfterRule$1.evaluate(AbstractBeforeAfterRule.java:43)
        at org.apache.lucene.tests.util.TestRuleMarkFailure$1.evaluate(TestRuleMarkFailure.java:44)
        at org.apache.lucene.tests.util.TestRuleIgnoreAfterMaxFailures$1.evaluate(TestRuleIgnoreAfterMaxFailures.java:60)
        at org.apache.lucene.tests.util.TestRuleIgnoreTestSuites$1.evaluate(TestRuleIgnoreTestSuites.java:47)
        at org.junit.rules.RunRules.evaluate(RunRules.java:20)
        at com.carrotsearch.randomizedtesting.rules.StatementAdapter.evaluate(StatementAdapter.java:36)
        at com.carrotsearch.randomizedtesting.ThreadLeakControl$StatementRunner.run(ThreadLeakControl.java:390)
        at com.carrotsearch.randomizedtesting.ThreadLeakControl.lambda$forkTimeoutingTask$0(ThreadLeakControl.java:850)
        at java.base/java.lang.Thread.run(Thread.java:829)

        Caused by:
        sun.security.validator.ValidatorException: PKIX path building failed: sun.security.provider.certpath.SunCertPathBuilderException: unable to find valid certification path to requested target
            at java.base/sun.security.validator.PKIXValidator.doBuild(PKIXValidator.java:439)
            at java.base/sun.security.validator.PKIXValidator.engineValidate(PKIXValidator.java:306)
            at java.base/sun.security.validator.Validator.validate(Validator.java:264)
            at java.base/sun.security.ssl.X509TrustManagerImpl.validate(X509TrustManagerImpl.java:313)
            at java.base/sun.security.ssl.X509TrustManagerImpl.checkTrusted(X509TrustManagerImpl.java:222)
            at java.base/sun.security.ssl.X509TrustManagerImpl.checkServerTrusted(X509TrustManagerImpl.java:129)
            at java.base/sun.security.ssl.CertificateMessage$T13CertificateConsumer.checkServerCerts(CertificateMessage.java:1341)
            ... 62 more

            Caused by:
            sun.security.provider.certpath.SunCertPathBuilderException: unable to find valid certification path to requested target
                at java.base/sun.security.provider.certpath.SunCertPathBuilder.build(SunCertPathBuilder.java:141)
                at java.base/sun.security.provider.certpath.SunCertPathBuilder.engineBuild(SunCertPathBuilder.java:126)
                at java.base/java.security.cert.CertPathBuilder.build(CertPathBuilder.java:297)
                at java.base/sun.security.validator.PKIXValidator.doBuild(PKIXValidator.java:434)
                ... 68 more

org.apache.solr.search.TestCoordinatorRole > test suite's output saved to /home/jenkins/jenkins-slave/workspace/Solr/Solr-Smoketest-9.x/_tmp/smoke_1695104411/unpack/solr-9.4.0/solr/core/build/test-results/test/outputs/OUTPUT-org.apache.solr.search.TestCoordinatorRole.txt, copied below:
  2> 1735781 INFO  (SUITE-TestCoordinatorRole-seed#[DA69AC48202B65B5]-worker) [] o.a.s.SolrTestCase Setting 'solr.default.confdir' system property to test-framework derived value of '/home/jenkins/jenkins-slave/workspace/Solr/Solr-Smoketest-9.x/_tmp/smoke_1695104411/unpack/solr-9.4.0/solr/server/solr/configsets/_default/conf'
  2> 1735782 INFO  (SUITE-TestCoordinatorRole-seed#[DA69AC48202B65B5]-worker) [] o.a.s.u.ErrorLogMuter Closing ErrorLogMuter-regex-1380 after mutting 0 log messages
  2> 1735782 INFO  (SUITE-TestCoordinatorRole-seed#[DA69AC48202B65B5]-worker) [] o.a.s.u.ErrorLogMuter Creating ErrorLogMuter-regex-1381 for ERROR logs matching regex: ignore_exception
  2> 1735782 INFO  (SUITE-TestCoordinatorRole-seed#[DA69AC48202B65B5]-worker) [] o.a.s.SolrTestCaseJ4 Created dataDir: /home/jenkins/jenkins-slave/workspace/Solr/Solr-Smoketest-9.x/_tmp/smoke_1695104411/unpack/solr-9.4.0/solr/core/build/tmp/tests-tmp/solr.search.TestCoordinatorRole_DA69AC48202B65B5-001/data-dir-361-001
  2> 1735782 WARN  (SUITE-TestCoordinatorRole-seed#[DA69AC48202B65B5]-worker) [] o.a.s.SolrTestCaseJ4 startTrackingSearchers: numOpens=7 numCloses=7
  2> 1735782 INFO  (SUITE-TestCoordinatorRole-seed#[DA69AC48202B65B5]-worker) [] o.a.s.SolrTestCaseJ4 Using PointFields (NUMERIC_POINTS_SYSPROP=true) w/NUMERIC_DOCVALUES_SYSPROP=false
  2> 1735783 INFO  (SUITE-TestCoordinatorRole-seed#[DA69AC48202B65B5]-worker) [] o.a.s.SolrTestCaseJ4 Randomized ssl (true) and clientAuth (false) via: @org.apache.solr.util.RandomizeSSL(reason="", ssl=0.0/0.0, value=0.0/0.0, clientAuth=0.0/0.0)
  2> 1735783 INFO  (SUITE-TestCoordinatorRole-seed#[DA69AC48202B65B5]-worker) [] o.a.s.SolrTestCaseJ4 SecureRandom sanity checks: test.solr.allowed.securerandom=null & java.security.egd=file:/dev/./urandom
  2> 1735787 INFO  (TEST-TestCoordinatorRole.testConcurrentAccess-seed#[DA69AC48202B65B5]) [] o.a.s.SolrTestCaseJ4 ###Starting testConcurrentAccess
  2> 1735787 INFO  (TEST-TestCoordinatorRole.testConcurrentAccess-seed#[DA69AC48202B65B5]) [] o.a.s.u.t.SimplePropagator Always-on trace id generation enabled.
  2> 1735787 INFO  (TEST-TestCoordinatorRole.testConcurrentAccess-seed#[DA69AC48202B65B5]) [] o.a.s.c.MiniSolrCloudCluster Starting cluster of 2 servers in /home/jenkins/jenkins-slave/workspace/Solr/Solr-Smoketest-9.x/_tmp/smoke_1695104411/unpack/solr-9.4.0/solr/core/build/tmp/tests-tmp/solr.search.TestCoordinatorRole_DA69AC48202B65B5-001/tempDir-001
  2> 1735787 INFO  (TEST-TestCoordinatorRole.testConcurrentAccess-seed#[DA69AC48202B65B5]) [] o.a.s.c.ZkTestServer STARTING ZK TEST SERVER
  2> 1735787 INFO  (ZkTestServer Run Thread) [] o.a.s.c.ZkTestServer client port: 0.0.0.0/0.0.0.0:0
  2> 1735788 INFO  (ZkTestServer Run Thread) [] o.a.s.c.ZkTestServer Starting server
  2> 1735789 WARN  (ZkTestServer Run Thread) [] o.a.z.s.ServerCnxnFactory maxCnxns is not configured, using default value 0.
  2> 1735888 INFO  (TEST-TestCoordinatorRole.testConcurrentAccess-seed#[DA69AC48202B65B5]) [] o.a.s.c.ZkTestServer start zk server on port: 37473
  2> 1735889 WARN  (TEST-TestCoordinatorRole.testConcurrentAccess-seed#[DA69AC48202B65B5]) [] o.a.s.c.c.SolrZkClient Using default ZkCredentialsInjector. ZkCredentialsInjector is not secure, it creates an empty list of credentials which leads to 'OPEN_ACL_UNSAFE' ACLs to Zookeeper nodes
  2> 1735889 INFO  (TEST-TestCoordinatorRole.testConcurrentAccess-seed#[DA69AC48202B65B5]) [] o.a.s.c.c.ConnectionManager Waiting up to 30000ms for client to connect to ZooKeeper
  2> 1735891 INFO  (zkConnectionManagerCallback-26680-thread-1) [] o.a.s.c.c.ConnectionManager zkClient has connected
  2> 1735891 INFO  (TEST-TestCoordinatorRole.testConcurrentAccess-seed#[DA69AC48202B65B5]) [] o.a.s.c.c.ConnectionManager Client is connected to ZooKeeper
  2> 1735891 WARN  (TEST-TestCoordinatorRole.testConcurrentAccess-seed#[DA69AC48202B65B5]) [] o.a.s.c.c.SolrZkClient Using default ZkACLProvider. DefaultZkACLProvider is not secure, it creates 'OPEN_ACL_UNSAFE' ACLs to Zookeeper nodes
  2> 1735892 WARN  (TEST-TestCoordinatorRole.testConcurrentAccess-seed#[DA69AC48202B65B5]) [] o.a.s.c.c.SolrZkClient Using default ZkCredentialsInjector. ZkCredentialsInjector is not secure, it creates an empty list of credentials which leads to 'OPEN_ACL_UNSAFE' ACLs to Zookeeper nodes
  2> 1735893 INFO  (TEST-TestCoordinatorRole.testConcurrentAccess-seed#[DA69AC48202B65B5]) [] o.a.s.c.c.ConnectionManager Waiting up to 30000ms for client to connect to ZooKeeper
  2> 1735893 INFO  (zkConnectionManagerCallback-26682-thread-1) [] o.a.s.c.c.ConnectionManager zkClient has connected
  2> 1735894 INFO  (TEST-TestCoordinatorRole.testConcurrentAccess-seed#[DA69AC48202B65B5]) [] o.a.s.c.c.ConnectionManager Client is connected to ZooKeeper
  2> 1735894 WARN  (TEST-TestCoordinatorRole.testConcurrentAccess-seed#[DA69AC48202B65B5]) [] o.a.s.c.c.SolrZkClient Using default ZkACLProvider. DefaultZkACLProvider is not secure, it creates 'OPEN_ACL_UNSAFE' ACLs to Zookeeper nodes
  2> 1735894 WARN  (TEST-TestCoordinatorRole.testConcurrentAccess-seed#[DA69AC48202B65B5]) [] o.a.s.c.c.SolrZkClient Using default ZkCredentialsInjector. ZkCredentialsInjector is not secure, it creates an empty list of credentials which leads to 'OPEN_ACL_UNSAFE' ACLs to Zookeeper nodes
  2> 1735897 INFO  (TEST-TestCoordinatorRole.testConcurrentAccess-seed#[DA69AC48202B65B5]) [] o.a.s.c.c.ConnectionManager Waiting up to 15000ms for client to connect to ZooKeeper
  2> 1735898 INFO  (zkConnectionManagerCallback-26684-thread-1) [] o.a.s.c.c.ConnectionManager zkClient has connected
  2> 1735898 INFO  (TEST-TestCoordinatorRole.testConcurrentAccess-seed#[DA69AC48202B65B5]) [] o.a.s.c.c.ConnectionManager Client is connected to ZooKeeper
  2> 1735898 WARN  (TEST-TestCoordinatorRole.testConcurrentAccess-seed#[DA69AC48202B65B5]) [] o.a.s.c.c.SolrZkClient Using default ZkACLProvider. DefaultZkACLProvider is not secure, it creates 'OPEN_ACL_UNSAFE' ACLs to Zookeeper nodes
  2> 1736002 INFO  (jetty-launcher-26685-thread-2) [] o.a.s.e.JettySolrRunner Start Jetty (configured port=0, binding port=0)
  2> 1736002 INFO  (jetty-launcher-26685-thread-1) [] o.a.s.e.JettySolrRunner Start Jetty (configured port=0, binding port=0)
  2> 1736003 INFO  (jetty-launcher-26685-thread-2) [] o.a.s.e.JettySolrRunner Trying to start Jetty on port 0 try number 2 ...
  2> 1736003 INFO  (jetty-launcher-26685-thread-1) [] o.a.s.e.JettySolrRunner Trying to start Jetty on port 0 try number 2 ...
  2> 1736003 INFO  (jetty-launcher-26685-thread-2) [] o.e.j.s.Server jetty-10.0.16; built: 2023-08-25T19:11:25.422Z; git: a2735a9ae9d1afc124974253f1e223e5678be1f4; jvm 11.0.16.1+1
  2> 1736004 INFO  (jetty-launcher-26685-thread-1) [] o.e.j.s.Server jetty-10.0.16; built: 2023-08-25T19:11:25.422Z; git: a2735a9ae9d1afc124974253f1e223e5678be1f4; jvm 11.0.16.1+1
  2> 1736005 INFO  (jetty-launcher-26685-thread-2) [] o.e.j.s.s.DefaultSessionIdManager Session workerName=node0
  2> 1736005 INFO  (jetty-launcher-26685-thread-1) [] o.e.j.s.s.DefaultSessionIdManager Session workerName=node0
  2> 1736005 INFO  (jetty-launcher-26685-thread-2) [] o.e.j.s.h.ContextHandler Started o.e.j.s.ServletContextHandler@2db6d09{/solr,file:///home/jenkins/jenkins-slave/workspace/Solr/Solr-Smoketest-9.x/_tmp/smoke_1695104411/unpack/solr-9.4.0/solr/core/build/tmp/tests-cwd/,AVAILABLE}
  2> 1736005 INFO  (jetty-launcher-26685-thread-1) [] o.e.j.s.h.ContextHandler Started o.e.j.s.ServletContextHandler@1a9c9cd{/solr,file:///home/jenkins/jenkins-slave/workspace/Solr/Solr-Smoketest-9.x/_tmp/smoke_1695104411/unpack/solr-9.4.0/solr/core/build/tmp/tests-cwd/,AVAILABLE}
  2> 1736006 INFO  (jetty-launcher-26685-thread-2) [] o.e.j.s.AbstractConnector Started ServerConnector@3b230d61{ssl, (ssl, alpn, http/1.1, h2)}{127.0.0.1:41411}
  2> 1736006 INFO  (jetty-launcher-26685-thread-2) [] o.e.j.s.Server Started Server@7dcb2fc7{STARTING}[10.0.16,sto=0] @1736031ms
  2> 1736006 INFO  (jetty-launcher-26685-thread-1) [] o.e.j.s.AbstractConnector Started ServerConnector@1c3b515a{ssl, (ssl, alpn, http/1.1, h2)}{127.0.0.1:42895}
  2> 1736006 INFO  (jetty-launcher-26685-thread-1) [] o.e.j.s.Server Started Server@4518befa{STARTING}[10.0.16,sto=0] @1736031ms
  2> 1736006 ERROR (jetty-launcher-26685-thread-2) [] o.a.s.u.StartupLoggingUtils Missing Java Option solr.log.dir. Logging may be missing or incomplete.
  2> 1736006 INFO  (jetty-launcher-26685-thread-2) [] o.a.s.s.CoreContainerProvider Using logger factory org.apache.logging.slf4j.Log4jLoggerFactory
  2> 1736006 ERROR (jetty-launcher-26685-thread-1) [] o.a.s.u.StartupLoggingUtils Missing Java Option solr.log.dir. Logging may be missing or incomplete.
  2> 1736006 INFO  (jetty-launcher-26685-thread-1) [] o.a.s.s.CoreContainerProvider Using logger factory org.apache.logging.slf4j.Log4jLoggerFactory
  2> 1736006 INFO  (jetty-launcher-26685-thread-2) [] o.a.s.s.CoreContainerProvider  ___      _       Welcome to Apache Solrโ„ข version 9.4.0
  2> 1736006 INFO  (jetty-launcher-26685-thread-1) [] o.a.s.s.CoreContainerProvider  ___      _       Welcome to Apache Solrโ„ข version 9.4.0
  2> 1736006 INFO  (jetty-launcher-26685-thread-2) [] o.a.s.s.CoreContainerProvider / __| ___| |_ _   Starting in cloud mode on port null
  2> 1736006 INFO  (jetty-launcher-26685-thread-1) [] o.a.s.s.CoreContainerProvider / __| ___| |_ _   Starting in cloud mode on port null
  2> 1736006 INFO  (jetty-launcher-26685-thread-2) [] o.a.s.s.CoreContainerProvider \__ \/ _ \ | '_|  Install dir: /home/jenkins/jenkins-slave/workspace/Solr/Solr-Smoketest-9.x/_tmp/smoke_1695104411/unpack/solr-9.4.0/solr
  2> 1736006 INFO  (jetty-launcher-26685-thread-1) [] o.a.s.s.CoreContainerProvider \__ \/ _ \ | '_|  Install dir: /home/jenkins/jenkins-slave/workspace/Solr/Solr-Smoketest-9.x/_tmp/smoke_1695104411/unpack/solr-9.4.0/solr
  2> 1736006 INFO  (jetty-launcher-26685-thread-2) [] o.a.s.s.CoreContainerProvider |___/\___/_|_|    Start time: 2023-09-19T06:55:40.408735Z
  2> 1736006 INFO  (jetty-launcher-26685-thread-1) [] o.a.s.s.CoreContainerProvider |___/\___/_|_|    Start time: 2023-09-19T06:55:40.408743Z
  2> 1736006 INFO  (jetty-launcher-26685-thread-2) [] o.a.s.s.CoreContainerProvider Solr Home: /home/jenkins/jenkins-slave/workspace/Solr/Solr-Smoketest-9.x/_tmp/smoke_1695104411/unpack/solr-9.4.0/solr/core/build/tmp/tests-tmp/solr.search.TestCoordinatorRole_DA69AC48202B65B5-001/tempDir-001/node2 (source: servlet config: solr.solr.home)
  2> 1736006 WARN  (jetty-launcher-26685-thread-2) [] o.a.s.c.c.SolrZkClient Using default ZkCredentialsInjector. ZkCredentialsInjector is not secure, it creates an empty list of credentials which leads to 'OPEN_ACL_UNSAFE' ACLs to Zookeeper nodes
  2> 1736006 INFO  (jetty-launcher-26685-thread-1) [] o.a.s.s.CoreContainerProvider Solr Home: /home/jenkins/jenkins-slave/workspace/Solr/Solr-Smoketest-9.x/_tmp/smoke_1695104411/unpack/solr-9.4.0/solr/core/build/tmp/tests-tmp/solr.search.TestCoordinatorRole_DA69AC48202B65B5-001/tempDir-001/node1 (source: servlet config: solr.solr.home)
  2> 1736007 WARN  (jetty-launcher-26685-thread-1) [] o.a.s.c.c.SolrZkClient Using default ZkCredentialsInjector. ZkCredentialsInjector is not secure, it creates an empty list of credentials which leads to 'OPEN_ACL_UNSAFE' ACLs to Zookeeper nodes
  2> 1736009 INFO  (jetty-launcher-26685-thread-2) [] o.a.s.c.c.ConnectionManager Waiting up to 30000ms for client to connect to ZooKeeper
  2> 1736013 INFO  (jetty-launcher-26685-thread-1) [] o.a.s.c.c.ConnectionManager Waiting up to 30000ms for client to connect to ZooKeeper
  2> 1736017 INFO  (zkConnectionManagerCallback-26687-thread-1) [] o.a.s.c.c.ConnectionManager zkClient has connected
  2> 1736017 INFO  (zkConnectionManagerCallback-26689-thread-1) [] o.a.s.c.c.ConnectionManager zkClient has connected
  2> 1736017 INFO  (jetty-launcher-26685-thread-2) [] o.a.s.c.c.ConnectionManager Client is connected to ZooKeeper
  2> 1736017 WARN  (jetty-launcher-26685-thread-2) [] o.a.s.c.c.SolrZkClient Using default ZkACLProvider. DefaultZkACLProvider is not secure, it creates 'OPEN_ACL_UNSAFE' ACLs to Zookeeper nodes
  2> 1736017 INFO  (jetty-launcher-26685-thread-1) [] o.a.s.c.c.ConnectionManager Client is connected to ZooKeeper
  2> 1736017 WARN  (jetty-launcher-26685-thread-1) [] o.a.s.c.c.SolrZkClient Using default ZkACLProvider. DefaultZkACLProvider is not secure, it creates 'OPEN_ACL_UNSAFE' ACLs to Zookeeper nodes
  2> 1736018 INFO  (jetty-launcher-26685-thread-2) [] o.a.s.c.NodeConfig solr.xml found in ZooKeeper. Loading...
  2> 1736018 INFO  (jetty-launcher-26685-thread-1) [] o.a.s.c.NodeConfig solr.xml found in ZooKeeper. Loading...
  2> 1736019 INFO  (jetty-launcher-26685-thread-2) [] o.a.s.c.SolrXmlConfig Metrics collection is disabled.
  2> 1736020 INFO  (jetty-launcher-26685-thread-1) [] o.a.s.c.SolrXmlConfig Metrics collection is disabled.
  2> 1736122 WARN  (jetty-launcher-26685-thread-2) [] o.e.j.u.s.S.config Trusting all certificates configured for Client@46b1efd8[provider=null,keyStore=null,trustStore=null]
  2> 1736122 WARN  (jetty-launcher-26685-thread-2) [] o.e.j.u.s.S.config No Client EndPointIdentificationAlgorithm configured for Client@46b1efd8[provider=null,keyStore=null,trustStore=null]
  2> 1736123 WARN  (jetty-launcher-26685-thread-1) [] o.e.j.u.s.S.config Trusting all certificates configured for Client@26ba9f76[provider=null,keyStore=null,trustStore=null]
  2> 1736123 WARN  (jetty-launcher-26685-thread-1) [] o.e.j.u.s.S.config No Client EndPointIdentificationAlgorithm configured for Client@26ba9f76[provider=null,keyStore=null,trustStore=null]
  2> 1736125 WARN  (jetty-launcher-26685-thread-2) [] o.e.j.u.s.S.config Trusting all certificates configured for Client@f105d2e[provider=null,keyStore=null,trustStore=null]
  2> 1736125 WARN  (jetty-launcher-26685-thread-2) [] o.e.j.u.s.S.config No Client EndPointIdentificationAlgorithm configured for Client@f105d2e[provider=null,keyStore=null,trustStore=null]
  2> 1736125 WARN  (jetty-launcher-26685-thread-1) [] o.e.j.u.s.S.config Trusting all certificates configured for Client@50dc0ca6[provider=null,keyStore=null,trustStore=null]
  2> 1736125 WARN  (jetty-launcher-26685-thread-1) [] o.e.j.u.s.S.config No Client EndPointIdentificationAlgorithm configured for Client@50dc0ca6[provider=null,keyStore=null,trustStore=null]
  2> 1736126 INFO  (jetty-launcher-26685-thread-2) [] o.a.s.c.ZkContainer Zookeeper client=127.0.0.1:37473/solr
  2> 1736126 INFO  (jetty-launcher-26685-thread-2) [] o.a.s.c.DistributedClusterStateUpdater Creating DistributedClusterStateUpdater with useDistributedStateUpdate=true. Solr will be using distributed cluster state updates.
  2> 1736128 INFO  (jetty-launcher-26685-thread-2) [n:127.0.0.1:41411_solr] o.a.s.c.c.ConnectionManager Waiting up to 15000ms for client to connect to ZooKeeper
  2> 1736128 INFO  (jetty-launcher-26685-thread-1) [] o.a.s.c.ZkContainer Zookeeper client=127.0.0.1:37473/solr
  2> 1736128 INFO  (jetty-launcher-26685-thread-1) [] o.a.s.c.DistributedClusterStateUpdater Creating DistributedClusterStateUpdater with useDistributedStateUpdate=true. Solr will be using distributed cluster state updates.
  2> 1736129 INFO  (zkConnectionManagerCallback-26706-thread-1) [] o.a.s.c.c.ConnectionManager zkClient has connected
  2> 1736129 INFO  (jetty-launcher-26685-thread-2) [n:127.0.0.1:41411_solr] o.a.s.c.c.ConnectionManager Client is connected to ZooKeeper
  2> 1736129 INFO  (jetty-launcher-26685-thread-1) [n:127.0.0.1:42895_solr] o.a.s.c.c.ConnectionManager Waiting up to 15000ms for client to connect to ZooKeeper
  2> 1736143 WARN  (jetty-launcher-26685-thread-2) [n:127.0.0.1:41411_solr] o.a.s.c.ZkController Contents of zookeeper /security.json are world-readable; consider setting up ACLs as described in https://solr.apache.org/guide/solr/latest/deployment-guide/zookeeper-access-control.html
  2> 1736145 INFO  (jetty-launcher-26685-thread-2) [n:127.0.0.1:41411_solr] o.a.s.c.DistributedClusterStateUpdater Creating DistributedClusterStateUpdater with useDistributedStateUpdate=true. Solr will be using distributed cluster state updates.
  2> 1736146 INFO  (zkConnectionManagerCallback-26709-thread-1) [] o.a.s.c.c.ConnectionManager zkClient has connected
  2> 1736146 INFO  (jetty-launcher-26685-thread-1) [n:127.0.0.1:42895_solr] o.a.s.c.c.ConnectionManager Client is connected to ZooKeeper
  2> 1736147 INFO  (jetty-launcher-26685-thread-2) [n:127.0.0.1:41411_solr] o.a.s.c.OverseerElectionContext I am going to be the leader 127.0.0.1:41411_solr
  2> 1736148 INFO  (jetty-launcher-26685-thread-2) [n:127.0.0.1:41411_solr] o.a.s.c.Overseer Overseer (id=72521951633145861-127.0.0.1:41411_solr-n_0000000000) starting
  2> 1736151 WARN  (jetty-launcher-26685-thread-1) [n:127.0.0.1:42895_solr] o.a.s.c.ZkController Contents of zookeeper /security.json are world-readable; consider setting up ACLs as described in https://solr.apache.org/guide/solr/latest/deployment-guide/zookeeper-access-control.html
  2> 1736153 INFO  (jetty-launcher-26685-thread-2) [n:127.0.0.1:41411_solr] o.a.s.c.ZkController Register node as live in ZooKeeper:/live_nodes/127.0.0.1:41411_solr
  2> 1736154 INFO  (jetty-launcher-26685-thread-1) [n:127.0.0.1:42895_solr] o.a.s.c.DistributedClusterStateUpdater Creating DistributedClusterStateUpdater with useDistributedStateUpdate=true. Solr will be using distributed cluster state updates.
  2> 1736155 INFO  (OverseerStateUpdate-72521951633145861-127.0.0.1:41411_solr-n_0000000000) [n:127.0.0.1:41411_solr] o.a.s.c.Overseer Starting to work on the main queue : 127.0.0.1:41411_solr
  2> 1736156 WARN  (jetty-launcher-26685-thread-2) [n:127.0.0.1:41411_solr] o.a.s.c.CoreContainer Not all security plugins configured!  authentication=disabled authorization=disabled.  Solr is only as secure as you make it. Consider configuring authentication/authorization before exposing Solr to users internal or external.  See https://s.apache.org/solrsecurity for more info
  2> 1736156 INFO  (jetty-launcher-26685-thread-1) [n:127.0.0.1:42895_solr] o.a.s.c.ZkController Publish node=127.0.0.1:42895_solr as DOWN
  2> 1736156 INFO  (OverseerStateUpdate-72521951633145861-127.0.0.1:41411_solr-n_0000000000) [n:127.0.0.1:41411_solr] o.a.s.c.c.ZkStateReader Updated live nodes from ZooKeeper... (0) -> (1)
  2> 1736157 INFO  (jetty-launcher-26685-thread-1) [n:127.0.0.1:42895_solr] o.a.s.c.ZkController Register node as live in ZooKeeper:/live_nodes/127.0.0.1:42895_solr
  2> 1736159 WARN  (jetty-launcher-26685-thread-1) [n:127.0.0.1:42895_solr] o.a.s.c.CoreContainer Not all security plugins configured!  authentication=disabled authorization=disabled.  Solr is only as secure as you make it. Consider configuring authentication/authorization before exposing Solr to users internal or external.  See https://s.apache.org/solrsecurity for more info
  2> 1736159 INFO  (jetty-launcher-26685-thread-1) [n:127.0.0.1:42895_solr] o.a.s.c.a.c.DistributedCollectionConfigSetCommandRunner Creating DistributedCollectionConfigSetCommandRunner. Collection and ConfigSet APIs are running distributed (not Overseer based)
  2> 1736159 INFO  (jetty-launcher-26685-thread-1) [n:127.0.0.1:42895_solr] o.a.s.c.DistributedClusterStateUpdater Creating DistributedClusterStateUpdater with useDistributedStateUpdate=true. Solr will be using distributed cluster state updates.
  2> 1736169 INFO  (zkCallback-26708-thread-1) [] o.a.s.c.c.ZkStateReader Updated live nodes from ZooKeeper... (0) -> (2)
  2> 1736170 INFO  (zkCallback-26705-thread-1) [] o.a.s.c.c.ZkStateReader Updated live nodes from ZooKeeper... (1) -> (2)
  2> 1736181 INFO  (jetty-launcher-26685-thread-1) [n:127.0.0.1:42895_solr] o.a.s.c.CorePropertiesLocator Found 0 core definitions underneath /home/jenkins/jenkins-slave/workspace/Solr/Solr-Smoketest-9.x/_tmp/smoke_1695104411/unpack/solr-9.4.0/solr/core/build/tmp/tests-tmp/solr.search.TestCoordinatorRole_DA69AC48202B65B5-001/tempDir-001/node1
  2> 1736184 INFO  (jetty-launcher-26685-thread-2) [n:127.0.0.1:41411_solr] o.a.s.c.a.c.DistributedCollectionConfigSetCommandRunner Creating DistributedCollectionConfigSetCommandRunner. Collection and ConfigSet APIs are running distributed (not Overseer based)
  2> 1736184 INFO  (jetty-launcher-26685-thread-2) [n:127.0.0.1:41411_solr] o.a.s.c.DistributedClusterStateUpdater Creating DistributedClusterStateUpdater with useDistributedStateUpdate=true. Solr will be using distributed cluster state updates.
  2> 1736202 INFO  (jetty-launcher-26685-thread-2) [n:127.0.0.1:41411_solr] o.a.s.c.CorePropertiesLocator Found 0 core definitions underneath /home/jenkins/jenkins-slave/workspace/Solr/Solr-Smoketest-9.x/_tmp/smoke_1695104411/unpack/solr-9.4.0/solr/core/build/tmp/tests-tmp/solr.search.TestCoordinatorRole_DA69AC48202B65B5-001/tempDir-001/node2
  2> 1736206 INFO  (jetty-launcher-26685-thread-1) [n:127.0.0.1:42895_solr] o.a.s.j.SolrRequestAuthorizer Creating a new SolrRequestAuthorizer
  2> 1736220 INFO  (jetty-launcher-26685-thread-1) [n:127.0.0.1:42895_solr] o.a.s.e.JettySolrRunner Jetty properties: {hostContext=/solr, hostPort=42895, zkHost=127.0.0.1:37473/solr}
  2> 1736225 INFO  (jetty-launcher-26685-thread-2) [n:127.0.0.1:41411_solr] o.a.s.j.SolrRequestAuthorizer Creating a new SolrRequestAuthorizer
  2> 1736239 INFO  (jetty-launcher-26685-thread-2) [n:127.0.0.1:41411_solr] o.a.s.e.JettySolrRunner Jetty properties: {hostContext=/solr, hostPort=41411, zkHost=127.0.0.1:37473/solr}
  2> 1736242 INFO  (TEST-TestCoordinatorRole.testConcurrentAccess-seed#[DA69AC48202B65B5]) [] o.a.s.c.MiniSolrCloudCluster waitForAllNodes: numServers=2
  2> 1736242 INFO  (TEST-TestCoordinatorRole.testConcurrentAccess-seed#[DA69AC48202B65B5]) [] o.a.s.c.MiniSolrCloudCluster waitForNode: 127.0.0.1:42895_solr
  2> 1736242 WARN  (TEST-TestCoordinatorRole.testConcurrentAccess-seed#[DA69AC48202B65B5]) [] o.a.s.c.c.SolrZkClient Using default ZkCredentialsInjector. ZkCredentialsInjector is not secure, it creates an empty list of credentials which leads to 'OPEN_ACL_UNSAFE' ACLs to Zookeeper nodes
  2> 1736243 INFO  (TEST-TestCoordinatorRole.testConcurrentAccess-seed#[DA69AC48202B65B5]) [] o.a.s.c.c.ConnectionManager Waiting up to 15000ms for client to connect to ZooKeeper
  2> 1736245 INFO  (zkConnectionManagerCallback-26732-thread-1) [] o.a.s.c.c.ConnectionManager zkClient has connected
  2> 1736245 INFO  (TEST-TestCoordinatorRole.testConcurrentAccess-seed#[DA69AC48202B65B5]) [] o.a.s.c.c.ConnectionManager Client is connected to ZooKeeper
  2> 1736245 WARN  (TEST-TestCoordinatorRole.testConcurrentAccess-seed#[DA69AC48202B65B5]) [] o.a.s.c.c.SolrZkClient Using default ZkACLProvider. DefaultZkACLProvider is not secure, it creates 'OPEN_ACL_UNSAFE' ACLs to Zookeeper nodes
  2> 1736246 INFO  (TEST-TestCoordinatorRole.testConcurrentAccess-seed#[DA69AC48202B65B5]) [] o.a.s.c.c.ZkStateReader Updated live nodes from ZooKeeper... (0) -> (2)
  2> 1736247 INFO  (TEST-TestCoordinatorRole.testConcurrentAccess-seed#[DA69AC48202B65B5]) [] o.a.s.c.s.i.ZkClientClusterStateProvider Cluster at 127.0.0.1:37473/solr ready
  2> 1736247 INFO  (TEST-TestCoordinatorRole.testConcurrentAccess-seed#[DA69AC48202B65B5]) [] o.a.s.c.MiniSolrCloudCluster waitForNode: 127.0.0.1:41411_solr
  2> 1736247 WARN  (TEST-TestCoordinatorRole.testConcurrentAccess-seed#[DA69AC48202B65B5]) [] o.a.s.c.c.SolrZkClient Using default ZkCredentialsInjector. ZkCredentialsInjector is not secure, it creates an empty list of credentials which leads to 'OPEN_ACL_UNSAFE' ACLs to Zookeeper nodes
  2> 1736249 INFO  (TEST-TestCoordinatorRole.testConcurrentAccess-seed#[DA69AC48202B65B5]) [] o.a.s.c.c.ConnectionManager Waiting up to 45000ms for client to connect to ZooKeeper
  2> 1736249 INFO  (zkConnectionManagerCallback-26734-thread-1) [] o.a.s.c.c.ConnectionManager zkClient has connected
  2> 1736249 INFO  (TEST-TestCoordinatorRole.testConcurrentAccess-seed#[DA69AC48202B65B5]) [] o.a.s.c.c.ConnectionManager Client is connected to ZooKeeper
  2> 1736249 WARN  (TEST-TestCoordinatorRole.testConcurrentAccess-seed#[DA69AC48202B65B5]) [] o.a.s.c.c.SolrZkClient Using default ZkACLProvider. DefaultZkACLProvider is not secure, it creates 'OPEN_ACL_UNSAFE' ACLs to Zookeeper nodes
  2> 1736380 INFO  (qtp1682599632-36527) [n:127.0.0.1:42895_solr c:test_coll_0 t:null-28935] o.a.s.c.a.c.DistributedCollectionConfigSetCommandRunner Running Collection API locally for CREATE asyncId=null
  2> 1736382 INFO  (DistributedCollectionApiCommandExecutor-26718-thread-1-processing-127.0.0.1:42895_solr null-28935 test_coll_0) [n:127.0.0.1:42895_solr c:test_coll_0 t:null-28935] o.a.s.c.a.c.CreateCollectionCmd Create collection test_coll_0
  2> 1736489 INFO  (DistributedCollectionApiCommandExecutor-26718-thread-1-processing-127.0.0.1:42895_solr null-28935 test_coll_0) [n:127.0.0.1:42895_solr c:test_coll_0 t:null-28935] o.a.s.c.o.SliceMutator createReplica() {
  2>   "core":"test_coll_0_shard2_replica_n1",
  2>   "node_name":"127.0.0.1:42895_solr",
  2>   "base_url":"https://127.0.0.1:42895/solr",
  2>   "collection":"test_coll_0",
  2>   "shard":"shard2",
  2>   "state":"down",
  2>   "type":"NRT",
  2>   "operation":"ADDREPLICA",
  2>   "waitForFinalState":"false"} 
  2> 1736490 INFO  (DistributedCollectionApiCommandExecutor-26718-thread-1-processing-127.0.0.1:42895_solr null-28935 test_coll_0) [n:127.0.0.1:42895_solr c:test_coll_0 t:null-28935] o.a.s.c.o.SliceMutator createReplica() {
  2>   "core":"test_coll_0_shard1_replica_n2",
  2>   "node_name":"127.0.0.1:41411_solr",
  2>   "base_url":"https://127.0.0.1:41411/solr",
  2>   "collection":"test_coll_0",
  2>   "shard":"shard1",
  2>   "state":"down",
  2>   "type":"NRT",
  2>   "operation":"ADDREPLICA",
  2>   "waitForFinalState":"false"} 
  2> 1736517 INFO  (qtp1682599632-36523) [n:127.0.0.1:42895_solr x:test_coll_0_shard2_replica_n1 t:null-28935] o.a.s.h.a.CoreAdminOperation core create command qt=/admin/cores&collection.configName=conf&newCollection=true&collection=test_coll_0&version=2&replicaType=NRT&coreNodeName=core_node3&name=test_coll_0_shard2_replica_n1&action=CREATE&numShards=2&shard=shard2&wt=javabin
  2> 1736519 INFO  (qtp60720586-36524) [n:127.0.0.1:41411_solr x:test_coll_0_shard1_replica_n2 t:null-28935] o.a.s.h.a.CoreAdminOperation core create command qt=/admin/cores&collection.configName=conf&newCollection=true&collection=test_coll_0&version=2&replicaType=NRT&coreNodeName=core_node4&name=test_coll_0_shard1_replica_n2&action=CREATE&numShards=2&shard=shard1&wt=javabin
  2> 1736527 INFO  (qtp1682599632-36523) [n:127.0.0.1:42895_solr c:test_coll_0 s:shard2 r:core_node3 x:test_coll_0_shard2_replica_n1 t:null-28935] o.a.s.c.SolrConfig Using Lucene MatchVersion: 9.7.0
  2> 1736529 INFO  (qtp1682599632-36523) [n:127.0.0.1:42895_solr c:test_coll_0 s:shard2 r:core_node3 x:test_coll_0_shard2_replica_n1 t:null-28935] o.a.s.s.IndexSchema Schema name=minimal
  2> 1736529 INFO  (qtp1682599632-36523) [n:127.0.0.1:42895_solr c:test_coll_0 s:shard2 r:core_node3 x:test_coll_0_shard2_replica_n1 t:null-28935] o.a.s.s.IndexSchema Loaded schema minimal/1.1 with uniqueid field id
  2> 1736529 INFO  (qtp1682599632-36523) [n:127.0.0.1:42895_solr c:test_coll_0 s:shard2 r:core_node3 x:test_coll_0_shard2_replica_n1 t:null-28935] o.a.s.c.CoreContainer Creating SolrCore 'test_coll_0_shard2_replica_n1' using configuration from configset conf, trusted=true
  2> 1736529 INFO  (qtp1682599632-36523) [n:127.0.0.1:42895_solr c:test_coll_0 s:shard2 r:core_node3 x:test_coll_0_shard2_replica_n1 t:null-28935] o.a.s.c.SolrCore Opening new SolrCore at [/home/jenkins/jenkins-slave/workspace/Solr/Solr-Smoketest-9.x/_tmp/smoke_1695104411/unpack/solr-9.4.0/solr/core/build/tmp/tests-tmp/solr.search.TestCoordinatorRole_DA69AC48202B65B5-001/tempDir-001/node1/test_coll_0_shard2_replica_n1], dataDir=[/home/jenkins/jenkins-slave/workspace/Solr/Solr-Smoketest-9.x/_tmp/smoke_1695104411/unpack/solr-9.4.0/solr/core/build/tmp/tests-tmp/solr.search.TestCoordinatorRole_DA69AC48202B65B5-001/tempDir-001/node1/test_coll_0_shard2_replica_n1/data/]
  2> 1736531 INFO  (qtp60720586-36524) [n:127.0.0.1:41411_solr c:test_coll_0 s:shard1 r:core_node4 x:test_coll_0_shard1_replica_n2 t:null-28935] o.a.s.c.SolrConfig Using Lucene MatchVersion: 9.7.0
  2> 1736532 INFO  (qtp60720586-36524) [n:127.0.0.1:41411_solr c:test_coll_0 s:shard1 r:core_node4 x:test_coll_0_shard1_replica_n2 t:null-28935] o.a.s.s.IndexSchema Schema name=minimal
  2> 1736533 INFO  (qtp60720586-36524) [n:127.0.0.1:41411_solr c:test_coll_0 s:shard1 r:core_node4 x:test_coll_0_shard1_replica_n2 t:null-28935] o.a.s.s.IndexSchema Loaded schema minimal/1.1 with uniqueid field id
  2> 1736533 INFO  (qtp60720586-36524) [n:127.0.0.1:41411_solr c:test_coll_0 s:shard1 r:core_node4 x:test_coll_0_shard1_replica_n2 t:null-28935] o.a.s.c.CoreContainer Creating SolrCore 'test_coll_0_shard1_replica_n2' using configuration from configset conf, trusted=true
  2> 1736533 INFO  (qtp60720586-36524) [n:127.0.0.1:41411_solr c:test_coll_0 s:shard1 r:core_node4 x:test_coll_0_shard1_replica_n2 t:null-28935] o.a.s.c.SolrCore Opening new SolrCore at [/home/jenkins/jenkins-slave/workspace/Solr/Solr-Smoketest-9.x/_tmp/smoke_1695104411/unpack/solr-9.4.0/solr/core/build/tmp/tests-tmp/solr.search.TestCoordinatorRole_DA69AC48202B65B5-001/tempDir-001/node2/test_coll_0_shard1_replica_n2], dataDir=[/home/jenkins/jenkins-slave/workspace/Solr/Solr-Smoketest-9.x/_tmp/smoke_1695104411/unpack/solr-9.4.0/solr/core/build/tmp/tests-tmp/solr.search.TestCoordinatorRole_DA69AC48202B65B5-001/tempDir-001/node2/test_coll_0_shard1_replica_n2/data/]
  2> 1737408 INFO  (qtp1682599632-36523) [n:127.0.0.1:42895_solr c:test_coll_0 s:shard2 r:core_node3 x:test_coll_0_shard2_replica_n1 t:null-28935] o.a.s.j.SolrRequestAuthorizer Creating a new SolrRequestAuthorizer
  2> 1737411 INFO  (qtp60720586-36524) [n:127.0.0.1:41411_solr c:test_coll_0 s:shard1 r:core_node4 x:test_coll_0_shard1_replica_n2 t:null-28935] o.a.s.j.SolrRequestAuthorizer Creating a new SolrRequestAuthorizer
  2> 1737412 INFO  (qtp1682599632-36523) [n:127.0.0.1:42895_solr c:test_coll_0 s:shard2 r:core_node3 x:test_coll_0_shard2_replica_n1 t:null-28935] o.a.s.u.UpdateHandler Using UpdateLog implementation: org.apache.solr.update.UpdateLog
  2> 1737412 INFO  (qtp1682599632-36523) [n:127.0.0.1:42895_solr c:test_coll_0 s:shard2 r:core_node3 x:test_coll_0_shard2_replica_n1 t:null-28935] o.a.s.u.UpdateLog Initializing UpdateLog: dataDir=null defaultSyncLevel=FLUSH numRecordsToKeep=100 maxNumLogsToKeep=10 numVersionBuckets=65536
  2> 1737414 INFO  (qtp1682599632-36523) [n:127.0.0.1:42895_solr c:test_coll_0 s:shard2 r:core_node3 x:test_coll_0_shard2_replica_n1 t:null-28935] o.a.s.u.CommitTracker Hard AutoCommit: disabled
  2> 1737414 INFO  (qtp1682599632-36523) [n:127.0.0.1:42895_solr c:test_coll_0 s:shard2 r:core_node3 x:test_coll_0_shard2_replica_n1 t:null-28935] o.a.s.u.CommitTracker Soft AutoCommit: disabled
  2> 1737415 INFO  (qtp60720586-36524) [n:127.0.0.1:41411_solr c:test_coll_0 s:shard1 r:core_node4 x:test_coll_0_shard1_replica_n2 t:null-28935] o.a.s.u.UpdateHandler Using UpdateLog implementation: org.apache.solr.update.UpdateLog
  2> 1737415 INFO  (qtp60720586-36524) [n:127.0.0.1:41411_solr c:test_coll_0 s:shard1 r:core_node4 x:test_coll_0_shard1_replica_n2 t:null-28935] o.a.s.u.UpdateLog Initializing UpdateLog: dataDir=null defaultSyncLevel=FLUSH numRecordsToKeep=100 maxNumLogsToKeep=10 numVersionBuckets=65536
  2> 1737415 INFO  (qtp1682599632-36523) [n:127.0.0.1:42895_solr c:test_coll_0 s:shard2 r:core_node3 x:test_coll_0_shard2_replica_n1 t:null-28935] o.a.s.r.ManagedResourceStorage Configured ZooKeeperStorageIO with znodeBase: /configs/conf
  2> 1737416 INFO  (qtp1682599632-36523) [n:127.0.0.1:42895_solr c:test_coll_0 s:shard2 r:core_node3 x:test_coll_0_shard2_replica_n1 t:null-28935] o.a.s.r.ManagedResourceStorage Loaded null at path _rest_managed.json using ZooKeeperStorageIO:path=/configs/conf
  2> 1737416 INFO  (qtp1682599632-36523) [n:127.0.0.1:42895_solr c:test_coll_0 s:shard2 r:core_node3 x:test_coll_0_shard2_replica_n1 t:null-28935] o.a.s.h.ReplicationHandler Commits will be reserved for 10000 ms
  2> 1737416 INFO  (qtp60720586-36524) [n:127.0.0.1:41411_solr c:test_coll_0 s:shard1 r:core_node4 x:test_coll_0_shard1_replica_n2 t:null-28935] o.a.s.u.CommitTracker Hard AutoCommit: disabled
  2> 1737416 INFO  (qtp60720586-36524) [n:127.0.0.1:41411_solr c:test_coll_0 s:shard1 r:core_node4 x:test_coll_0_shard1_replica_n2 t:null-28935] o.a.s.u.CommitTracker Soft AutoCommit: disabled
  2> 1737416 INFO  (qtp1682599632-36523) [n:127.0.0.1:42895_solr c:test_coll_0 s:shard2 r:core_node3 x:test_coll_0_shard2_replica_n1 t:null-28935] o.a.s.u.UpdateLog Could not find max version in index or recent updates, using new clock 1777448037193351168
  2> 1737417 INFO  (qtp60720586-36524) [n:127.0.0.1:41411_solr c:test_coll_0 s:shard1 r:core_node4 x:test_coll_0_shard1_replica_n2 t:null-28935] o.a.s.r.ManagedResourceStorage Configured ZooKeeperStorageIO with znodeBase: /configs/conf
  2> 1737417 INFO  (qtp60720586-36524) [n:127.0.0.1:41411_solr c:test_coll_0 s:shard1 r:core_node4 x:test_coll_0_shard1_replica_n2 t:null-28935] o.a.s.r.ManagedResourceStorage Loaded null at path _rest_managed.json using ZooKeeperStorageIO:path=/configs/conf
  2> 1737417 INFO  (qtp60720586-36524) [n:127.0.0.1:41411_solr c:test_coll_0 s:shard1 r:core_node4 x:test_coll_0_shard1_replica_n2 t:null-28935] o.a.s.h.ReplicationHandler Commits will be reserved for 10000 ms
  2> 1737417 INFO  (qtp60720586-36524) [n:127.0.0.1:41411_solr c:test_coll_0 s:shard1 r:core_node4 x:test_coll_0_shard1_replica_n2 t:null-28935] o.a.s.u.UpdateLog Could not find max version in index or recent updates, using new clock 1777448037194399744
  2> 1737419 INFO  (searcherExecutor-26736-thread-1-processing-test_coll_0_shard2_replica_n1 null-28935 core_node3 127.0.0.1:42895_solr test_coll_0 shard2) [n:127.0.0.1:42895_solr c:test_coll_0 s:shard2 r:core_node3 x:test_coll_0_shard2_replica_n1 t:null-28935] o.a.s.c.SolrCore Registered new searcher autowarm time: 0 ms
  2> 1737419 INFO  (searcherExecutor-26738-thread-1-processing-test_coll_0_shard1_replica_n2 null-28935 core_node4 127.0.0.1:41411_solr test_coll_0 shard1) [n:127.0.0.1:41411_solr c:test_coll_0 s:shard1 r:core_node4 x:test_coll_0_shard1_replica_n2 t:null-28935] o.a.s.c.SolrCore Registered new searcher autowarm time: 0 ms
  2> 1737423 INFO  (qtp60720586-36524) [n:127.0.0.1:41411_solr c:test_coll_0 s:shard1 r:core_node4 x:test_coll_0_shard1_replica_n2 t:null-28935] o.a.s.c.ZkShardTerms Successful update of terms at /collections/test_coll_0/terms/shard1 to Terms{values={core_node4=0}, version=0} for registerTerm
  2> 1737423 INFO  (qtp60720586-36524) [n:127.0.0.1:41411_solr c:test_coll_0 s:shard1 r:core_node4 x:test_coll_0_shard1_replica_n2 t:null-28935] o.a.s.c.ShardLeaderElectionContextBase make sure parent is created /collections/test_coll_0/leaders/shard1
  2> 1737423 INFO  (qtp1682599632-36523) [n:127.0.0.1:42895_solr c:test_coll_0 s:shard2 r:core_node3 x:test_coll_0_shard2_replica_n1 t:null-28935] o.a.s.c.ZkShardTerms Successful update of terms at /collections/test_coll_0/terms/shard2 to Terms{values={core_node3=0}, version=0} for registerTerm
  2> 1737423 INFO  (qtp1682599632-36523) [n:127.0.0.1:42895_solr c:test_coll_0 s:shard2 r:core_node3 x:test_coll_0_shard2_replica_n1 t:null-28935] o.a.s.c.ShardLeaderElectionContextBase make sure parent is created /collec

[...truncated too long message...]

tSorting, TestSizeLimitedDistributedMap, TestStressCloudBlindAtomicUpdates, TestStressLiveNodes, TestTlogReplica, TestTolerantUpdateProcessorRandomCloud, TlogReplayBufferedWhileIndexingTest, UnloadDistributedZkTest, ZkCLITest, ZkDistributedLockTest, ZkNodePropsTest, ZkSolrClientTest, BackupRestoreApiErrorConditionsTest, CollectionReloadTest, CollectionsAPIAsyncDistributedZkTest, ConcurrentDeleteAndCreateCollectionTest, LocalFSCloudIncrementalBackupTest, PurgeGraphTest, SimpleCollectionCreateDeleteTest, TestCollectionAPI, TestLocalFSCloudBackupRestore, TestRequestStatusCollectionAPI, ZkCollectionPropsCachingTest, ZkStateWriterTest, CollectionsRepairEventListenerTest, SimpleClusterAbstractionsTest, MinimizeCoresPlacementFactoryTest, TestObjectReleaseTracker, BlobRepositoryCloudTest, ByteBuffersDirectoryFactoryTest, ConfigureRecoveryStrategyTest, DirectoryFactoriesTest, ExitableDirectoryReaderTest, PluginInfoTest, QuerySenderListenerTest, RequestHandlersTest, SOLR749Test, SolrCoreTest, TestBadConfig, TestConfLoadPerf, TestConfigOverlay, TestConfigSetProperties, TestConfigSets, TestCoreDiscovery, TestCustomStream, TestImplicitCoreProperties, TestInitParams, TestLazyCores, TestMinimalConfig, TestQuerySenderListener, TestReloadAndDeleteDocs, TestSimpleTextCodec, TestSolrDeletionPolicy1, TestSolrIndexConfig, TestTracerConfigurator, BackupFilePathsTest, ShardBackupIdTest, TestSolrCoreSnapshots, BinaryUpdateRequestHandlerTest, DocumentAnalysisRequestHandlerTest, JsonLoaderTest, PingRequestHandlerTest, RequestHandlerMetricsTest, SearchHandlerTest, TestCSVLoader, TestContainerPlugin, TestHttpRequestId, TestReplicationHandler, TestReplicationHandlerDiskOverFlow, TestRequestId, TestSampleDocumentsLoader, TestSolrConfigHandlerCloud, TestStressIncrementalBackup, TestSys
  2> temCollAutoCreate, V2ClusterAPIMappingTest, V2UpdateAPIMappingTest, AdminHandlersProxyTest, CoreAdminHandlerActionTest, CoreAdminOperationTest, CoreMergeIndexesAdminHandlerTest, HealthCheckHandlerTest, InfoHandlerTest, LukeRequestHandlerTest, MetricsHandlerTest, RestoreCoreOpTest, SegmentsInfoRequestHandlerTest, SolrEnvironmentTest, StatsReloadRaceTest, TestApiFramework, TestCoreAdminApis, V2BlobAPIMappingTest, V2CoresAPIMappingTest, ZookeeperReadAPITest, ZookeeperStatusHandlerTest, BackupCoreAPITest, CoreReplicationAPITest, CreateAliasAPITest, CreateCollectionSnapshotAPITest, CreateShardAPITest, DeleteCollectionAPITest, DeleteCollectionSnapshotAPITest, DeleteReplicaAPITest, DeleteShardAPITest, GetSchemaAPITest, GetSchemaZkVersionAPITest, MigrateReplicasAPITest, ReloadCollectionAPITest, RestoreCollectionAPITest, SyncShardAPITest, V2CollectionBackupApiTest, V2NodeAPIMappingTest, V2ShardsAPIMappingTest, BadComponentTest, CustomHighlightComponentTest, DistributedDebugComponentTest, DistributedFacetExistsSmallTest, DistributedFacetPivotLongTailTest, DistributedFacetPivotSmallTest, DistributedMLTComponentTest, DistributedQueryComponentOptimizationTest, DistributedSpellCheckComponentTest, DistributedTermsComponentTest, FacetPivotSmallTest, MoreLikeThisComponentTest, QueryComponentPartialResultsTest, ResponseBuilderTest, SearchHandlerAppendsCloudTest, ShardRequestTest, SpellCheckComponentTest, SuggestComponentContextFilterQueryTest, TermVectorComponentDistributedTest, TermsComponentTest, TestExpandComponent, TestPivotHelperCode, UpdateLogCloudTest, ManagedSchemaDiffTest, TestSchemaDesignerConfigSetHelper, TestExportWriter, EmbeddedSolrNoSerializeTest, Tagger2Test, TaggingAttributeTest, FastVectorHighlighterTest, HighlighterMaxOffsetTest, HighlighterWithoutStoredIdTest, TestUnifiedSolrHighlighterWithoutStoredId, WrapperMergePolicyFactoryTest, CSVPrinterTest, CSVUtilsTest, ExtendedBufferedReaderTest, JerseyApplicationSharingTest, TestLegacyField, TestLegacyNumericUtils, TestMultiValuedNumericRangeQuery, TestNumericRangeQuery64, TestLogWatcher, JvmMetricsTest, MetricsDisabledCloudTest, SolrMetricManagerTest, SolrMetricsIntegrationTest, SolrJmxReporterCloudTest, SolrSlf4jReporterTest, TestPackages, SimpleFacetsTest, TestFacetMethods, TestIntervalFaceting, TestSolrRequestInfo, TestUnInvertedFieldException, TestMacroExpander, JSONWriterTest, TestBinaryResponseWriter, TestCustomDocTransformer, TestGraphMLResponseWriter, TestPHPSerializedResponseWriter, TestRawResponseWriter, TestRetrieveFieldsOptimizer, TestChildDocTransformer, TestExplainDocTransformer, TestSubQueryTransformerCrossCore, TestManagedFileStorage, TestManagedResourceStorage, TestBulkSchemaAPI, TestDynamicFieldCollectionResource, TestFieldCollectionResource, TestFieldTypeCollectionResource, TestSchemaNameResource, TestSchemaSimilarityResource, TestSerializedLuceneMatchVersion, TestManagedStopFilterFactory, TestManagedSynonymGraphFilterFactory, BadIndexSchemaTest, ChangedSchemaMergeTest, CurrencyFieldTypeTest, DateRangeFieldTest, DocValuesMissingTest, DocValuesTest, ExternalFileFieldSortTest, IndexSchemaTest, NotRequiredUniqueKeyTest, OpenExchangeRatesOrgProviderTest, PreAnalyzedFieldManagedSchemaCloudTest, PrimitiveFieldTypeTest, RequiredFieldsTest, SchemaApiFailureTest, SynonymTokenizerTest, TestBulkSchemaConcurrent, TestCloudSchemaless, TestCollationFieldDocValues, TestManagedSchemaAPI, TestManagedSchemaWithMultipleAdd, TestPointFields, TestSchemaManager, TestSortableTextField, TestUseDocValuesAsStored, UUIDFieldTest, AnalyticsQueryTest, CursorMarkTest, MaxScoreCollectorTest, QueryEqualityTest, QueryUtilsTest, RankQueryTest, SignificantTermsQParserPluginTest, SortSpecParsingTest, TestAddFieldRealTimeGet, TestCaffeineCache, TestCollapseQParserPlugin, TestComplexPhraseQParserPlugin, TestCoordinatorRole]

WARNING: Test org.apache.solr.search.facet.TestCloudJSONFacetSKG wrote 17,954,534 bytes of output.

> Task :solr:solrj:processTestResources
> Task :solr:solrj:testClasses
> Task :solr:solrj:test

> Task :solr:core:test
:solr:core:test (FAILURE): 4884 test(s), 1 failure(s), 215 skipped

4884 tests completed, 1 failed, 215 skipped

> Task :solr:core:test FAILED
> Task :solr:core:wipeTaskTemp

> Task :solr:solrj:test
:solr:solrj:test (SUCCESS): 1135 test(s), 40 skipped

> Task :solr:solrj:wipeTaskTemp

ERROR: The following test(s) have failed:
  - org.apache.solr.search.TestCoordinatorRole.testConfigset (:solr:core)
    Test output: /home/jenkins/jenkins-slave/workspace/Solr/Solr-Smoketest-9.x/_tmp/smoke_1695104411/unpack/solr-9.4.0/solr/core/build/test-results/test/outputs/OUTPUT-org.apache.solr.search.TestCoordinatorRole.txt
    Reproduce with: gradlew :solr:core:test --tests "org.apache.solr.search.TestCoordinatorRole.testConfigset" -Ptests.jvms=2 "-Ptests.jvmargs=-XX:TieredStopAtLevel=1 -XX:+UseParallelGC -XX:ActiveProcessorCount=1 -XX:ReservedCodeCacheSize=120m" -Ptests.seed=DA69AC48202B65B5 -Ptests.badapples=false -Ptests.file.encoding=ISO-8859-1


FAILURE: Build failed with an exception.

* What went wrong:
Execution failed for task ':solr:core:test'.
> There were failing tests. See the results at: file:///home/jenkins/jenkins-slave/workspace/Solr/Solr-Smoketest-9.x/_tmp/smoke_1695104411/unpack/solr-9.4.0/solr/core/build/test-results/test/

* Try:
> Run with --stacktrace option to get the stack trace.
> Run with --info or --debug option to get more log output.

* Get more help at https://help.gradle.org

BUILD FAILED in 43m 3s
81 actionable tasks: 63 executed, 18 up-to-date

Publishing build scan...
Publishing build scan failed due to network error 'java.net.SocketTimeoutException: Read timed out' (2 retries remaining)...
Publishing build scan failed due to network error 'java.net.SocketTimeoutException: Read timed out' (1 retry remaining)...
Publishing build scan failed due to 'An unexpected error occurred creating your build scan.
Please report this problem at https://ge.apache.org/help, quoting the following reference code:
asay7dkeii3km' (2 retries remaining)...
Publishing build scan failed due to network error 'java.net.SocketTimeoutException: Read timed out' (2 retries remaining)...
Publishing build scan failed due to network error 'java.net.SocketTimeoutException: Read timed out' (1 retry remaining)...

A network error occurred.

If you require assistance with this problem, please report it to your Gradle Enterprise administrator and include the following information via copy/paste.

----------
Gradle version: 7.6
Plugin version: 3.13.1
Request URL: https://ge.apache.org/scans/publish/gradle/3.13.1/upload
Request ID: c84b8778-a7f2-42ee-8d43-acdc4d660450
Exception: java.net.SocketTimeoutException: Read timed out
----------



Traceback (most recent call last):
  File "dev-tools/scripts/smokeTestRelease.py", line 1174, in <module>
    main()
  File "dev-tools/scripts/smokeTestRelease.py", line 1101, in main
    downloadOnly=c.download_only)
  File "dev-tools/scripts/smokeTestRelease.py", line 1162, in smokeTest
    unpackAndVerify(java, tmpDir, 'solr-%s-src.tgz' % version, gitRevision, version, testArgs)
  File "dev-tools/scripts/smokeTestRelease.py", line 553, in unpackAndVerify
    verifyUnpacked(java, artifact, unpackPath, gitRevision, version, testArgs)
  File "dev-tools/scripts/smokeTestRelease.py", line 644, in verifyUnpacked
    java.run_java11('./gradlew --no-daemon test %s' % testArgs, '%s/test.log' % unpackPath)
  File "dev-tools/scripts/smokeTestRelease.py", line 1010, in run_java
    run('%s; %s' % (cmd_prefix, cmd), logfile)
  File "dev-tools/scripts/smokeTestRelease.py", line 483, in run
    raise RuntimeError('command "%s" failed; see log file %s' % (command, logPath))
RuntimeError: command "export JAVA_HOME="/home/jenkins/tools/java/latest11" PATH="/home/jenkins/tools/java/latest11/bin:$PATH" JAVACMD="/home/jenkins/tools/java/latest11/bin/java"; ./gradlew --no-daemon test -Dtests.nightly=false -Dtests.badapples=false " failed; see log file /home/jenkins/jenkins-slave/workspace/Solr/Solr-Smoketest-9.x/_tmp/smoke_1695104411/unpack/solr-9.4.0/test.log
Build step 'Run with timeout' marked build as failure
Email was triggered for: Failure - Any
Sending email for trigger: Failure - Any

[JENKINS] Solr ยป Solr-Smoketest-9.x - Build # 181 - Still Failing!

Posted by Apache Jenkins Server <je...@builds.apache.org>.
Build: https://ci-builds.apache.org/job/Solr/job/Solr-Smoketest-9.x/181/

Log: 
Started by timer
Running as SYSTEM
[EnvInject] - Loading node environment variables.
Building remotely on lucene-solr-2 (solr lucene) in workspace /home/jenkins/jenkins-slave/workspace/Solr/Solr-Smoketest-9.x
The recommended git tool is: NONE
No credentials specified
 > git rev-parse --resolve-git-dir /home/jenkins/jenkins-slave/workspace/Solr/Solr-Smoketest-9.x/.git # timeout=10
Fetching changes from the remote Git repository
 > git config remote.origin.url https://github.com/apache/solr.git # timeout=10
Cleaning workspace
 > git rev-parse --verify HEAD # timeout=10
Resetting working tree
 > git reset --hard # timeout=10
 > git clean -fdx # timeout=10
Fetching upstream changes from https://github.com/apache/solr.git
 > git --version # timeout=10
 > git --version # 'git version 2.25.1'
 > git fetch --tags --force --progress -- https://github.com/apache/solr.git +refs/heads/*:refs/remotes/origin/* # timeout=10
 > git rev-parse origin/branch_9x^{commit} # timeout=10
Checking out Revision ca3c81ce37cb9160dff5384e1ab72afd900abb47 (origin/branch_9x)
 > git config core.sparsecheckout # timeout=10
 > git checkout -f ca3c81ce37cb9160dff5384e1ab72afd900abb47 # timeout=10
Commit message: "SOLR-16971 RealTimeGet with Composite router throws NPE (#1914)"
 > git rev-list --no-walk ca3c81ce37cb9160dff5384e1ab72afd900abb47 # timeout=10
No emails were triggered.
provisioning config files...
copy managed file [gradle.properties] to file:/home/jenkins/jenkins-slave/workspace/Solr/Solr-Smoketest-9.x/gradle.properties
[Gradle] - Launching build.
[Solr-Smoketest-9.x] $ /home/jenkins/jenkins-slave/workspace/Solr/Solr-Smoketest-9.x/gradlew -Dversion.suffix= -Dgradle.user.home=/home/jenkins/jenkins-slave/workspace/Solr/.gradle -Porg.gradle.daemon=false -Pvalidation.git.failOnModified=false --continue -x signJarsPublication clean assembleRelease
Downloading gradle-wrapper.jar from https://raw.githubusercontent.com/gradle/gradle/v7.6.0/gradle/wrapper/gradle-wrapper.jar
To honour the JVM settings for this build a single-use Daemon process will be forked. See https://docs.gradle.org/7.6/userguide/gradle_daemon.html#sec:disabling_the_daemon.
Daemon will be stopped at the end of the build 
> Task :buildSrc:compileJava
> Task :buildSrc:compileGroovy NO-SOURCE
> Task :buildSrc:processResources NO-SOURCE
> Task :buildSrc:classes
> Task :buildSrc:jar
> Task :buildSrc:assemble
> Task :buildSrc:compileTestJava NO-SOURCE
> Task :buildSrc:compileTestGroovy NO-SOURCE
> Task :buildSrc:processTestResources NO-SOURCE
> Task :buildSrc:testClasses UP-TO-DATE
> Task :buildSrc:test NO-SOURCE
> Task :buildSrc:check UP-TO-DATE
> Task :buildSrc:build
> Task :clean
> Task :solr:clean UP-TO-DATE
> Task :solr:api:clean
> Task :solr:benchmark:clean
> Task :solr:core:clean
> Task :solr:distribution:clean UP-TO-DATE
> Task :solr:docker:clean UP-TO-DATE
> Task :solr:documentation:clean UP-TO-DATE
> Task :solr:example:clean UP-TO-DATE
> Task :solr:modules:clean UP-TO-DATE
> Task :solr:packaging:clean UP-TO-DATE
> Task :solr:prometheus-exporter:clean
> Task :solr:server:clean
> Task :solr:solr-ref-guide:clean
> Task :solr:solrj:clean
> Task :solr:solrj-streaming:clean
> Task :solr:solrj-zookeeper:clean
> Task :solr:test-framework:clean
> Task :solr:webapp:clean
> Task :solr:modules:analysis-extras:clean
> Task :solr:modules:analytics:clean
> Task :solr:modules:clustering:clean
> Task :solr:modules:extraction:clean
> Task :solr:modules:gcs-repository:clean
> Task :solr:modules:hadoop-auth:clean
> Task :solr:modules:hdfs:clean
> Task :solr:modules:jaegertracer-configurator:clean
> Task :solr:modules:jwt-auth:clean
> Task :solr:modules:langid:clean
> Task :solr:modules:ltr:clean
> Task :solr:modules:opentelemetry:clean
> Task :solr:modules:s3-repository:clean
> Task :solr:modules:scripting:clean
> Task :solr:modules:sql:clean
> Task :mavenLocalClean UP-TO-DATE
> Task :solr-missing-doclet:compileJava
> Task :solr-missing-doclet:processResources NO-SOURCE
> Task :solr-missing-doclet:classes
> Task :solr-missing-doclet:jar
> Task :gitStatus
> Task :checkJdkInternalsExportedToGradle
> Task :solr:api:compileJava
> Task :solr:api:processResources NO-SOURCE
> Task :solr:api:classes
> Task :solr:api:jar
> Task :solr:api:generateMetadataFileForJarsPublication SKIPPED
> Task :solr:api:generatePomFileForJarsPublication
> Task :solr:api:renderJavadoc
> Task :solr:api:javadoc SKIPPED
> Task :solr:api:javadocJar
> Task :solr:api:sourcesJar
> Task :solr:api:publishJarsPublicationToBuildRepository

> Task :solr:api:resolve
SLF4J: No SLF4J providers were found.
SLF4J: Defaulting to no-operation (NOP) logger implementation
SLF4J: See https://www.slf4j.org/codes.html#noProviders for further details.

> Task :solr:solrj:openApiGenerate
################################################################################
# Thanks for using OpenAPI Generator.                                          #
# Please consider donation to help us maintain this project ๐Ÿ™                 #
# https://opencollective.com/openapi_generator/donate                          #
################################################################################
Successfully generated code to /home/jenkins/jenkins-slave/workspace/Solr/Solr-Smoketest-9.x/solr/solrj/build/generated/

> Task :spotlessInternalRegisterDependencies
> Task :solr:solrj:generatedSpotlessHelper
> Task :solr:solrj:generatedSpotless

> Task :solr:solrj:compileJava
Note: Some input files use or override a deprecated API.
Note: Recompile with -Xlint:deprecation for details.

> Task :solr:solrj-streaming:compileJava
Note: Some input files use or override a deprecated API.
Note: Recompile with -Xlint:deprecation for details.

> Task :solr:solrj-zookeeper:compileJava
Note: Some input files use or override a deprecated API.
Note: Recompile with -Xlint:deprecation for details.

> Task :solr:core:compileJava
Note: Some input files use or override a deprecated API.
Note: Recompile with -Xlint:deprecation for details.

> Task :solr:core:processResources
> Task :solr:core:classes
> Task :solr:core:jar
> Task :solr:core:generateMetadataFileForJarsPublication SKIPPED
> Task :solr:core:generatePomFileForJarsPublication
> Task :solr:solrj:renderJavadoc
> Task :solr:solrj-streaming:renderJavadoc
> Task :solr:solrj-zookeeper:renderJavadoc
> Task :solr:core:renderJavadoc
> Task :solr:core:javadoc SKIPPED
> Task :solr:core:javadocJar
> Task :solr:core:sourcesJar
> Task :solr:core:publishJarsPublicationToBuildRepository

> Task :solr:prometheus-exporter:compileJava
Note: Some input files use or override a deprecated API.
Note: Recompile with -Xlint:deprecation for details.

> Task :solr:prometheus-exporter:processResources NO-SOURCE
> Task :solr:prometheus-exporter:classes
> Task :solr:prometheus-exporter:jar
> Task :solr:prometheus-exporter:generateMetadataFileForJarsPublication SKIPPED
> Task :solr:prometheus-exporter:generatePomFileForJarsPublication
> Task :solr:prometheus-exporter:renderJavadoc
> Task :solr:prometheus-exporter:javadoc SKIPPED
> Task :solr:prometheus-exporter:javadocJar
> Task :solr:prometheus-exporter:sourcesJar
> Task :solr:prometheus-exporter:publishJarsPublicationToBuildRepository
> Task :solr:solrj:processResources
> Task :solr:solrj:classes
> Task :solr:solrj:jar
> Task :solr:solrj:generateMetadataFileForJarsPublication SKIPPED
> Task :solr:solrj:generatePomFileForJarsPublication
> Task :solr:solrj:javadoc SKIPPED
> Task :solr:solrj:javadocJar
> Task :solr:solrj:sourcesJar
> Task :solr:solrj:publishJarsPublicationToBuildRepository
> Task :solr:solrj-streaming:processResources
> Task :solr:solrj-streaming:classes
> Task :solr:solrj-streaming:jar
> Task :solr:solrj-streaming:generateMetadataFileForJarsPublication SKIPPED
> Task :solr:solrj-streaming:generatePomFileForJarsPublication
> Task :solr:solrj-streaming:javadoc SKIPPED
> Task :solr:solrj-streaming:javadocJar
> Task :solr:solrj-streaming:sourcesJar
> Task :solr:solrj-streaming:publishJarsPublicationToBuildRepository
> Task :solr:solrj-zookeeper:processResources NO-SOURCE
> Task :solr:solrj-zookeeper:classes
> Task :solr:solrj-zookeeper:jar
> Task :solr:solrj-zookeeper:generateMetadataFileForJarsPublication SKIPPED
> Task :solr:solrj-zookeeper:generatePomFileForJarsPublication
> Task :solr:solrj-zookeeper:javadoc SKIPPED
> Task :solr:solrj-zookeeper:javadocJar
> Task :solr:solrj-zookeeper:sourcesJar
> Task :solr:solrj-zookeeper:publishJarsPublicationToBuildRepository

> Task :solr:test-framework:compileJava
Note: Some input files use or override a deprecated API.
Note: Recompile with -Xlint:deprecation for details.

> Task :solr:test-framework:processResources
> Task :solr:test-framework:classes
> Task :solr:test-framework:jar
> Task :solr:test-framework:generateMetadataFileForJarsPublication SKIPPED
> Task :solr:test-framework:generatePomFileForJarsPublication
> Task :solr:test-framework:renderJavadoc
> Task :solr:test-framework:javadoc SKIPPED
> Task :solr:test-framework:javadocJar
> Task :solr:test-framework:sourcesJar
> Task :solr:test-framework:publishJarsPublicationToBuildRepository

> Task :solr:modules:analysis-extras:compileJava
Note: /home/jenkins/jenkins-slave/workspace/Solr/Solr-Smoketest-9.x/solr/modules/analysis-extras/src/java/org/apache/solr/schema/ICUCollationField.java uses or overrides a deprecated API.
Note: Recompile with -Xlint:deprecation for details.

> Task :solr:modules:analysis-extras:processResources NO-SOURCE
> Task :solr:modules:analysis-extras:classes
> Task :solr:modules:analysis-extras:jar
> Task :solr:modules:analysis-extras:generateMetadataFileForJarsPublication SKIPPED
> Task :solr:modules:analysis-extras:generatePomFileForJarsPublication
> Task :solr:modules:analysis-extras:renderJavadoc
> Task :solr:modules:analysis-extras:javadoc SKIPPED
> Task :solr:modules:analysis-extras:javadocJar
> Task :solr:modules:analysis-extras:sourcesJar
> Task :solr:modules:analysis-extras:publishJarsPublicationToBuildRepository

> Task :solr:modules:analytics:compileJava
Note: Some input files use or override a deprecated API.
Note: Recompile with -Xlint:deprecation for details.

> Task :solr:modules:analytics:processResources NO-SOURCE
> Task :solr:modules:analytics:classes
> Task :solr:modules:analytics:jar
> Task :solr:modules:analytics:generateMetadataFileForJarsPublication SKIPPED
> Task :solr:modules:analytics:generatePomFileForJarsPublication
> Task :solr:modules:analytics:renderJavadoc
> Task :solr:modules:analytics:javadoc SKIPPED
> Task :solr:modules:analytics:javadocJar
> Task :solr:modules:analytics:sourcesJar
> Task :solr:modules:analytics:publishJarsPublicationToBuildRepository
> Task :solr:modules:clustering:compileJava
> Task :solr:modules:clustering:processResources NO-SOURCE
> Task :solr:modules:clustering:classes
> Task :solr:modules:clustering:jar
> Task :solr:modules:clustering:generateMetadataFileForJarsPublication SKIPPED
> Task :solr:modules:clustering:generatePomFileForJarsPublication
> Task :solr:modules:clustering:renderJavadoc
> Task :solr:modules:clustering:javadoc SKIPPED
> Task :solr:modules:clustering:javadocJar
> Task :solr:modules:clustering:sourcesJar
> Task :solr:modules:clustering:publishJarsPublicationToBuildRepository

> Task :solr:modules:extraction:compileJava
Note: /home/jenkins/jenkins-slave/workspace/Solr/Solr-Smoketest-9.x/solr/modules/extraction/src/java/org/apache/solr/handler/extraction/ExtractingDocumentLoader.java uses or overrides a deprecated API.
Note: Recompile with -Xlint:deprecation for details.

> Task :solr:modules:extraction:processResources
> Task :solr:modules:extraction:classes
> Task :solr:modules:extraction:jar
> Task :solr:modules:extraction:generateMetadataFileForJarsPublication SKIPPED
> Task :solr:modules:extraction:generatePomFileForJarsPublication
> Task :solr:modules:extraction:renderJavadoc
> Task :solr:modules:extraction:javadoc SKIPPED
> Task :solr:modules:extraction:javadocJar
> Task :solr:modules:extraction:sourcesJar
> Task :solr:modules:extraction:publishJarsPublicationToBuildRepository

> Task :solr:modules:gcs-repository:compileJava
Note: /home/jenkins/jenkins-slave/workspace/Solr/Solr-Smoketest-9.x/solr/modules/gcs-repository/src/java/org/apache/solr/gcs/GCSConfigParser.java uses or overrides a deprecated API.
Note: Recompile with -Xlint:deprecation for details.

> Task :solr:modules:gcs-repository:processResources NO-SOURCE
> Task :solr:modules:gcs-repository:classes
> Task :solr:modules:gcs-repository:jar
> Task :solr:modules:gcs-repository:generateMetadataFileForJarsPublication SKIPPED
> Task :solr:modules:gcs-repository:generatePomFileForJarsPublication
> Task :solr:modules:gcs-repository:renderJavadoc
> Task :solr:modules:gcs-repository:javadoc SKIPPED
> Task :solr:modules:gcs-repository:javadocJar
> Task :solr:modules:gcs-repository:sourcesJar
> Task :solr:modules:gcs-repository:publishJarsPublicationToBuildRepository

> Task :solr:modules:hadoop-auth:compileJava
Note: Some input files use or override a deprecated API.
Note: Recompile with -Xlint:deprecation for details.

> Task :solr:modules:hadoop-auth:processResources NO-SOURCE
> Task :solr:modules:hadoop-auth:classes
> Task :solr:modules:hadoop-auth:jar
> Task :solr:modules:hadoop-auth:generateMetadataFileForJarsPublication SKIPPED
> Task :solr:modules:hadoop-auth:generatePomFileForJarsPublication
> Task :solr:modules:hadoop-auth:renderJavadoc
> Task :solr:modules:hadoop-auth:javadoc SKIPPED
> Task :solr:modules:hadoop-auth:javadocJar
> Task :solr:modules:hadoop-auth:sourcesJar
> Task :solr:modules:hadoop-auth:publishJarsPublicationToBuildRepository

> Task :solr:modules:hdfs:compileJava
Note: Some input files use or override a deprecated API.
Note: Recompile with -Xlint:deprecation for details.

> Task :solr:modules:hdfs:processResources NO-SOURCE
> Task :solr:modules:hdfs:classes
> Task :solr:modules:hdfs:jar
> Task :solr:modules:hdfs:generateMetadataFileForJarsPublication SKIPPED
> Task :solr:modules:hdfs:generatePomFileForJarsPublication
> Task :solr:modules:hdfs:renderJavadoc
> Task :solr:modules:hdfs:javadoc SKIPPED
> Task :solr:modules:hdfs:javadocJar
> Task :solr:modules:hdfs:sourcesJar
> Task :solr:modules:hdfs:publishJarsPublicationToBuildRepository
> Task :solr:modules:jaegertracer-configurator:compileJava
> Task :solr:modules:jaegertracer-configurator:processResources NO-SOURCE
> Task :solr:modules:jaegertracer-configurator:classes
> Task :solr:modules:jaegertracer-configurator:jar
> Task :solr:modules:jaegertracer-configurator:generateMetadataFileForJarsPublication SKIPPED
> Task :solr:modules:jaegertracer-configurator:generatePomFileForJarsPublication
> Task :solr:modules:jaegertracer-configurator:renderJavadoc
> Task :solr:modules:jaegertracer-configurator:javadoc SKIPPED
> Task :solr:modules:jaegertracer-configurator:javadocJar
> Task :solr:modules:jaegertracer-configurator:sourcesJar
> Task :solr:modules:jaegertracer-configurator:publishJarsPublicationToBuildRepository

> Task :solr:modules:jwt-auth:compileJava
Note: /home/jenkins/jenkins-slave/workspace/Solr/Solr-Smoketest-9.x/solr/modules/jwt-auth/src/java/org/apache/solr/security/jwt/JWTAuthPlugin.java uses or overrides a deprecated API.
Note: Recompile with -Xlint:deprecation for details.

> Task :solr:modules:jwt-auth:processResources NO-SOURCE
> Task :solr:modules:jwt-auth:classes
> Task :solr:modules:jwt-auth:jar
> Task :solr:modules:jwt-auth:generateMetadataFileForJarsPublication SKIPPED
> Task :solr:modules:jwt-auth:generatePomFileForJarsPublication
> Task :solr:modules:jwt-auth:renderJavadoc
> Task :solr:modules:jwt-auth:javadoc SKIPPED
> Task :solr:modules:jwt-auth:javadocJar
> Task :solr:modules:jwt-auth:sourcesJar
> Task :solr:modules:jwt-auth:publishJarsPublicationToBuildRepository

> Task :solr:modules:langid:compileJava
Note: Some input files use or override a deprecated API.
Note: Recompile with -Xlint:deprecation for details.

> Task :solr:modules:langid:processResources
> Task :solr:modules:langid:classes
> Task :solr:modules:langid:jar
> Task :solr:modules:langid:generateMetadataFileForJarsPublication SKIPPED
> Task :solr:modules:langid:generatePomFileForJarsPublication
> Task :solr:modules:langid:renderJavadoc
> Task :solr:modules:langid:javadoc SKIPPED
> Task :solr:modules:langid:javadocJar
> Task :solr:modules:langid:sourcesJar
> Task :solr:modules:langid:publishJarsPublicationToBuildRepository

> Task :solr:modules:ltr:compileJava
Note: Some input files use or override a deprecated API.
Note: Recompile with -Xlint:deprecation for details.

> Task :solr:modules:ltr:processResources NO-SOURCE
> Task :solr:modules:ltr:classes
> Task :solr:modules:ltr:jar
> Task :solr:modules:ltr:generateMetadataFileForJarsPublication SKIPPED
> Task :solr:modules:ltr:generatePomFileForJarsPublication
> Task :solr:modules:ltr:renderJavadoc
> Task :solr:modules:ltr:javadoc SKIPPED
> Task :solr:modules:ltr:javadocJar
> Task :solr:modules:ltr:sourcesJar
> Task :solr:modules:ltr:publishJarsPublicationToBuildRepository
> Task :solr:modules:opentelemetry:compileJava
> Task :solr:modules:opentelemetry:processResources NO-SOURCE
> Task :solr:modules:opentelemetry:classes
> Task :solr:modules:opentelemetry:jar
> Task :solr:modules:opentelemetry:generateMetadataFileForJarsPublication SKIPPED
> Task :solr:modules:opentelemetry:generatePomFileForJarsPublication
> Task :solr:modules:opentelemetry:renderJavadoc
> Task :solr:modules:opentelemetry:javadoc SKIPPED
> Task :solr:modules:opentelemetry:javadocJar
> Task :solr:modules:opentelemetry:sourcesJar
> Task :solr:modules:opentelemetry:publishJarsPublicationToBuildRepository
> Task :solr:modules:s3-repository:compileJava
> Task :solr:modules:s3-repository:processResources NO-SOURCE
> Task :solr:modules:s3-repository:classes
> Task :solr:modules:s3-repository:jar
> Task :solr:modules:s3-repository:generateMetadataFileForJarsPublication SKIPPED
> Task :solr:modules:s3-repository:generatePomFileForJarsPublication
> Task :solr:modules:s3-repository:renderJavadoc
> Task :solr:modules:s3-repository:javadoc SKIPPED
> Task :solr:modules:s3-repository:javadocJar
> Task :solr:modules:s3-repository:sourcesJar
> Task :solr:modules:s3-repository:publishJarsPublicationToBuildRepository

> Task :solr:modules:scripting:compileJava
Note: /home/jenkins/jenkins-slave/workspace/Solr/Solr-Smoketest-9.x/solr/modules/scripting/src/java/org/apache/solr/scripting/xslt/XSLTUpdateRequestHandler.java uses or overrides a deprecated API.
Note: Recompile with -Xlint:deprecation for details.

> Task :solr:modules:scripting:processResources NO-SOURCE
> Task :solr:modules:scripting:classes
> Task :solr:modules:scripting:jar
> Task :solr:modules:scripting:generateMetadataFileForJarsPublication SKIPPED
> Task :solr:modules:scripting:generatePomFileForJarsPublication
> Task :solr:modules:scripting:renderJavadoc
> Task :solr:modules:scripting:javadoc SKIPPED
> Task :solr:modules:scripting:javadocJar
> Task :solr:modules:scripting:sourcesJar
> Task :solr:modules:scripting:publishJarsPublicationToBuildRepository

> Task :solr:modules:sql:compileJava
Note: Some input files use or override a deprecated API.
Note: Recompile with -Xlint:deprecation for details.

> Task :solr:modules:sql:processResources
> Task :solr:modules:sql:classes
> Task :solr:modules:sql:jar
> Task :solr:modules:sql:generateMetadataFileForJarsPublication SKIPPED
> Task :solr:modules:sql:generatePomFileForJarsPublication
> Task :solr:modules:sql:renderJavadoc
> Task :solr:modules:sql:javadoc SKIPPED
> Task :solr:modules:sql:javadocJar
> Task :solr:modules:sql:sourcesJar
> Task :solr:modules:sql:publishJarsPublicationToBuildRepository

> Task :mavenToLocalFolder
Local maven artifacts (poms, jars) created at: /home/jenkins/jenkins-slave/workspace/Solr/Solr-Smoketest-9.x/build/maven-local

> Task :checkWorkingCopyClean
> Task :solr:distribution:assembleSourceTgz
> Task :solr:docker:createBodySnippetDockerfile
> Task :solr:docker:createDockerfileLocal
> Task :solr:docker:assemblePackaging
> Task :solr:documentation:changesToHtml
> Task :solr:documentation:copyDocumentationAssets
> Task :solr:documentation:markdownToHtml
> Task :solr:documentation:copyChangesToHtmlForMiniSite
> Task :solr:documentation:copyMiniDocumentationAssets
> Task :solr:documentation:createMiniDocumentationIndex
> Task :solr:documentation:documentationMinimal
> Task :solr:core:assemblePostJar
> Task :solr:example:assemblePackaging
> Task :solr:prometheus-exporter:assemblePackaging
> Task :solr:webapp:compileJava NO-SOURCE
> Task :solr:webapp:processResources NO-SOURCE
> Task :solr:webapp:classes UP-TO-DATE
> Task :solr:webapp:war
> Task :solr:server:assemblePackaging
> Task :solr:modules:analysis-extras:assemblePackaging
> Task :solr:modules:analytics:assemblePackaging
> Task :solr:modules:clustering:assemblePackaging
> Task :solr:modules:extraction:assemblePackaging
> Task :solr:modules:gcs-repository:assemblePackaging
> Task :solr:modules:hadoop-auth:assemblePackaging
> Task :solr:modules:hdfs:assemblePackaging
> Task :solr:modules:jaegertracer-configurator:assemblePackaging
> Task :solr:modules:jwt-auth:assemblePackaging
> Task :solr:modules:langid:assemblePackaging
> Task :solr:modules:ltr:assemblePackaging
> Task :solr:modules:opentelemetry:assemblePackaging
> Task :solr:modules:s3-repository:assemblePackaging
> Task :solr:modules:scripting:assemblePackaging
> Task :solr:modules:sql:assemblePackaging
> Task :solr:packaging:fullDistTar
> Task :solr:packaging:slimDistTar
> Task :solr:distribution:computeChecksums
> Task :solr:distribution:prepareGitRev
> Task :solr:docker:createDockerfileOfficialFull
> Task :solr:docker:createDockerfileOfficialSlim
> Task :solr:distribution:assembleRelease

Deprecated Gradle features were used in this build, making it incompatible with Gradle 8.0.

You can use '--warning-mode all' to show the individual deprecation warnings and determine if they come from your own scripts or plugins.

See https://docs.gradle.org/7.6/userguide/command_line_interface.html#sec:command_line_warnings

BUILD SUCCESSFUL in 3m 55s
246 actionable tasks: 238 executed, 8 up-to-date
Build step 'Invoke Gradle script' changed build result to SUCCESS
Run condition [Always] enabling perform for step [Execute shell]
[Solr-Smoketest-9.x] $ /bin/bash /tmp/jenkins18351545298033045720.sh
Installing Python script requirements
Defaulting to user installation because normal site-packages is not writeable
Requirement already satisfied: six~=1.16.0 in /home/jenkins/.local/lib/python3.8/site-packages (from -r dev-tools/scripts/requirements.txt (line 1)) (1.16.0)
Requirement already satisfied: Jinja2~=3.1.1 in /home/jenkins/.local/lib/python3.8/site-packages (from -r dev-tools/scripts/requirements.txt (line 2)) (3.1.2)
Requirement already satisfied: PyYAML~=6.0 in /home/jenkins/.local/lib/python3.8/site-packages (from -r dev-tools/scripts/requirements.txt (line 3)) (6.0)
Requirement already satisfied: holidays~=0.16 in /home/jenkins/.local/lib/python3.8/site-packages (from -r dev-tools/scripts/requirements.txt (line 4)) (0.21)
Requirement already satisfied: ics~=0.7.2 in /home/jenkins/.local/lib/python3.8/site-packages (from -r dev-tools/scripts/requirements.txt (line 5)) (0.7.2)
Requirement already satisfied: console-menu~=0.7.1 in /home/jenkins/.local/lib/python3.8/site-packages (from -r dev-tools/scripts/requirements.txt (line 6)) (0.7.1)
Requirement already satisfied: PyGithub~=1.56 in /home/jenkins/.local/lib/python3.8/site-packages (from -r dev-tools/scripts/requirements.txt (line 7)) (1.58.0)
Requirement already satisfied: jira~=3.4.1 in /home/jenkins/.local/lib/python3.8/site-packages (from -r dev-tools/scripts/requirements.txt (line 8)) (3.4.1)
Requirement already satisfied: MarkupSafe>=2.0 in /home/jenkins/.local/lib/python3.8/site-packages (from Jinja2~=3.1.1->-r dev-tools/scripts/requirements.txt (line 2)) (2.1.2)
Requirement already satisfied: PyMeeus in /home/jenkins/.local/lib/python3.8/site-packages (from holidays~=0.16->-r dev-tools/scripts/requirements.txt (line 4)) (0.5.11)
Requirement already satisfied: convertdate>=2.3.0 in /home/jenkins/.local/lib/python3.8/site-packages (from holidays~=0.16->-r dev-tools/scripts/requirements.txt (line 4)) (2.4.0)
Requirement already satisfied: hijri-converter in /home/jenkins/.local/lib/python3.8/site-packages (from holidays~=0.16->-r dev-tools/scripts/requirements.txt (line 4)) (2.2.3)
Requirement already satisfied: korean-lunar-calendar in /home/jenkins/.local/lib/python3.8/site-packages (from holidays~=0.16->-r dev-tools/scripts/requirements.txt (line 4)) (0.2.1)
Requirement already satisfied: python-dateutil in /usr/lib/python3/dist-packages (from holidays~=0.16->-r dev-tools/scripts/requirements.txt (line 4)) (2.7.3)
Requirement already satisfied: backports.zoneinfo in /home/jenkins/.local/lib/python3.8/site-packages (from holidays~=0.16->-r dev-tools/scripts/requirements.txt (line 4)) (0.2.1)
Requirement already satisfied: arrow>=0.11 in /home/jenkins/.local/lib/python3.8/site-packages (from ics~=0.7.2->-r dev-tools/scripts/requirements.txt (line 5)) (0.14.7)
Requirement already satisfied: tatsu>4.2 in /home/jenkins/.local/lib/python3.8/site-packages (from ics~=0.7.2->-r dev-tools/scripts/requirements.txt (line 5)) (5.6.1)
Requirement already satisfied: attrs>=19.1.0 in /usr/lib/python3/dist-packages (from ics~=0.7.2->-r dev-tools/scripts/requirements.txt (line 5)) (19.3.0)
Requirement already satisfied: ansiwrap in /home/jenkins/.local/lib/python3.8/site-packages (from console-menu~=0.7.1->-r dev-tools/scripts/requirements.txt (line 6)) (0.8.4)
Requirement already satisfied: deprecated in /home/jenkins/.local/lib/python3.8/site-packages (from PyGithub~=1.56->-r dev-tools/scripts/requirements.txt (line 7)) (1.2.13)
Requirement already satisfied: pyjwt>=2.4.0 in /home/jenkins/.local/lib/python3.8/site-packages (from PyGithub~=1.56->-r dev-tools/scripts/requirements.txt (line 7)) (2.6.0)
Requirement already satisfied: pynacl>=1.4.0 in /home/jenkins/.local/lib/python3.8/site-packages (from PyGithub~=1.56->-r dev-tools/scripts/requirements.txt (line 7)) (1.5.0)
Requirement already satisfied: requests>=2.14.0 in /usr/lib/python3/dist-packages (from PyGithub~=1.56->-r dev-tools/scripts/requirements.txt (line 7)) (2.22.0)
Requirement already satisfied: defusedxml in /home/jenkins/.local/lib/python3.8/site-packages (from jira~=3.4.1->-r dev-tools/scripts/requirements.txt (line 8)) (0.7.1)
Requirement already satisfied: packaging in /home/jenkins/.local/lib/python3.8/site-packages (from jira~=3.4.1->-r dev-tools/scripts/requirements.txt (line 8)) (23.0)
Requirement already satisfied: requests-oauthlib>=1.1.0 in /home/jenkins/.local/lib/python3.8/site-packages (from jira~=3.4.1->-r dev-tools/scripts/requirements.txt (line 8)) (1.3.1)
Requirement already satisfied: requests-toolbelt in /home/jenkins/.local/lib/python3.8/site-packages (from jira~=3.4.1->-r dev-tools/scripts/requirements.txt (line 8)) (0.9.1)
Requirement already satisfied: typing-extensions>=3.7.4.2 in /home/jenkins/.local/lib/python3.8/site-packages (from jira~=3.4.1->-r dev-tools/scripts/requirements.txt (line 8)) (4.5.0)
Requirement already satisfied: cffi>=1.4.1 in /usr/local/lib/python3.8/dist-packages (from pynacl>=1.4.0->PyGithub~=1.56->-r dev-tools/scripts/requirements.txt (line 7)) (1.14.2)
Requirement already satisfied: oauthlib>=3.0.0 in /usr/lib/python3/dist-packages (from requests-oauthlib>=1.1.0->jira~=3.4.1->-r dev-tools/scripts/requirements.txt (line 8)) (3.1.0)
Requirement already satisfied: textwrap3>=0.9.2 in /home/jenkins/.local/lib/python3.8/site-packages (from ansiwrap->console-menu~=0.7.1->-r dev-tools/scripts/requirements.txt (line 6)) (0.9.2)
Requirement already satisfied: wrapt<2,>=1.10 in /home/jenkins/.local/lib/python3.8/site-packages (from deprecated->PyGithub~=1.56->-r dev-tools/scripts/requirements.txt (line 7)) (1.13.3)
Requirement already satisfied: pycparser in /usr/local/lib/python3.8/dist-packages (from cffi>=1.4.1->pynacl>=1.4.0->PyGithub~=1.56->-r dev-tools/scripts/requirements.txt (line 7)) (2.20)
DEPRECATION: dblatex 0.3.11py3 has a non-standard version number. pip 23.3 will enforce this behaviour change. A possible replacement is to upgrade to a newer version of dblatex or contact the author to suggest that they release a version with a conforming version number. Discussion can be found at https://github.com/pypa/pip/issues/12063
DEPRECATION: devscripts 2.20.2ubuntu2 has a non-standard version number. pip 23.3 will enforce this behaviour change. A possible replacement is to upgrade to a newer version of devscripts or contact the author to suggest that they release a version with a conforming version number. Discussion can be found at https://github.com/pypa/pip/issues/12063
Starting Smoke tester in folder /home/jenkins/jenkins-slave/workspace/Solr/Solr-Smoketest-9.x
Java 11 JAVA_HOME=/home/jenkins/tools/java/latest11
NOTE: output encoding is utf-8
NOTE: Not running @Nightly or @BadApple tests. Please verify that recent Jenkins runs have passed.

Load release URL "file:///home/jenkins/jenkins-slave/workspace/Solr/Solr-Smoketest-9.x/solr/distribution/build/release"...

Get KEYS...
    Downloading online KEYS file https://archive.apache.org/dist/solr/KEYS
Downloading https://archive.apache.org/dist/solr/KEYS
    0.3 MB in 1.08 sec (0.3 MB/sec)

Test Solr...
  test basics...
  check changes HTML...
  download solr-9.4.0-slim.tgz...
Downloading file:///home/jenkins/jenkins-slave/workspace/Solr/Solr-Smoketest-9.x/solr/distribution/build/release/solr-9.4.0-slim.tgz
    59.8 MB in 0.05 sec (1269.4 MB/sec)
    verify sha512 digest
  download solr-9.4.0-src.tgz...
Downloading file:///home/jenkins/jenkins-slave/workspace/Solr/Solr-Smoketest-9.x/solr/distribution/build/release/solr-9.4.0-src.tgz
    85.9 MB in 0.07 sec (1268.0 MB/sec)
    verify sha512 digest
  download solr-9.4.0.tgz...
Downloading file:///home/jenkins/jenkins-slave/workspace/Solr/Solr-Smoketest-9.x/solr/distribution/build/release/solr-9.4.0.tgz
    264.8 MB in 0.21 sec (1243.2 MB/sec)
    verify sha512 digest
  unpack solr-9.4.0.tgz...
  solr-9.4.0.tgz
    Checking LICENSE.txt
    Checking NOTICE.txt
    Checking README.txt
    Checking CHANGES.txt
    Checking bin
    Checking modules
    Checking docker
    Checking prometheus-exporter
    Checking docs
    Checking example
    Checking licenses
    Checking server
    Checking lib
    verify JAR metadata/identity/no javax.* or java.* classes...
      **WARNING**: skipping check of /home/jenkins/jenkins-slave/workspace/Solr/Solr-Smoketest-9.x/_tmp/smoke_1695015245/unpack/solr-9.4.0/modules/extraction/lib/unit-api-1.0.jar: it has javax.* classes
      **WARNING**: skipping check of /home/jenkins/jenkins-slave/workspace/Solr/Solr-Smoketest-9.x/_tmp/smoke_1695015245/unpack/solr-9.4.0/modules/extraction/lib/jakarta.activation-1.2.2.jar: it has javax.* classes
      **WARNING**: skipping check of /home/jenkins/jenkins-slave/workspace/Solr/Solr-Smoketest-9.x/_tmp/smoke_1695015245/unpack/solr-9.4.0/server/solr-webapp/webapp/WEB-INF/lib/jakarta.inject-2.6.1.jar: it has javax.* classes
      **WARNING**: skipping check of /home/jenkins/jenkins-slave/workspace/Solr/Solr-Smoketest-9.x/_tmp/smoke_1695015245/unpack/solr-9.4.0/server/solr-webapp/webapp/WEB-INF/lib/jakarta.activation-api-1.2.2.jar: it has javax.* classes
      **WARNING**: skipping check of /home/jenkins/jenkins-slave/workspace/Solr/Solr-Smoketest-9.x/_tmp/smoke_1695015245/unpack/solr-9.4.0/server/solr-webapp/webapp/WEB-INF/lib/jakarta.validation-api-2.0.2.jar: it has javax.* classes
      **WARNING**: skipping check of /home/jenkins/jenkins-slave/workspace/Solr/Solr-Smoketest-9.x/_tmp/smoke_1695015245/unpack/solr-9.4.0/server/solr-webapp/webapp/WEB-INF/lib/jakarta.annotation-api-1.3.5.jar: it has javax.* classes
      **WARNING**: skipping check of /home/jenkins/jenkins-slave/workspace/Solr/Solr-Smoketest-9.x/_tmp/smoke_1695015245/unpack/solr-9.4.0/server/solr-webapp/webapp/WEB-INF/lib/jakarta.ws.rs-api-2.1.6.jar: it has javax.* classes
      **WARNING**: skipping check of /home/jenkins/jenkins-slave/workspace/Solr/Solr-Smoketest-9.x/_tmp/smoke_1695015245/unpack/solr-9.4.0/server/solr-webapp/webapp/WEB-INF/lib/jakarta.xml.bind-api-2.3.3.jar: it has javax.* classes
      **WARNING**: skipping check of /home/jenkins/jenkins-slave/workspace/Solr/Solr-Smoketest-9.x/_tmp/smoke_1695015245/unpack/solr-9.4.0/server/lib/ext/jetty-servlet-api-4.0.6.jar: it has javax.* classes
    copying unpacked distribution for Java 11 ...
    test solr example w/ Java 11...
      start Solr instance (log=/home/jenkins/jenkins-slave/workspace/Solr/Solr-Smoketest-9.x/_tmp/smoke_1695015245/unpack/solr-9.4.0-java11/solr-example.log)...
Sending stop command to Solr running on port 8983 ... waiting up to 180 seconds to allow Jetty process 672875
3562566 to stop gracefully.
java.net.ConnectException: Connection refused (Connection refused)
	at java.base/java.net.PlainSocketImpl.socketConnect(Native Method)
	at java.base/java.net.AbstractPlainSocketImpl.doConnect(AbstractPlainSocketImpl.java:412)
	at java.base/java.net.AbstractPlainSocketImpl.connectToAddress(AbstractPlainSocketImpl.java:255)
	at java.base/java.net.AbstractPlainSocketImpl.connect(AbstractPlainSocketImpl.java:237)
	at java.base/java.net.SocksSocketImpl.connect(SocksSocketImpl.java:392)
	at java.base/java.net.Socket.connect(Socket.java:609)
	at java.base/java.net.Socket.connect(Socket.java:558)
	at java.base/java.net.Socket.<init>(Socket.java:454)
	at java.base/java.net.Socket.<init>(Socket.java:264)
	at org.eclipse.jetty.start.Main.stop(Main.java:613)
	at org.eclipse.jetty.start.Main.stop(Main.java:589)
	at org.eclipse.jetty.start.Main.doStop(Main.java:576)
	at org.eclipse.jetty.start.Main.start(Main.java:449)
	at org.eclipse.jetty.start.Main.main(Main.java:76)

Usage: java -jar $JETTY_HOME/start.jar [options] [properties] [configs]
       java -jar $JETTY_HOME/start.jar --help  # for more information
error: process ID list syntax error

Usage:
 ps [options]

 Try 'ps --help <simple|list|output|threads|misc|all>'
  or 'ps --help <s|l|o|t|m|a>'
 for additional help text.

For more details see ps(1).
    error: process ID list syntax error

Usage:
 ps [options]

 Try 'ps --help <simple|list|output|threads|misc|all>'
  or 'ps --help <s|l|o|t|m|a>'
 for additional help text.

For more details see ps(1).
error: process ID list syntax error

Usage:
 ps [options]

 Try 'ps --help <simple|list|output|threads|misc|all>'
  or 'ps --help <s|l|o|t|m|a>'
 for additional help text.

For more details see ps(1).
      Running techproducts example on port 8983 from /home/jenkins/jenkins-slave/workspace/Solr/Solr-Smoketest-9.x/_tmp/smoke_1695015245/unpack/solr-9.4.0-java11
*** [WARN] *** Your open file limit is currently 60000.  
 It should be set to 65000 to avoid operational disruption. 
 If you no longer wish to see this warning, set SOLR_ULIMIT_CHECKS to false in your profile or solr.in.sh
*** [WARN] ***  Your Max Processes Limit is currently 30000. 
 It should be set to 65000 to avoid operational disruption. 
 If you no longer wish to see this warning, set SOLR_ULIMIT_CHECKS to false in your profile or solr.in.sh
Creating Solr home directory /home/jenkins/jenkins-slave/workspace/Solr/Solr-Smoketest-9.x/_tmp/smoke_1695015245/unpack/solr-9.4.0-java11/example/techproducts/solr

Starting up Solr on port 8983 using command:
"bin/solr" start -p 8983 -s "example/techproducts/solr"

*** [WARN] *** Your open file limit is currently 60000.  
 It should be set to 65000 to avoid operational disruption. 
 If you no longer wish to see this warning, set SOLR_ULIMIT_CHECKS to false in your profile or solr.in.sh
*** [WARN] ***  Your Max Processes Limit is currently 30000. 
 It should be set to 65000 to avoid operational disruption. 
 If you no longer wish to see this warning, set SOLR_ULIMIT_CHECKS to false in your profile or solr.in.sh

Port 8983 is already being used by another process (pid: 672875
3562566)
Please choose a different port using the -p option.


ERROR: Failed to start Solr using command: "bin/solr" start -p 8983 -s "example/techproducts/solr" Exception : org.apache.commons.exec.ExecuteException: Process exited with an error: 1 (Exit value: 1)

      stop server using: bin/solr stop -p 8983
Sending stop command to Solr running on port 8983 ... waiting up to 180 seconds to allow Jetty process 672875
3562566 to stop gracefully.
java.net.ConnectException: Connection refused (Connection refused)
	at java.base/java.net.PlainSocketImpl.socketConnect(Native Method)
	at java.base/java.net.AbstractPlainSocketImpl.doConnect(AbstractPlainSocketImpl.java:412)
	at java.base/java.net.AbstractPlainSocketImpl.connectToAddress(AbstractPlainSocketImpl.java:255)
	at java.base/java.net.AbstractPlainSocketImpl.connect(AbstractPlainSocketImpl.java:237)
	at java.base/java.net.SocksSocketImpl.connect(SocksSocketImpl.java:392)
	at java.base/java.net.Socket.connect(Socket.java:609)
	at java.base/java.net.Socket.connect(Socket.java:558)
	at java.base/java.net.Socket.<init>(Socket.java:454)
	at java.base/java.net.Socket.<init>(Socket.java:264)
	at org.eclipse.jetty.start.Main.stop(Main.java:613)
	at org.eclipse.jetty.start.Main.stop(Main.java:589)
	at org.eclipse.jetty.start.Main.doStop(Main.java:576)
	at org.eclipse.jetty.start.Main.start(Main.java:449)
	at org.eclipse.jetty.start.Main.main(Main.java:76)

Usage: java -jar $JETTY_HOME/start.jar [options] [properties] [configs]
       java -jar $JETTY_HOME/start.jar --help  # for more information
error: process ID list syntax error

Usage:
 ps [options]

 Try 'ps --help <simple|list|output|threads|misc|all>'
  or 'ps --help <s|l|o|t|m|a>'
 for additional help text.

For more details see ps(1).
    error: process ID list syntax error

Usage:
 ps [options]

 Try 'ps --help <simple|list|output|threads|misc|all>'
  or 'ps --help <s|l|o|t|m|a>'
 for additional help text.

For more details see ps(1).
error: process ID list syntax error

Usage:
 ps [options]

 Try 'ps --help <simple|list|output|threads|misc|all>'
  or 'ps --help <s|l|o|t|m|a>'
 for additional help text.

For more details see ps(1).
Traceback (most recent call last):
  File "dev-tools/scripts/smokeTestRelease.py", line 1174, in <module>
    main()
  File "dev-tools/scripts/smokeTestRelease.py", line 1100, in main
    smokeTest(c.java, c.url, c.revision, c.version, c.tmp_dir, c.is_signed, c.local_keys, ' '.join(c.test_args),
  File "dev-tools/scripts/smokeTestRelease.py", line 1160, in smokeTest
    unpackAndVerify(java, tmpDir, 'solr-%s.tgz' % version, gitRevision, version, testArgs)
  File "dev-tools/scripts/smokeTestRelease.py", line 553, in unpackAndVerify
    verifyUnpacked(java, artifact, unpackPath, gitRevision, version, testArgs)
  File "dev-tools/scripts/smokeTestRelease.py", line 671, in verifyUnpacked
    testSolrExample(java11UnpackPath, java.java11_home)
  File "dev-tools/scripts/smokeTestRelease.py", line 752, in testSolrExample
    raise RuntimeError('Failed to run the techproducts example, check log for previous errors.')
RuntimeError: Failed to run the techproducts example, check log for previous errors.
Build step 'Run with timeout' marked build as failure
Email was triggered for: Failure - Any
Sending email for trigger: Failure - Any