You are viewing a plain text version of this content. The canonical link for it is here.
Posted to builds@hbase.apache.org by Apache Jenkins Server <je...@builds.apache.org> on 2016/03/18 04:15:12 UTC

Build failed in Jenkins: HBase-1.4 » latest1.8,yahoo-not-h2 #27

See <https://builds.apache.org/job/HBase-1.4/jdk=latest1.8,label=yahoo-not-h2/27/changes>

Changes:

[tedyu] HBASE-15456 CreateTableProcedure/ModifyTableProcedure needs to fail when

------------------------------------------
[...truncated 50681 lines...]
  Run 3: TestThriftServerCmdLine.testRunThriftServer:189->talkToThriftServer:223 expected:<1> but was:<0>

org.apache.hadoop.hbase.thrift.TestThriftServerCmdLine.testRunThriftServer[19](org.apache.hadoop.hbase.thrift.TestThriftServerCmdLine)
  Run 1: TestThriftServerCmdLine.testRunThriftServer:189->talkToThriftServer:223 expected:<1> but was:<0>
  Run 2: TestThriftServerCmdLine.testRunThriftServer:189->talkToThriftServer:223 expected:<1> but was:<0>
  Run 3: TestThriftServerCmdLine.testRunThriftServer:189->talkToThriftServer:223 expected:<1> but was:<0>

org.apache.hadoop.hbase.thrift.TestThriftServerCmdLine.testRunThriftServer[1](org.apache.hadoop.hbase.thrift.TestThriftServerCmdLine)
  Run 1: TestThriftServerCmdLine.testRunThriftServer:189->talkToThriftServer:223 expected:<1> but was:<0>
  Run 2: TestThriftServerCmdLine.testRunThriftServer:189->talkToThriftServer:223 expected:<1> but was:<0>
  Run 3: TestThriftServerCmdLine.testRunThriftServer:189->talkToThriftServer:223 expected:<1> but was:<0>

org.apache.hadoop.hbase.thrift.TestThriftServerCmdLine.testRunThriftServer[20](org.apache.hadoop.hbase.thrift.TestThriftServerCmdLine)
  Run 1: TestThriftServerCmdLine.testRunThriftServer:189->talkToThriftServer:223 expected:<1> but was:<0>
  Run 2: TestThriftServerCmdLine.testRunThriftServer:189->talkToThriftServer:223 expected:<1> but was:<0>
  Run 3: TestThriftServerCmdLine.testRunThriftServer:189->talkToThriftServer:223 expected:<1> but was:<0>

org.apache.hadoop.hbase.thrift.TestThriftServerCmdLine.testRunThriftServer[21](org.apache.hadoop.hbase.thrift.TestThriftServerCmdLine)
  Run 1: TestThriftServerCmdLine.testRunThriftServer:189->talkToThriftServer:223 expected:<1> but was:<0>
  Run 2: TestThriftServerCmdLine.testRunThriftServer:189->talkToThriftServer:223 expected:<1> but was:<0>
  Run 3: TestThriftServerCmdLine.testRunThriftServer:189->talkToThriftServer:223 expected:<1> but was:<0>

org.apache.hadoop.hbase.thrift.TestThriftServerCmdLine.testRunThriftServer[22](org.apache.hadoop.hbase.thrift.TestThriftServerCmdLine)
  Run 1: TestThriftServerCmdLine.testRunThriftServer:189->talkToThriftServer:223 expected:<1> but was:<0>
  Run 2: TestThriftServerCmdLine.testRunThriftServer:189->talkToThriftServer:223 expected:<1> but was:<0>
  Run 3: TestThriftServerCmdLine.testRunThriftServer:189->talkToThriftServer:223 expected:<1> but was:<0>

org.apache.hadoop.hbase.thrift.TestThriftServerCmdLine.testRunThriftServer[23](org.apache.hadoop.hbase.thrift.TestThriftServerCmdLine)
  Run 1: TestThriftServerCmdLine.testRunThriftServer:189->talkToThriftServer:223 expected:<1> but was:<0>
  Run 2: TestThriftServerCmdLine.testRunThriftServer:189->talkToThriftServer:223 expected:<1> but was:<0>
  Run 3: TestThriftServerCmdLine.testRunThriftServer:189->talkToThriftServer:223 expected:<1> but was:<0>

org.apache.hadoop.hbase.thrift.TestThriftServerCmdLine.testRunThriftServer[24](org.apache.hadoop.hbase.thrift.TestThriftServerCmdLine)
  Run 1: TestThriftServerCmdLine.testRunThriftServer:189->talkToThriftServer:223 expected:<1> but was:<0>
  Run 2: TestThriftServerCmdLine.testRunThriftServer:189->talkToThriftServer:223 expected:<1> but was:<0>
  Run 3: TestThriftServerCmdLine.testRunThriftServer:189->talkToThriftServer:223 expected:<1> but was:<0>

org.apache.hadoop.hbase.thrift.TestThriftServerCmdLine.testRunThriftServer[25](org.apache.hadoop.hbase.thrift.TestThriftServerCmdLine)
  Run 1: TestThriftServerCmdLine.testRunThriftServer:189->talkToThriftServer:223 expected:<1> but was:<0>
  Run 2: TestThriftServerCmdLine.testRunThriftServer:189->talkToThriftServer:223 expected:<1> but was:<0>
  Run 3: TestThriftServerCmdLine.testRunThriftServer:189->talkToThriftServer:223 expected:<1> but was:<0>

org.apache.hadoop.hbase.thrift.TestThriftServerCmdLine.testRunThriftServer[26](org.apache.hadoop.hbase.thrift.TestThriftServerCmdLine)
  Run 1: TestThriftServerCmdLine.testRunThriftServer:189->talkToThriftServer:223 expected:<1> but was:<0>
  Run 2: TestThriftServerCmdLine.testRunThriftServer:189->talkToThriftServer:223 expected:<1> but was:<0>
  Run 3: TestThriftServerCmdLine.testRunThriftServer:189->talkToThriftServer:223 expected:<1> but was:<0>

org.apache.hadoop.hbase.thrift.TestThriftServerCmdLine.testRunThriftServer[27](org.apache.hadoop.hbase.thrift.TestThriftServerCmdLine)
  Run 1: TestThriftServerCmdLine.testRunThriftServer:189->talkToThriftServer:223 expected:<1> but was:<0>
  Run 2: TestThriftServerCmdLine.testRunThriftServer:189->talkToThriftServer:223 expected:<1> but was:<0>
  Run 3: TestThriftServerCmdLine.testRunThriftServer:189->talkToThriftServer:223 expected:<1> but was:<0>

org.apache.hadoop.hbase.thrift.TestThriftServerCmdLine.testRunThriftServer[28](org.apache.hadoop.hbase.thrift.TestThriftServerCmdLine)
  Run 1: TestThriftServerCmdLine.testRunThriftServer:189->talkToThriftServer:223 expected:<1> but was:<0>
  Run 2: TestThriftServerCmdLine.testRunThriftServer:189->talkToThriftServer:223 expected:<1> but was:<0>
  Run 3: TestThriftServerCmdLine.testRunThriftServer:189->talkToThriftServer:223 expected:<1> but was:<0>

org.apache.hadoop.hbase.thrift.TestThriftServerCmdLine.testRunThriftServer[29](org.apache.hadoop.hbase.thrift.TestThriftServerCmdLine)
  Run 1: TestThriftServerCmdLine.testRunThriftServer:189->talkToThriftServer:223 expected:<1> but was:<0>
  Run 2: TestThriftServerCmdLine.testRunThriftServer:189->talkToThriftServer:223 expected:<1> but was:<0>
  Run 3: TestThriftServerCmdLine.testRunThriftServer:189->talkToThriftServer:223 expected:<1> but was:<0>

org.apache.hadoop.hbase.thrift.TestThriftServerCmdLine.testRunThriftServer[2](org.apache.hadoop.hbase.thrift.TestThriftServerCmdLine)
  Run 1: TestThriftServerCmdLine.testRunThriftServer:189->talkToThriftServer:223 expected:<1> but was:<0>
  Run 2: TestThriftServerCmdLine.testRunThriftServer:189->talkToThriftServer:223 expected:<1> but was:<0>
  Run 3: TestThriftServerCmdLine.testRunThriftServer:189->talkToThriftServer:223 expected:<1> but was:<0>

org.apache.hadoop.hbase.thrift.TestThriftServerCmdLine.testRunThriftServer[30](org.apache.hadoop.hbase.thrift.TestThriftServerCmdLine)
  Run 1: TestThriftServerCmdLine.testRunThriftServer:189->talkToThriftServer:223 expected:<1> but was:<0>
  Run 2: TestThriftServerCmdLine.testRunThriftServer:189->talkToThriftServer:223 expected:<1> but was:<0>
  Run 3: TestThriftServerCmdLine.testRunThriftServer:189->talkToThriftServer:223 expected:<1> but was:<0>

org.apache.hadoop.hbase.thrift.TestThriftServerCmdLine.testRunThriftServer[31](org.apache.hadoop.hbase.thrift.TestThriftServerCmdLine)
  Run 1: TestThriftServerCmdLine.testRunThriftServer:189->talkToThriftServer:223 expected:<1> but was:<0>
  Run 2: TestThriftServerCmdLine.testRunThriftServer:189->talkToThriftServer:223 expected:<1> but was:<0>
  Run 3: TestThriftServerCmdLine.testRunThriftServer:189->talkToThriftServer:223 expected:<1> but was:<0>

org.apache.hadoop.hbase.thrift.TestThriftServerCmdLine.testRunThriftServer[3](org.apache.hadoop.hbase.thrift.TestThriftServerCmdLine)
  Run 1: TestThriftServerCmdLine.testRunThriftServer:189->talkToThriftServer:223 expected:<1> but was:<0>
  Run 2: TestThriftServerCmdLine.testRunThriftServer:189->talkToThriftServer:223 expected:<1> but was:<0>
  Run 3: TestThriftServerCmdLine.testRunThriftServer:189->talkToThriftServer:223 expected:<1> but was:<0>

org.apache.hadoop.hbase.thrift.TestThriftServerCmdLine.testRunThriftServer[4](org.apache.hadoop.hbase.thrift.TestThriftServerCmdLine)
  Run 1: TestThriftServerCmdLine.testRunThriftServer:189->talkToThriftServer:223 expected:<1> but was:<0>
  Run 2: TestThriftServerCmdLine.testRunThriftServer:189->talkToThriftServer:223 expected:<1> but was:<0>
  Run 3: TestThriftServerCmdLine.testRunThriftServer:189->talkToThriftServer:223 expected:<1> but was:<0>

org.apache.hadoop.hbase.thrift.TestThriftServerCmdLine.testRunThriftServer[5](org.apache.hadoop.hbase.thrift.TestThriftServerCmdLine)
  Run 1: TestThriftServerCmdLine.testRunThriftServer:189->talkToThriftServer:223 expected:<1> but was:<0>
  Run 2: TestThriftServerCmdLine.testRunThriftServer:189->talkToThriftServer:223 expected:<1> but was:<0>
  Run 3: TestThriftServerCmdLine.testRunThriftServer:189->talkToThriftServer:223 expected:<1> but was:<0>

org.apache.hadoop.hbase.thrift.TestThriftServerCmdLine.testRunThriftServer[6](org.apache.hadoop.hbase.thrift.TestThriftServerCmdLine)
  Run 1: TestThriftServerCmdLine.testRunThriftServer:189->talkToThriftServer:223 expected:<1> but was:<0>
  Run 2: TestThriftServerCmdLine.testRunThriftServer:189->talkToThriftServer:223 expected:<1> but was:<0>
  Run 3: TestThriftServerCmdLine.testRunThriftServer:189->talkToThriftServer:223 expected:<1> but was:<0>

org.apache.hadoop.hbase.thrift.TestThriftServerCmdLine.testRunThriftServer[7](org.apache.hadoop.hbase.thrift.TestThriftServerCmdLine)
  Run 1: TestThriftServerCmdLine.testRunThriftServer:189->talkToThriftServer:223 expected:<1> but was:<0>
  Run 2: TestThriftServerCmdLine.testRunThriftServer:189->talkToThriftServer:223 expected:<1> but was:<0>
  Run 3: TestThriftServerCmdLine.testRunThriftServer:189->talkToThriftServer:223 expected:<1> but was:<0>

org.apache.hadoop.hbase.thrift.TestThriftServerCmdLine.testRunThriftServer[8](org.apache.hadoop.hbase.thrift.TestThriftServerCmdLine)
  Run 1: TestThriftServerCmdLine.testRunThriftServer:189->talkToThriftServer:223 expected:<1> but was:<0>
  Run 2: TestThriftServerCmdLine.testRunThriftServer:189->talkToThriftServer:223 expected:<1> but was:<0>
  Run 3: TestThriftServerCmdLine.testRunThriftServer:189->talkToThriftServer:223 expected:<1> but was:<0>

org.apache.hadoop.hbase.thrift.TestThriftServerCmdLine.testRunThriftServer[9](org.apache.hadoop.hbase.thrift.TestThriftServerCmdLine)
  Run 1: TestThriftServerCmdLine.testRunThriftServer:189->talkToThriftServer:223 expected:<1> but was:<0>
  Run 2: TestThriftServerCmdLine.testRunThriftServer:189->talkToThriftServer:223 expected:<1> but was:<0>
  Run 3: TestThriftServerCmdLine.testRunThriftServer:189->talkToThriftServer:223 expected:<1> but was:<0>

Tests in error: 
org.apache.hadoop.hbase.thrift.TestThriftHttpServer.testRunThriftServer(org.apache.hadoop.hbase.thrift.TestThriftHttpServer)
  Run 1: TestThriftHttpServer.testRunThriftServer:126->runThriftServer:159  IOError(mes...
  Run 2: TestThriftHttpServer.testRunThriftServer:126->runThriftServer:159  IOError(mes...
  Run 3: TestThriftHttpServer.testRunThriftServer:126->runThriftServer:159  IOError(mes...

org.apache.hadoop.hbase.thrift.TestThriftServer.testAll(org.apache.hadoop.hbase.thrift.TestThriftServer)
  Run 1: TestThriftServer.testAll:119->doTestTableCreateDrop:143->doTestTableCreateDrop:147->createTestTables:235 » IO
  Run 2: TestThriftServer.testAll:119->doTestTableCreateDrop:143->doTestTableCreateDrop:147->createTestTables:235 » IO
  Run 3: TestThriftServer.testAll:119->doTestTableCreateDrop:143->doTestTableCreateDrop:147->createTestTables:235 » IO

org.apache.hadoop.hbase.thrift.TestThriftServerCmdLine.testRunThriftServer[0](org.apache.hadoop.hbase.thrift.TestThriftServerCmdLine)
  Run 1: TestThriftServerCmdLine.testRunThriftServer:199  IOError(message:org.apache.ha...
  Run 2: TestThriftServerCmdLine.testRunThriftServer:199  IOError(message:org.apache.ha...
  Run 3: TestThriftServerCmdLine.testRunThriftServer:199  IOError(message:org.apache.ha...


Tests run: 82, Failures: 32, Errors: 3, Skipped: 0

[INFO] ------------------------------------------------------------------------
[INFO] Reactor Summary:
[INFO] 
[INFO] Apache HBase ...................................... SUCCESS [1:12.526s]
[INFO] Apache HBase - Checkstyle ......................... SUCCESS [6.025s]
[INFO] Apache HBase - Resource Bundle .................... SUCCESS [0.318s]
[INFO] Apache HBase - Annotations ........................ SUCCESS [1.422s]
[INFO] Apache HBase - Protocol ........................... SUCCESS [21.371s]
[INFO] Apache HBase - Common ............................. SUCCESS [2:29.350s]
[INFO] Apache HBase - Procedure .......................... SUCCESS [3:41.177s]
[INFO] Apache HBase - Client ............................. SUCCESS [1:28.521s]
[INFO] Apache HBase - Hadoop Compatibility ............... SUCCESS [9.182s]
[INFO] Apache HBase - Hadoop Two Compatibility ........... SUCCESS [10.990s]
[INFO] Apache HBase - Prefix Tree ........................ SUCCESS [10.812s]
[INFO] Apache HBase - Server ............................. SUCCESS [1:40:41.115s]
[INFO] Apache HBase - Testing Util ....................... SUCCESS [2.044s]
[INFO] Apache HBase - Thrift ............................. FAILURE [5:33.593s]
[INFO] Apache HBase - Rest ............................... SKIPPED
[INFO] Apache HBase - Shell .............................. SKIPPED
[INFO] Apache HBase - Integration Tests .................. SKIPPED
[INFO] Apache HBase - Examples ........................... SKIPPED
[INFO] Apache HBase - External Block Cache ............... SKIPPED
[INFO] Apache HBase - Assembly ........................... SKIPPED
[INFO] Apache HBase - Shaded ............................. SKIPPED
[INFO] Apache HBase - Shaded - Client .................... SKIPPED
[INFO] Apache HBase - Shaded - Server .................... SKIPPED
[INFO] ------------------------------------------------------------------------
[INFO] BUILD FAILURE
[INFO] ------------------------------------------------------------------------
[INFO] Total time: 1:56:33.168s
[INFO] Finished at: Fri Mar 18 03:09:58 UTC 2016
[INFO] Final Memory: 112M/1058M
[INFO] ------------------------------------------------------------------------
[ERROR] Failed to execute goal org.apache.maven.plugins:maven-surefire-plugin:2.18.1:test (default-test) on project hbase-thrift: There are test failures.
[ERROR] 
[ERROR] Please refer to <https://builds.apache.org/job/HBase-1.4/jdk=latest1.8,label=yahoo-not-h2/ws/hbase-thrift/target/surefire-reports> for the individual test results.
[ERROR] -> [Help 1]
[ERROR] 
[ERROR] To see the full stack trace of the errors, re-run Maven with the -e switch.
[ERROR] Re-run Maven using the -X switch to enable full debug logging.
[ERROR] 
[ERROR] For more information about the errors and possible solutions, please read the following articles:
[ERROR] [Help 1] http://cwiki.apache.org/confluence/display/MAVEN/MojoFailureException
[ERROR] 
[ERROR] After correcting the problems, you can resume the build with the command
[ERROR]   mvn <goals> -rf :hbase-thrift
Build step 'Invoke top-level Maven targets' marked build as failure
Performing Post build task...
Match found for :.* : True
Logical operation result is TRUE
Running script  : # Post-build task script. TODO: Check this in and have all builds reference check-in.
pwd && ls
# NOTE!!!! The below code has been copied and pasted from ./dev-tools/run-test.sh
# Do not change here without syncing there and vice-versa.
ZOMBIE_TESTS_COUNT=`jps -v | grep surefirebooter | grep -e '-Dhbase.test' | wc -l`
if [[ $ZOMBIE_TESTS_COUNT != 0 ]] ; then
 echo "Suspicious java process found - waiting 30s to see if there are just slow to stop"
 sleep 30
 ZOMBIE_TESTS_COUNT=`jps -v | grep surefirebooter | grep -e '-Dhbase.test' | wc -l`
 if [[ $ZOMBIE_TESTS_COUNT != 0 ]] ; then
   echo " {color:red}There appear to be $ZOMBIE_TESTS_COUNT zombie tests{color}, they should have been killed by surefire but survived"
   jps -v | grep surefirebooter | grep -e '-Dhbase.test'
   jps -v | grep surefirebooter | grep -e '-Dhbase.test' | cut -d ' ' -f 1 | xargs -n 1 jstack
   # Exit with error
   exit 1
 else
   echo "We're ok: there is no zombie test, but some tests took some time to stop"
 fi
else
  echo "We're ok: there is no zombie test"
fi
[yahoo-not-h2] $ /bin/bash -xe /tmp/hudson3147568822392130604.sh
+ pwd
<https://builds.apache.org/job/HBase-1.4/jdk=latest1.8,label=yahoo-not-h2/ws/>
+ ls
bin
CHANGES.txt
conf
dev-support
hbase-annotations
hbase-assembly
hbase-checkstyle
hbase-client
hbase-common
hbase-examples
hbase-external-blockcache
hbase-hadoop2-compat
hbase-hadoop-compat
hbase-it
hbase-native-client
hbase-prefix-tree
hbase-procedure
hbase-protocol
hbase-resource-bundle
hbase-rest
hbase-server
hbase-shaded
hbase-shell
hbase-testing-util
hbase-thrift
LICENSE.txt
NOTICE.txt
pom.xml
README.txt
src
target
++ jps -v
++ grep surefirebooter
++ grep -e -Dhbase.test
++ wc -l
+ ZOMBIE_TESTS_COUNT=0
+ [[ 0 != 0 ]]
+ echo 'We'\''re ok: there is no zombie test'
We're ok: there is no zombie test
POST BUILD TASK : SUCCESS
END OF POST BUILD TASK : 0
Archiving artifacts
Recording test results

Jenkins build is back to normal : HBase-1.4 » latest1.8,yahoo-not-h2 #28

Posted by Apache Jenkins Server <je...@builds.apache.org>.
See <https://builds.apache.org/job/HBase-1.4/jdk=latest1.8,label=yahoo-not-h2/28/changes>