You are viewing a plain text version of this content. The canonical link for it is here.
Posted to dev@lucene.apache.org by Policeman Jenkins Server <je...@thetaphi.de> on 2018/01/22 02:36:11 UTC

[JENKINS] Lucene-Solr-7.x-MacOSX (64bit/jdk-9) - Build # 413 - Still Unstable!

Build: https://jenkins.thetaphi.de/job/Lucene-Solr-7.x-MacOSX/413/
Java: 64bit/jdk-9 -XX:+UseCompressedOops -XX:+UseSerialGC

2 tests failed.
FAILED:  junit.framework.TestSuite.org.apache.solr.cloud.autoscaling.TriggerIntegrationTest

Error Message:
1 thread leaked from SUITE scope at org.apache.solr.cloud.autoscaling.TriggerIntegrationTest:     1) Thread[id=1737, name=qtp56261047-1737, state=TIMED_WAITING, group=TGRP-TriggerIntegrationTest]         at java.base@9/jdk.internal.misc.Unsafe.park(Native Method)         at java.base@9/java.util.concurrent.locks.LockSupport.parkNanos(LockSupport.java:234)         at java.base@9/java.util.concurrent.locks.AbstractQueuedSynchronizer$ConditionObject.await(AbstractQueuedSynchronizer.java:2192)         at app//org.eclipse.jetty.util.thread.ReservedThreadExecutor$ReservedThread.reservedWait(ReservedThreadExecutor.java:308)         at app//org.eclipse.jetty.util.thread.ReservedThreadExecutor$ReservedThread.run(ReservedThreadExecutor.java:373)         at app//org.eclipse.jetty.util.thread.QueuedThreadPool.runJob(QueuedThreadPool.java:708)         at app//org.eclipse.jetty.util.thread.QueuedThreadPool$2.run(QueuedThreadPool.java:626)         at java.base@9/java.lang.Thread.run(Thread.java:844)

Stack Trace:
com.carrotsearch.randomizedtesting.ThreadLeakError: 1 thread leaked from SUITE scope at org.apache.solr.cloud.autoscaling.TriggerIntegrationTest: 
   1) Thread[id=1737, name=qtp56261047-1737, state=TIMED_WAITING, group=TGRP-TriggerIntegrationTest]
        at java.base@9/jdk.internal.misc.Unsafe.park(Native Method)
        at java.base@9/java.util.concurrent.locks.LockSupport.parkNanos(LockSupport.java:234)
        at java.base@9/java.util.concurrent.locks.AbstractQueuedSynchronizer$ConditionObject.await(AbstractQueuedSynchronizer.java:2192)
        at app//org.eclipse.jetty.util.thread.ReservedThreadExecutor$ReservedThread.reservedWait(ReservedThreadExecutor.java:308)
        at app//org.eclipse.jetty.util.thread.ReservedThreadExecutor$ReservedThread.run(ReservedThreadExecutor.java:373)
        at app//org.eclipse.jetty.util.thread.QueuedThreadPool.runJob(QueuedThreadPool.java:708)
        at app//org.eclipse.jetty.util.thread.QueuedThreadPool$2.run(QueuedThreadPool.java:626)
        at java.base@9/java.lang.Thread.run(Thread.java:844)
	at __randomizedtesting.SeedInfo.seed([C276E306D93593F5]:0)


FAILED:  junit.framework.TestSuite.org.apache.solr.cloud.autoscaling.TriggerIntegrationTest

Error Message:
There are still zombie threads that couldn't be terminated:    1) Thread[id=1737, name=qtp56261047-1737, state=TIMED_WAITING, group=TGRP-TriggerIntegrationTest]         at java.base@9/jdk.internal.misc.Unsafe.park(Native Method)         at java.base@9/java.util.concurrent.locks.LockSupport.parkNanos(LockSupport.java:234)         at java.base@9/java.util.concurrent.locks.AbstractQueuedSynchronizer$ConditionObject.await(AbstractQueuedSynchronizer.java:2192)         at app//org.eclipse.jetty.util.thread.ReservedThreadExecutor$ReservedThread.reservedWait(ReservedThreadExecutor.java:308)         at app//org.eclipse.jetty.util.thread.ReservedThreadExecutor$ReservedThread.run(ReservedThreadExecutor.java:373)         at app//org.eclipse.jetty.util.thread.QueuedThreadPool.runJob(QueuedThreadPool.java:708)         at app//org.eclipse.jetty.util.thread.QueuedThreadPool$2.run(QueuedThreadPool.java:626)         at java.base@9/java.lang.Thread.run(Thread.java:844)

Stack Trace:
com.carrotsearch.randomizedtesting.ThreadLeakError: There are still zombie threads that couldn't be terminated:
   1) Thread[id=1737, name=qtp56261047-1737, state=TIMED_WAITING, group=TGRP-TriggerIntegrationTest]
        at java.base@9/jdk.internal.misc.Unsafe.park(Native Method)
        at java.base@9/java.util.concurrent.locks.LockSupport.parkNanos(LockSupport.java:234)
        at java.base@9/java.util.concurrent.locks.AbstractQueuedSynchronizer$ConditionObject.await(AbstractQueuedSynchronizer.java:2192)
        at app//org.eclipse.jetty.util.thread.ReservedThreadExecutor$ReservedThread.reservedWait(ReservedThreadExecutor.java:308)
        at app//org.eclipse.jetty.util.thread.ReservedThreadExecutor$ReservedThread.run(ReservedThreadExecutor.java:373)
        at app//org.eclipse.jetty.util.thread.QueuedThreadPool.runJob(QueuedThreadPool.java:708)
        at app//org.eclipse.jetty.util.thread.QueuedThreadPool$2.run(QueuedThreadPool.java:626)
        at java.base@9/java.lang.Thread.run(Thread.java:844)
	at __randomizedtesting.SeedInfo.seed([C276E306D93593F5]:0)




Build Log:
[...truncated 11790 lines...]
   [junit4] Suite: org.apache.solr.cloud.autoscaling.TriggerIntegrationTest
   [junit4]   2> 69652 INFO  (SUITE-TriggerIntegrationTest-seed#[C276E306D93593F5]-worker) [    ] o.a.s.SolrTestCaseJ4 SecureRandom sanity checks: test.solr.allowed.securerandom=null & java.security.egd=file:/dev/./urandom
   [junit4]   2> Creating dataDir: /Users/jenkins/workspace/Lucene-Solr-7.x-MacOSX/solr/build/solr-core/test/J1/temp/solr.cloud.autoscaling.TriggerIntegrationTest_C276E306D93593F5-001/init-core-data-001
   [junit4]   2> 69653 INFO  (SUITE-TriggerIntegrationTest-seed#[C276E306D93593F5]-worker) [    ] o.a.s.SolrTestCaseJ4 Using PointFields (NUMERIC_POINTS_SYSPROP=true) w/NUMERIC_DOCVALUES_SYSPROP=false
   [junit4]   2> 69654 INFO  (SUITE-TriggerIntegrationTest-seed#[C276E306D93593F5]-worker) [    ] o.a.s.SolrTestCaseJ4 Randomized ssl (false) and clientAuth (false) via: @org.apache.solr.util.RandomizeSSL(reason="", value=0.0/0.0, ssl=0.0/0.0, clientAuth=0.0/0.0) w/ MAC_OS_X supressed clientAuth
   [junit4]   2> 69654 INFO  (SUITE-TriggerIntegrationTest-seed#[C276E306D93593F5]-worker) [    ] o.a.s.c.MiniSolrCloudCluster Starting cluster of 2 servers in /Users/jenkins/workspace/Lucene-Solr-7.x-MacOSX/solr/build/solr-core/test/J1/temp/solr.cloud.autoscaling.TriggerIntegrationTest_C276E306D93593F5-001/tempDir-001
   [junit4]   2> 69655 INFO  (SUITE-TriggerIntegrationTest-seed#[C276E306D93593F5]-worker) [    ] o.a.s.c.ZkTestServer STARTING ZK TEST SERVER
   [junit4]   2> 69655 INFO  (Thread-313) [    ] o.a.s.c.ZkTestServer client port:0.0.0.0/0.0.0.0:0
   [junit4]   2> 69655 INFO  (Thread-313) [    ] o.a.s.c.ZkTestServer Starting server
   [junit4]   2> 69661 ERROR (Thread-313) [    ] o.a.z.s.ZooKeeperServer ZKShutdownHandler is not registered, so ZooKeeper server won't take any action on ERROR or SHUTDOWN server state changes
   [junit4]   2> 69756 INFO  (SUITE-TriggerIntegrationTest-seed#[C276E306D93593F5]-worker) [    ] o.a.s.c.ZkTestServer start zk server on port:63310
   [junit4]   2> 69770 INFO  (zkConnectionManagerCallback-177-thread-1) [    ] o.a.s.c.c.ConnectionManager zkClient has connected
   [junit4]   2> 69800 INFO  (jetty-launcher-174-thread-1) [    ] o.e.j.s.Server jetty-9.4.8.v20171121, build timestamp: 2017-11-22T05:27:37+08:00, git hash: 82b8fb23f757335bb3329d540ce37a2a2615f0a8
   [junit4]   2> 69805 INFO  (jetty-launcher-174-thread-2) [    ] o.e.j.s.Server jetty-9.4.8.v20171121, build timestamp: 2017-11-22T05:27:37+08:00, git hash: 82b8fb23f757335bb3329d540ce37a2a2615f0a8
   [junit4]   2> 69807 INFO  (jetty-launcher-174-thread-1) [    ] o.e.j.s.session DefaultSessionIdManager workerName=node0
   [junit4]   2> 69807 INFO  (jetty-launcher-174-thread-1) [    ] o.e.j.s.session No SessionScavenger set, using defaults
   [junit4]   2> 69807 INFO  (jetty-launcher-174-thread-2) [    ] o.e.j.s.session DefaultSessionIdManager workerName=node0
   [junit4]   2> 69807 INFO  (jetty-launcher-174-thread-2) [    ] o.e.j.s.session No SessionScavenger set, using defaults
   [junit4]   2> 69807 INFO  (jetty-launcher-174-thread-1) [    ] o.e.j.s.session Scavenging every 660000ms
   [junit4]   2> 69807 INFO  (jetty-launcher-174-thread-2) [    ] o.e.j.s.session Scavenging every 660000ms
   [junit4]   2> 69808 INFO  (jetty-launcher-174-thread-1) [    ] o.e.j.s.h.ContextHandler Started o.e.j.s.ServletContextHandler@12d32fd4{/solr,null,AVAILABLE}
   [junit4]   2> 69808 INFO  (jetty-launcher-174-thread-2) [    ] o.e.j.s.h.ContextHandler Started o.e.j.s.ServletContextHandler@1e8a58f9{/solr,null,AVAILABLE}
   [junit4]   2> 70389 INFO  (jetty-launcher-174-thread-2) [    ] o.e.j.s.AbstractConnector Started ServerConnector@c00f19e{HTTP/1.1,[http/1.1]}{127.0.0.1:63313}
   [junit4]   2> 70389 INFO  (jetty-launcher-174-thread-2) [    ] o.e.j.s.Server Started @72812ms
   [junit4]   2> 70389 INFO  (jetty-launcher-174-thread-2) [    ] o.a.s.c.s.e.JettySolrRunner Jetty properties: {hostContext=/solr, hostPort=63313}
   [junit4]   2> 70389 ERROR (jetty-launcher-174-thread-2) [    ] o.a.s.u.StartupLoggingUtils Missing Java Option solr.log.dir. Logging may be missing or incomplete.
   [junit4]   2> 70390 INFO  (jetty-launcher-174-thread-2) [    ] o.a.s.s.SolrDispatchFilter  ___      _       Welcome to Apache Solr? version 7.3.0
   [junit4]   2> 70390 INFO  (jetty-launcher-174-thread-2) [    ] o.a.s.s.SolrDispatchFilter / __| ___| |_ _   Starting in cloud mode on port null
   [junit4]   2> 70390 INFO  (jetty-launcher-174-thread-2) [    ] o.a.s.s.SolrDispatchFilter \__ \/ _ \ | '_|  Install dir: null
   [junit4]   2> 70391 INFO  (jetty-launcher-174-thread-2) [    ] o.a.s.s.SolrDispatchFilter |___/\___/_|_|    Start time: 2018-01-22T01:53:22.832008Z
   [junit4]   2> 70392 INFO  (jetty-launcher-174-thread-1) [    ] o.e.j.s.AbstractConnector Started ServerConnector@12855281{HTTP/1.1,[http/1.1]}{127.0.0.1:63312}
   [junit4]   2> 70392 INFO  (jetty-launcher-174-thread-1) [    ] o.e.j.s.Server Started @72816ms
   [junit4]   2> 70392 INFO  (jetty-launcher-174-thread-1) [    ] o.a.s.c.s.e.JettySolrRunner Jetty properties: {hostContext=/solr, hostPort=63312}
   [junit4]   2> 70393 ERROR (jetty-launcher-174-thread-1) [    ] o.a.s.u.StartupLoggingUtils Missing Java Option solr.log.dir. Logging may be missing or incomplete.
   [junit4]   2> 70393 INFO  (jetty-launcher-174-thread-1) [    ] o.a.s.s.SolrDispatchFilter  ___      _       Welcome to Apache Solr? version 7.3.0
   [junit4]   2> 70393 INFO  (jetty-launcher-174-thread-1) [    ] o.a.s.s.SolrDispatchFilter / __| ___| |_ _   Starting in cloud mode on port null
   [junit4]   2> 70393 INFO  (jetty-launcher-174-thread-1) [    ] o.a.s.s.SolrDispatchFilter \__ \/ _ \ | '_|  Install dir: null
   [junit4]   2> 70393 INFO  (jetty-launcher-174-thread-1) [    ] o.a.s.s.SolrDispatchFilter |___/\___/_|_|    Start time: 2018-01-22T01:53:22.834770Z
   [junit4]   2> 70396 INFO  (zkConnectionManagerCallback-179-thread-1) [    ] o.a.s.c.c.ConnectionManager zkClient has connected
   [junit4]   2> 70399 INFO  (zkConnectionManagerCallback-181-thread-1) [    ] o.a.s.c.c.ConnectionManager zkClient has connected
   [junit4]   2> 70399 INFO  (jetty-launcher-174-thread-2) [    ] o.a.s.s.SolrDispatchFilter solr.xml found in ZooKeeper. Loading...
   [junit4]   2> 70424 INFO  (jetty-launcher-174-thread-1) [    ] o.a.s.s.SolrDispatchFilter solr.xml found in ZooKeeper. Loading...
   [junit4]   2> 70440 INFO  (jetty-launcher-174-thread-2) [    ] o.a.s.c.ZkContainer Zookeeper client=127.0.0.1:63310/solr
   [junit4]   2> 70442 INFO  (jetty-launcher-174-thread-1) [    ] o.a.s.c.ZkContainer Zookeeper client=127.0.0.1:63310/solr
   [junit4]   2> 70448 INFO  (zkConnectionManagerCallback-185-thread-1) [    ] o.a.s.c.c.ConnectionManager zkClient has connected
   [junit4]   2> 70453 INFO  (zkConnectionManagerCallback-189-thread-1) [    ] o.a.s.c.c.ConnectionManager zkClient has connected
   [junit4]   2> 70478 INFO  (zkConnectionManagerCallback-191-thread-1-processing-n:127.0.0.1:63313_solr) [n:127.0.0.1:63313_solr    ] o.a.s.c.c.ConnectionManager zkClient has connected
   [junit4]   2> 70479 INFO  (zkConnectionManagerCallback-193-thread-1-processing-n:127.0.0.1:63312_solr) [n:127.0.0.1:63312_solr    ] o.a.s.c.c.ConnectionManager zkClient has connected
   [junit4]   2> 70875 INFO  (jetty-launcher-174-thread-1) [n:127.0.0.1:63312_solr    ] o.a.s.c.Overseer Overseer (id=null) closing
   [junit4]   2> 70876 INFO  (jetty-launcher-174-thread-1) [n:127.0.0.1:63312_solr    ] o.a.s.c.OverseerElectionContext I am going to be the leader 127.0.0.1:63312_solr
   [junit4]   2> 70878 INFO  (jetty-launcher-174-thread-1) [n:127.0.0.1:63312_solr    ] o.a.s.c.Overseer Overseer (id=99390980233494534-127.0.0.1:63312_solr-n_0000000000) starting
   [junit4]   2> 70890 INFO  (jetty-launcher-174-thread-2) [n:127.0.0.1:63313_solr    ] o.a.s.c.Overseer Overseer (id=null) closing
   [junit4]   2> 70891 DEBUG (OverseerAutoScalingTriggerThread-99390980233494534-127.0.0.1:63312_solr-n_0000000000) [n:127.0.0.1:63312_solr    ] o.a.s.c.a.OverseerTriggerThread Adding .autoAddReplicas trigger
   [junit4]   2> 70891 INFO  (jetty-launcher-174-thread-1) [n:127.0.0.1:63312_solr    ] o.a.s.c.ZkController Register node as live in ZooKeeper:/live_nodes/127.0.0.1:63312_solr
   [junit4]   2> 70892 INFO  (jetty-launcher-174-thread-2) [n:127.0.0.1:63313_solr    ] o.a.s.c.ZkController Register node as live in ZooKeeper:/live_nodes/127.0.0.1:63313_solr
   [junit4]   2> 70893 DEBUG (OverseerAutoScalingTriggerThread-99390980233494534-127.0.0.1:63312_solr-n_0000000000) [n:127.0.0.1:63312_solr    ] o.a.s.c.a.OverseerTriggerThread Refreshing /autoscaling.json with znode version 1
   [junit4]   2> 70895 INFO  (zkCallback-190-thread-1-processing-n:127.0.0.1:63313_solr) [n:127.0.0.1:63313_solr    ] o.a.s.c.c.ZkStateReader Updated live nodes from ZooKeeper... (0) -> (2)
   [junit4]   2> 70896 INFO  (OverseerStateUpdate-99390980233494534-127.0.0.1:63312_solr-n_0000000000) [n:127.0.0.1:63312_solr    ] o.a.s.c.c.ZkStateReader Updated live nodes from ZooKeeper... (0) -> (1)
   [junit4]   2> 70897 DEBUG (OverseerAutoScalingTriggerThread-99390980233494534-127.0.0.1:63312_solr-n_0000000000) [n:127.0.0.1:63312_solr    ] o.a.s.c.a.NodeLostTrigger Initial livenodes: [127.0.0.1:63313_solr]
   [junit4]   2> 70897 DEBUG (OverseerAutoScalingTriggerThread-99390980233494534-127.0.0.1:63312_solr-n_0000000000) [n:127.0.0.1:63312_solr    ] o.a.s.c.a.OverseerTriggerThread Current znodeVersion 1, lastZnodeVersion -1
   [junit4]   2> 70897 DEBUG (OverseerAutoScalingTriggerThread-99390980233494534-127.0.0.1:63312_solr-n_0000000000) [n:127.0.0.1:63312_solr    ] o.a.s.c.a.OverseerTriggerThread Processed trigger updates upto znodeVersion 1
   [junit4]   2> 70898 INFO  (zkCallback-192-thread-1-processing-n:127.0.0.1:63312_solr) [n:127.0.0.1:63312_solr    ] o.a.s.c.c.ZkStateReader Updated live nodes from ZooKeeper... (1) -> (2)
   [junit4]   2> 70901 DEBUG (OverseerAutoScalingTriggerThread-99390980233494534-127.0.0.1:63312_solr-n_0000000000) [n:127.0.0.1:63312_solr    ] o.a.s.c.a.OverseerTriggerThread -- clean old nodeAdded markers
   [junit4]   2> 70902 DEBUG (OverseerAutoScalingTriggerThread-99390980233494534-127.0.0.1:63312_solr-n_0000000000) [n:127.0.0.1:63312_solr    ] o.a.s.c.a.OverseerTriggerThread Current znodeVersion 1, lastZnodeVersion 1
   [junit4]   2> 70902 DEBUG (ScheduledTrigger-611-thread-1) [n:127.0.0.1:63312_solr    ] o.a.s.c.a.NodeLostTrigger Running NodeLostTrigger: .auto_add_replicas with currently live nodes: 2
   [junit4]   2> 70981 INFO  (jetty-launcher-174-thread-1) [n:127.0.0.1:63312_solr    ] o.a.s.m.r.SolrJmxReporter JMX monitoring for 'solr_63312.solr.node' (registry 'solr.node') enabled at server: com.sun.jmx.mbeanserver.JmxMBeanServer@3aeddcd
   [junit4]   2> 70983 INFO  (jetty-launcher-174-thread-2) [n:127.0.0.1:63313_solr    ] o.a.s.m.r.SolrJmxReporter JMX monitoring for 'solr_63313.solr.node' (registry 'solr.node') enabled at server: com.sun.jmx.mbeanserver.JmxMBeanServer@3aeddcd
   [junit4]   2> 71013 INFO  (jetty-launcher-174-thread-2) [n:127.0.0.1:63313_solr    ] o.a.s.m.r.SolrJmxReporter JMX monitoring for 'solr_63313.solr.jvm' (registry 'solr.jvm') enabled at server: com.sun.jmx.mbeanserver.JmxMBeanServer@3aeddcd
   [junit4]   2> 71013 INFO  (jetty-launcher-174-thread-2) [n:127.0.0.1:63313_solr    ] o.a.s.m.r.SolrJmxReporter JMX monitoring for 'solr_63313.solr.jetty' (registry 'solr.jetty') enabled at server: com.sun.jmx.mbeanserver.JmxMBeanServer@3aeddcd
   [junit4]   2> 71015 INFO  (jetty-launcher-174-thread-2) [n:127.0.0.1:63313_solr    ] o.a.s.c.CorePropertiesLocator Found 0 core definitions underneath /Users/jenkins/workspace/Lucene-Solr-7.x-MacOSX/solr/build/solr-core/test/J1/temp/solr.cloud.autoscaling.TriggerIntegrationTest_C276E306D93593F5-001/tempDir-001/node2/.
   [junit4]   2> 71024 INFO  (jetty-launcher-174-thread-1) [n:127.0.0.1:63312_solr    ] o.a.s.m.r.SolrJmxReporter JMX monitoring for 'solr_63312.solr.jvm' (registry 'solr.jvm') enabled at server: com.sun.jmx.mbeanserver.JmxMBeanServer@3aeddcd
   [junit4]   2> 71025 INFO  (jetty-launcher-174-thread-1) [n:127.0.0.1:63312_solr    ] o.a.s.m.r.SolrJmxReporter JMX monitoring for 'solr_63312.solr.jetty' (registry 'solr.jetty') enabled at server: com.sun.jmx.mbeanserver.JmxMBeanServer@3aeddcd
   [junit4]   2> 71026 INFO  (jetty-launcher-174-thread-1) [n:127.0.0.1:63312_solr    ] o.a.s.c.CorePropertiesLocator Found 0 core definitions underneath /Users/jenkins/workspace/Lucene-Solr-7.x-MacOSX/solr/build/solr-core/test/J1/temp/solr.cloud.autoscaling.TriggerIntegrationTest_C276E306D93593F5-001/tempDir-001/node1/.
   [junit4]   2> 71085 INFO  (zkConnectionManagerCallback-199-thread-1) [    ] o.a.s.c.c.ConnectionManager zkClient has connected
   [junit4]   2> 71092 INFO  (zkConnectionManagerCallback-203-thread-1) [    ] o.a.s.c.c.ConnectionManager zkClient has connected
   [junit4]   2> 71095 INFO  (SUITE-TriggerIntegrationTest-seed#[C276E306D93593F5]-worker) [    ] o.a.s.c.c.ZkStateReader Updated live nodes from ZooKeeper... (0) -> (2)
   [junit4]   2> 71096 INFO  (SUITE-TriggerIntegrationTest-seed#[C276E306D93593F5]-worker) [    ] o.a.s.c.s.i.ZkClientClusterStateProvider Cluster at 127.0.0.1:63310/solr ready
   [junit4]   2> 71151 INFO  (TEST-TriggerIntegrationTest.testSetProperties-seed#[C276E306D93593F5]) [    ] o.a.s.SolrTestCaseJ4 ###Starting testSetProperties
   [junit4]   2> 71152 INFO  (TEST-TriggerIntegrationTest.testSetProperties-seed#[C276E306D93593F5]) [    ] o.a.s.c.a.TriggerIntegrationTest /autoscaling.json reset, new znode version 2
   [junit4]   2> 71153 DEBUG (zkCallback-192-thread-1-processing-n:127.0.0.1:63312_solr) [n:127.0.0.1:63312_solr    ] o.a.s.c.a.OverseerTriggerThread Refreshing /autoscaling.json with znode version 2
   [junit4]   2> 71153 DEBUG (OverseerAutoScalingTriggerThread-99390980233494534-127.0.0.1:63312_solr-n_0000000000) [n:127.0.0.1:63312_solr    ] o.a.s.c.a.OverseerTriggerThread Processed trigger updates upto znodeVersion 2
   [junit4]   2> 71205 DEBUG (OverseerAutoScalingTriggerThread-99390980233494534-127.0.0.1:63312_solr-n_0000000000) [n:127.0.0.1:63312_solr    ] o.a.s.c.a.OverseerTriggerThread -- clean old nodeLost markers
   [junit4]   2> 71206 DEBUG (OverseerAutoScalingTriggerThread-99390980233494534-127.0.0.1:63312_solr-n_0000000000) [n:127.0.0.1:63312_solr    ] o.a.s.c.a.OverseerTriggerThread -- clean old nodeAdded markers
   [junit4]   2> 71207 DEBUG (OverseerAutoScalingTriggerThread-99390980233494534-127.0.0.1:63312_solr-n_0000000000) [n:127.0.0.1:63312_solr    ] o.a.s.c.a.OverseerTriggerThread Current znodeVersion 2, lastZnodeVersion 2
   [junit4]   2> 72215 DEBUG (TEST-TriggerIntegrationTest.testSetProperties-seed#[C276E306D93593F5]) [    ] o.a.s.c.a.ScheduledTriggers Changing value of autoscaling property: triggerScheduleDelaySeconds from: 1 to: 4
   [junit4]   2> 76258 DEBUG (TEST-TriggerIntegrationTest.testSetProperties-seed#[C276E306D93593F5]) [    ] o.a.s.c.a.ScheduledTriggers Changing value of autoscaling property: triggerScheduleDelaySeconds from: 4 to: 1
   [junit4]   2> 86312 DEBUG (TEST-TriggerIntegrationTest.testSetProperties-seed#[C276E306D93593F5]) [    ] o.a.s.c.a.ScheduledTriggers Changing value of autoscaling property: triggerCorePoolSize from: 4 to: 6
   [junit4]   2> 96352 INFO  (TEST-TriggerIntegrationTest.testSetProperties-seed#[C276E306D93593F5]) [    ] o.a.s.SolrTestCaseJ4 ###Ending testSetProperties
   [junit4]   2> 96368 INFO  (TEST-TriggerIntegrationTest.testEventFromRestoredState-seed#[C276E306D93593F5]) [    ] o.a.s.SolrTestCaseJ4 ###Starting testEventFromRestoredState
   [junit4]   2> 96368 INFO  (TEST-TriggerIntegrationTest.testEventFromRestoredState-seed#[C276E306D93593F5]) [    ] o.a.s.c.a.TriggerIntegrationTest /autoscaling.json reset, new znode version 3
   [junit4]   2> 96368 DEBUG (zkCallback-192-thread-1-processing-n:127.0.0.1:63312_solr) [n:127.0.0.1:63312_solr    ] o.a.s.c.a.OverseerTriggerThread Refreshing /autoscaling.json with znode version 3
   [junit4]   2> 96368 DEBUG (OverseerAutoScalingTriggerThread-99390980233494534-127.0.0.1:63312_solr-n_0000000000) [n:127.0.0.1:63312_solr    ] o.a.s.c.a.OverseerTriggerThread Processed trigger updates upto znodeVersion 3
   [junit4]   2> 96368 DEBUG (OverseerAutoScalingTriggerThread-99390980233494534-127.0.0.1:63312_solr-n_0000000000) [n:127.0.0.1:63312_solr    ] o.a.s.c.a.OverseerTriggerThread -- clean old nodeLost markers
   [junit4]   2> 96368 DEBUG (OverseerAutoScalingTriggerThread-99390980233494534-127.0.0.1:63312_solr-n_0000000000) [n:127.0.0.1:63312_solr    ] o.a.s.c.a.OverseerTriggerThread -- clean old nodeAdded markers
   [junit4]   2> 96373 DEBUG (OverseerAutoScalingTriggerThread-99390980233494534-127.0.0.1:63312_solr-n_0000000000) [n:127.0.0.1:63312_solr    ] o.a.s.c.a.OverseerTriggerThread Current znodeVersion 3, lastZnodeVersion 3
   [junit4]   2> 96408 INFO  (qtp1896378456-1159) [n:127.0.0.1:63312_solr    ] o.a.s.s.HttpSolrCall [admin] webapp=null path=/admin/metrics params={prefix=CONTAINER.fs.usableSpace,CORE.coreName&wt=javabin&version=2&group=solr.node,solr.core} status=0 QTime=11
   [junit4]   2> 96413 INFO  (qtp1618087901-1157) [n:127.0.0.1:63313_solr    ] o.a.s.s.HttpSolrCall [admin] webapp=null path=/admin/metrics params={prefix=CONTAINER.fs.usableSpace,CORE.coreName&wt=javabin&version=2&group=solr.node,solr.core} status=0 QTime=0
   [junit4]   2> 96413 DEBUG (qtp1896378456-1155) [n:127.0.0.1:63312_solr    ] o.a.s.c.a.AutoScalingHandler Verified autoscaling configuration
   [junit4]   2> 96414 INFO  (qtp1896378456-1155) [n:127.0.0.1:63312_solr    ] o.a.s.s.HttpSolrCall [admin] webapp=null path=/cluster/autoscaling params={wt=javabin&version=2} status=0 QTime=28
   [junit4]   2> 96415 DEBUG (zkCallback-192-thread-1-processing-n:127.0.0.1:63312_solr) [n:127.0.0.1:63312_solr    ] o.a.s.c.a.OverseerTriggerThread Refreshing /autoscaling.json with znode version 4
   [junit4]   2> 96416 DEBUG (zkCallback-192-thread-1-processing-n:127.0.0.1:63312_solr) [n:127.0.0.1:63312_solr    ] o.a.s.c.a.NodeAddedTrigger Initial livenodes: [127.0.0.1:63312_solr, 127.0.0.1:63313_solr]
   [junit4]   2> 96416 DEBUG (zkCallback-192-thread-1-processing-n:127.0.0.1:63312_solr) [n:127.0.0.1:63312_solr    ] o.a.s.c.a.NodeAddedTrigger NodeAddedTrigger node_added_trigger instantiated with properties: {event=nodeAdded, waitFor=10, actions=[{name=test, class=org.apache.solr.cloud.autoscaling.TriggerIntegrationTest$TestTriggerAction}], enabled=true}
   [junit4]   2> 96416 DEBUG (OverseerAutoScalingTriggerThread-99390980233494534-127.0.0.1:63312_solr-n_0000000000) [n:127.0.0.1:63312_solr    ] o.a.s.c.a.OverseerTriggerThread Processed trigger updates upto znodeVersion 4
   [junit4]   2> 96419 INFO  (OverseerAutoScalingTriggerThread-99390980233494534-127.0.0.1:63312_solr-n_0000000000) [n:127.0.0.1:63312_solr    ] o.a.s.c.a.TriggerIntegrationTest TestTriggerAction init
   [junit4]   2> 96420 DEBUG (OverseerAutoScalingTriggerThread-99390980233494534-127.0.0.1:63312_solr-n_0000000000) [n:127.0.0.1:63312_solr    ] o.a.s.c.a.OverseerTriggerThread -- clean old nodeLost markers
   [junit4]   2> 96420 INFO  (qtp1896378456-1158) [n:127.0.0.1:63312_solr    ] o.a.s.h.a.CollectionsHandler Invoked Collection Action :overseerstatus with params action=OVERSEERSTATUS&wt=javabin&version=2 and sendToOCPQueue=true
   [junit4]   2> 96421 DEBUG (OverseerAutoScalingTriggerThread-99390980233494534-127.0.0.1:63312_solr-n_0000000000) [n:127.0.0.1:63312_solr    ] o.a.s.c.a.OverseerTriggerThread Current znodeVersion 4, lastZnodeVersion 4
   [junit4]   2> 96421 DEBUG (ScheduledTrigger-611-thread-2) [n:127.0.0.1:63312_solr    ] o.a.s.c.a.NodeAddedTrigger Running NodeAddedTrigger node_added_trigger
   [junit4]   2> 96421 DEBUG (ScheduledTrigger-611-thread-2) [n:127.0.0.1:63312_solr    ] o.a.s.c.a.NodeAddedTrigger Found livenodes: 2
   [junit4]   2> 96434 INFO  (qtp1896378456-1158) [n:127.0.0.1:63312_solr    ] o.a.s.s.HttpSolrCall [admin] webapp=null path=/admin/collections params={action=OVERSEERSTATUS&wt=javabin&version=2} status=0 QTime=13
   [junit4]   2> 96435 INFO  (TEST-TriggerIntegrationTest.testEventFromRestoredState-seed#[C276E306D93593F5]) [    ] o.e.j.s.Server jetty-9.4.8.v20171121, build timestamp: 2017-11-22T05:27:37+08:00, git hash: 82b8fb23f757335bb3329d540ce37a2a2615f0a8
   [junit4]   2> 96437 INFO  (TEST-TriggerIntegrationTest.testEventFromRestoredState-seed#[C276E306D93593F5]) [    ] o.e.j.s.session DefaultSessionIdManager workerName=node0
   [junit4]   2> 96437 INFO  (TEST-TriggerIntegrationTest.testEventFromRestoredState-seed#[C276E306D93593F5]) [    ] o.e.j.s.session No SessionScavenger set, using defaults
   [junit4]   2> 96437 INFO  (TEST-TriggerIntegrationTest.testEventFromRestoredState-seed#[C276E306D93593F5]) [    ] o.e.j.s.session Scavenging every 660000ms
   [junit4]   2> 96437 INFO  (TEST-TriggerIntegrationTest.testEventFromRestoredState-seed#[C276E306D93593F5]) [    ] o.e.j.s.h.ContextHandler Started o.e.j.s.ServletContextHandler@21acd1ad{/solr,null,AVAILABLE}
   [junit4]   2> 96438 INFO  (TEST-TriggerIntegrationTest.testEventFromRestoredState-seed#[C276E306D93593F5]) [    ] o.e.j.s.AbstractConnector Started ServerConnector@74cfa7e1{HTTP/1.1,[http/1.1]}{127.0.0.1:63369}
   [junit4]   2> 96438 INFO  (TEST-TriggerIntegrationTest.testEventFromRestoredState-seed#[C276E306D93593F5]) [    ] o.e.j.s.Server Started @98862ms
   [junit4]   2> 96438 INFO  (TEST-TriggerIntegrationTest.testEventFromRestoredState-seed#[C276E306D93593F5]) [    ] o.a.s.c.s.e.JettySolrRunner Jetty properties: {hostContext=/solr, hostPort=63369}
   [junit4]   2> 96438 ERROR (TEST-TriggerIntegrationTest.testEventFromRestoredState-seed#[C276E306D93593F5]) [    ] o.a.s.u.StartupLoggingUtils Missing Java Option solr.log.dir. Logging may be missing or incomplete.
   [junit4]   2> 96438 INFO  (TEST-TriggerIntegrationTest.testEventFromRestoredState-seed#[C276E306D93593F5]) [    ] o.a.s.s.SolrDispatchFilter  ___      _       Welcome to Apache Solr? version 7.3.0
   [junit4]   2> 96439 INFO  (TEST-TriggerIntegrationTest.testEventFromRestoredState-seed#[C276E306D93593F5]) [    ] o.a.s.s.SolrDispatchFilter / __| ___| |_ _   Starting in cloud mode on port null
   [junit4]   2> 96439 INFO  (TEST-TriggerIntegrationTest.testEventFromRestoredState-seed#[C276E306D93593F5]) [    ] o.a.s.s.SolrDispatchFilter \__ \/ _ \ | '_|  Install dir: null
   [junit4]   2> 96439 INFO  (TEST-TriggerIntegrationTest.testEventFromRestoredState-seed#[C276E306D93593F5]) [    ] o.a.s.s.SolrDispatchFilter |___/\___/_|_|    Start time: 2018-01-22T01:53:48.880073Z
   [junit4]   2> 96443 INFO  (zkConnectionManagerCallback-205-thread-1) [    ] o.a.s.c.c.ConnectionManager zkClient has connected
   [junit4]   2> 96444 INFO  (TEST-TriggerIntegrationTest.testEventFromRestoredState-seed#[C276E306D93593F5]) [    ] o.a.s.s.SolrDispatchFilter solr.xml found in ZooKeeper. Loading...
   [junit4]   2> 96454 INFO  (TEST-TriggerIntegrationTest.testEventFromRestoredState-seed#[C276E306D93593F5]) [    ] o.a.s.c.ZkContainer Zookeeper client=127.0.0.1:63310/solr
   [junit4]   2> 96459 INFO  (zkConnectionManagerCallback-209-thread-1) [    ] o.a.s.c.c.ConnectionManager zkClient has connected
   [junit4]   2> 96497 INFO  (zkConnectionManagerCallback-211-thread-1-processing-n:127.0.0.1:63369_solr) [n:127.0.0.1:63369_solr    ] o.a.s.c.c.ConnectionManager zkClient has connected
   [junit4]   2> 96526 INFO  (TEST-TriggerIntegrationTest.testEventFromRestoredState-seed#[C276E306D93593F5]) [n:127.0.0.1:63369_solr    ] o.a.s.c.c.ZkStateReader Updated live nodes from ZooKeeper... (0) -> (2)
   [junit4]   2> 96532 INFO  (TEST-TriggerIntegrationTest.testEventFromRestoredState-seed#[C276E306D93593F5]) [n:127.0.0.1:63369_solr    ] o.a.s.c.Overseer Overseer (id=null) closing
   [junit4]   2> 96539 INFO  (TEST-TriggerIntegrationTest.testEventFromRestoredState-seed#[C276E306D93593F5]) [n:127.0.0.1:63369_solr    ] o.a.s.c.ZkController Register node as live in ZooKeeper:/live_nodes/127.0.0.1:63369_solr
   [junit4]   2> 96543 INFO  (zkCallback-202-thread-1) [    ] o.a.s.c.c.ZkStateReader Updated live nodes from ZooKeeper... (2) -> (3)
   [junit4]   2> 96543 INFO  (zkCallback-210-thread-1-processing-n:127.0.0.1:63369_solr) [n:127.0.0.1:63369_solr    ] o.a.s.c.c.ZkStateReader Updated live nodes from ZooKeeper... (2) -> (3)
   [junit4]   2> 96544 INFO  (zkCallback-190-thread-1-processing-n:127.0.0.1:63313_solr) [n:127.0.0.1:63313_solr    ] o.a.s.c.c.ZkStateReader Updated live nodes from ZooKeeper... (2) -> (3)
   [junit4]   2> 96544 INFO  (zkCallback-192-thread-1-processing-n:127.0.0.1:63312_solr) [n:127.0.0.1:63312_solr    ] o.a.s.c.c.ZkStateReader Updated live nodes from ZooKeeper... (2) -> (3)
   [junit4]   2> 96967 INFO  (TEST-TriggerIntegrationTest.testEventFromRestoredState-seed#[C276E306D93593F5]) [n:127.0.0.1:63369_solr    ] o.a.s.m.r.SolrJmxReporter JMX monitoring for 'solr_63369.solr.node' (registry 'solr.node') enabled at server: com.sun.jmx.mbeanserver.JmxMBeanServer@3aeddcd
   [junit4]   2> 97087 INFO  (TEST-TriggerIntegrationTest.testEventFromRestoredState-seed#[C276E306D93593F5]) [n:127.0.0.1:63369_solr    ] o.a.s.m.r.SolrJmxReporter JMX monitoring for 'solr_63369.solr.jvm' (registry 'solr.jvm') enabled at server: com.sun.jmx.mbeanserver.JmxMBeanServer@3aeddcd
   [junit4]   2> 97087 INFO  (TEST-TriggerIntegrationTest.testEventFromRestoredState-seed#[C276E306D93593F5]) [n:127.0.0.1:63369_solr    ] o.a.s.m.r.SolrJmxReporter JMX monitoring for 'solr_63369.solr.jetty' (registry 'solr.jetty') enabled at server: com.sun.jmx.mbeanserver.JmxMBeanServer@3aeddcd
   [junit4]   2> 97089 INFO  (TEST-TriggerIntegrationTest.testEventFromRestoredState-seed#[C276E306D93593F5]) [n:127.0.0.1:63369_solr    ] o.a.s.c.CorePropertiesLocator Found 0 core definitions underneath /Users/jenkins/workspace/Lucene-Solr-7.x-MacOSX/solr/build/solr-core/test/J1/temp/solr.cloud.autoscaling.TriggerIntegrationTest_C276E306D93593F5-001/tempDir-001/node3/.
   [junit4]   2> 97428 DEBUG (ScheduledTrigger-611-thread-1) [n:127.0.0.1:63312_solr    ] o.a.s.c.a.NodeAddedTrigger Running NodeAddedTrigger node_added_trigger
   [junit4]   2> 97428 DEBUG (ScheduledTrigger-611-thread-1) [n:127.0.0.1:63312_solr    ] o.a.s.c.a.NodeAddedTrigger Found livenodes: 3
   [junit4]   2> 97428 DEBUG (ScheduledTrigger-611-thread-1) [n:127.0.0.1:63312_solr    ] o.a.s.c.a.NodeAddedTrigger Tracking new node: 127.0.0.1:63369_solr at time 287770932463304
   [junit4]   2> 98427 INFO  (OverseerCollectionConfigSetProcessor-99390980233494534-127.0.0.1:63312_solr-n_0000000000) [n:127.0.0.1:63312_solr    ] o.a.s.c.OverseerTaskQueue Response ZK path: /overseer/collection-queue-work/qnr-0000000000 doesn't exist.  Requestor may have disconnected from ZooKeeper
   [junit4]   2> 98429 DEBUG (ScheduledTrigger-611-thread-1) [n:127.0.0.1:63312_solr    ] o.a.s.c.a.NodeAddedTrigger Running NodeAddedTrigger node_added_trigger
   [junit4]   2> 98429 DEBUG (ScheduledTrigger-611-thread-1) [n:127.0.0.1:63312_solr    ] o.a.s.c.a.NodeAddedTrigger Found livenodes: 3
   [junit4]   2> 99431 DEBUG (ScheduledTrigger-611-thread-1) [n:127.0.0.1:63312_solr    ] o.a.s.c.a.NodeAddedTrigger Running NodeAddedTrigger node_added_trigger
   [junit4]   2> 99431 DEBUG (ScheduledTrigger-611-thread-1) [n:127.0.0.1:63312_solr    ] o.a.s.c.a.NodeAddedTrigger Found livenodes: 3
   [junit4]   2> 100434 DEBUG (ScheduledTrigger-611-thread-1) [n:127.0.0.1:63312_solr    ] o.a.s.c.a.NodeAddedTrigger Running NodeAddedTrigger node_added_trigger
   [junit4]   2> 100434 DEBUG (ScheduledTrigger-611-thread-1) [n:127.0.0.1:63312_solr    ] o.a.s.c.a.NodeAddedTrigger Found livenodes: 3
   [junit4]   2> 101435 DEBUG (ScheduledTrigger-611-thread-1) [n:127.0.0.1:63312_solr    ] o.a.s.c.a.NodeAddedTrigger Running NodeAddedTrigger node_added_trigger
   [junit4]   2> 101435 DEBUG (ScheduledTrigger-611-thread-1) [n:127.0.0.1:63312_solr    ] o.a.s.c.a.NodeAddedTrigger Found livenodes: 3
   [junit4]   2> 102442 DEBUG (ScheduledTrigger-611-thread-1) [n:127.0.0.1:63312_solr    ] o.a.s.c.a.NodeAddedTrigger Running NodeAddedTrigger node_added_trigger
   [junit4]   2> 102442 DEBUG (ScheduledTrigger-611-thread-1) [n:127.0.0.1:63312_solr    ] o.a.s.c.a.NodeAddedTrigger Found livenodes: 3
   [junit4]   2> 103453 DEBUG (ScheduledTrigger-611-thread-1) [n:127.0.0.1:63312_solr    ] o.a.s.c.a.NodeAddedTrigger Running NodeAddedTrigger node_added_trigger
   [junit4]   2> 103453 DEBUG (ScheduledTrigger-611-thread-1) [n:127.0.0.1:63312_solr    ] o.a.s.c.a.NodeAddedTrigger Found livenodes: 3
   [junit4]   2> 104460 DEBUG (ScheduledTrigger-611-thread-1) [n:127.0.0.1:63312_solr    ] o.a.s.c.a.NodeAddedTrigger Running NodeAddedTrigger node_added_trigger
   [junit4]   2> 104460 DEBUG (ScheduledTrigger-611-thread-1) [n:127.0.0.1:63312_solr    ] o.a.s.c.a.NodeAddedTrigger Found livenodes: 3
   [junit4]   2> 105463 DEBUG (ScheduledTrigger-611-thread-1) [n:127.0.0.1:63312_solr    ] o.a.s.c.a.NodeAddedTrigger Running NodeAddedTrigger node_added_trigger
   [junit4]   2> 105463 DEBUG (ScheduledTrigger-611-thread-1) [n:127.0.0.1:63312_solr    ] o.a.s.c.a.NodeAddedTrigger Found livenodes: 3
   [junit4]   2> 106466 DEBUG (ScheduledTrigger-611-thread-1) [n:127.0.0.1:63312_solr    ] o.a.s.c.a.NodeAddedTrigger Running NodeAddedTrigger node_added_trigger
   [junit4]   2> 106466 DEBUG (ScheduledTrigger-611-thread-1) [n:127.0.0.1:63312_solr    ] o.a.s.c.a.NodeAddedTrigger Found livenodes: 3
   [junit4]   2> 107469 DEBUG (ScheduledTrigger-611-thread-1) [n:127.0.0.1:63312_solr    ] o.a.s.c.a.NodeAddedTrigger Running NodeAddedTrigger node_added_trigger
   [junit4]   2> 107469 DEBUG (ScheduledTrigger-611-thread-1) [n:127.0.0.1:63312_solr    ] o.a.s.c.a.NodeAddedTrigger Found livenodes: 3
   [junit4]   2> 107469 DEBUG (ScheduledTrigger-611-thread-1) [n:127.0.0.1:63312_solr    ] o.a.s.c.a.NodeAddedTrigger NodeAddedTrigger node_added_trigger firing registered processor for nodes: [127.0.0.1:63369_solr] added at times [287770932463304], now=287780974152618
   [junit4]   2> 107470 DEBUG (ScheduledTrigger-611-thread-1) [n:127.0.0.1:63312_solr    ] o.a.s.c.a.ScheduledTriggers ++++++++ Cooldown inactive - processing event: {
   [junit4]   2>   "id":"105b9e434c6c8T96gddw6kfhaajdgjs3u6dhmp5",
   [junit4]   2>   "source":"node_added_trigger",
   [junit4]   2>   "eventTime":287770932463304,
   [junit4]   2>   "eventType":"NODEADDED",
   [junit4]   2>   "properties":{
   [junit4]   2>     "eventTimes":[287770932463304],
   [junit4]   2>     "nodeNames":["127.0.0.1:63369_solr"]}}
   [junit4]   2> 107470 INFO  (ScheduledTrigger-611-thread-1) [n:127.0.0.1:63312_solr    ] o.a.s.c.a.SystemLogListener Collection .system does not exist, disabling logging.
   [junit4]   2> 107471 DEBUG (AutoscalingActionExecutor-612-thread-1-processing-n:127.0.0.1:63312_solr) [n:127.0.0.1:63312_solr    ] o.a.s.c.a.ScheduledTriggers -- processing actions for {
   [junit4]   2>   "id":"105b9e434c6c8T96gddw6kfhaajdgjs3u6dhmp5",
   [junit4]   2>   "source":"node_added_trigger",
   [junit4]   2>   "eventTime":287770932463304,
   [junit4]   2>   "eventType":"NODEADDED",
   [junit4]   2>   "properties":{
   [junit4]   2>     "eventTimes":[287770932463304],
   [junit4]   2>     "_enqueue_time_":287780974309988,
   [junit4]   2>     "nodeNames":["127.0.0.1:63369_solr"]}}
   [junit4]   2> 107472 INFO  (TEST-TriggerIntegrationTest.testEventFromRestoredState-seed#[C276E306D93593F5]) [    ] o.e.j.s.Server jetty-9.4.8.v20171121, build timestamp: 2017-11-22T05:27:37+08:00, git hash: 82b8fb23f757335bb3329d540ce37a2a2615f0a8
   [junit4]   2> 107473 DEBUG (AutoscalingActionExecutor-612-thread-1-processing-n:127.0.0.1:63312_solr) [n:127.0.0.1:63312_solr    ] o.a.s.c.a.ScheduledTriggers -- processing took 2 ms for event id=105b9e434c6c8T96gddw6kfhaajdgjs3u6dhmp5
   [junit4]   2> 107474 INFO  (TEST-TriggerIntegrationTest.testEventFromRestoredState-seed#[C276E306D93593F5]) [    ] o.e.j.s.session DefaultSessionIdManager workerName=node0
   [junit4]   2> 107474 INFO  (TEST-TriggerIntegrationTest.testEventFromRestoredState-seed#[C276E306D93593F5]) [    ] o.e.j.s.session No SessionScavenger set, using defaults
   [junit4]   2> 107474 INFO  (TEST-TriggerIntegrationTest.testEventFromRestoredState-seed#[C276E306D93593F5]) [    ] o.e.j.s.session Scavenging every 600000ms
   [junit4]   2> 107474 INFO  (TEST-TriggerIntegrationTest.testEventFromRestoredState-seed#[C276E306D93593F5]) [    ] o.e.j.s.h.ContextHandler Started o.e.j.s.ServletContextHandler@4d700cb0{/solr,null,AVAILABLE}
   [junit4]   2> 107474 INFO  (TEST-TriggerIntegrationTest.testEventFromRestoredState-seed#[C276E306D93593F5]) [    ] o.e.j.s.AbstractConnector Started ServerConnector@31109167{HTTP/1.1,[http/1.1]}{127.0.0.1:63373}
   [junit4]   2> 107475 INFO  (TEST-TriggerIntegrationTest.testEventFromRestoredState-seed#[C276E306D93593F5]) [    ] o.e.j.s.Server Started @109898ms
   [junit4]   2> 107475 INFO  (TEST-TriggerIntegrationTest.testEventFromRestoredState-seed#[C276E306D93593F5]) [    ] o.a.s.c.s.e.JettySolrRunner Jetty properties: {hostContext=/solr, hostPort=63373}
   [junit4]   2> 107475 ERROR (TEST-TriggerIntegrationTest.testEventFromRestoredState-seed#[C276E306D93593F5]) [    ] o.a.s.u.StartupLoggingUtils Missing Java Option solr.log.dir. Logging may be missing or incomplete.
   [junit4]   2> 107475 INFO  (TEST-TriggerIntegrationTest.testEventFromRestoredState-seed#[C276E306D93593F5]) [    ] o.a.s.s.SolrDispatchFilter  ___      _       Welcome to Apache Solr? version 7.3.0
   [junit4]   2> 107475 INFO  (TEST-TriggerIntegrationTest.testEventFromRestoredState-seed#[C276E306D93593F5]) [    ] o.a.s.s.SolrDispatchFilter / __| ___| |_ _   Starting in cloud mode on port null
   [junit4]   2> 107475 INFO  (TEST-TriggerIntegrationTest.testEventFromRestoredState-seed#[C276E306D93593F5]) [    ] o.a.s.s.SolrDispatchFilter \__ \/ _ \ | '_|  Install dir: null
   [junit4]   2> 107475 INFO  (TEST-TriggerIntegrationTest.testEventFromRestoredState-seed#[C276E306D93593F5]) [    ] o.a.s.s.SolrDispatchFilter |___/\___/_|_|    Start time: 2018-01-22T01:53:59.916445Z
   [junit4]   2> 107477 INFO  (zkConnectionManagerCallback-215-thread-1) [    ] o.a.s.c.c.ConnectionManager zkClient has connected
   [junit4]   2> 107478 INFO  (TEST-TriggerIntegrationTest.testEventFromRestoredState-seed#[C276E306D93593F5]) [    ] o.a.s.s.SolrDispatchFilter solr.xml found in ZooKeeper. Loading...
   [junit4]   2> 107486 INFO  (TEST-TriggerIntegrationTest.testEventFromRestoredState-seed#[C276E306D93593F5]) [    ] o.a.s.c.ZkContainer Zookeeper client=127.0.0.1:63310/solr
   [junit4]   2> 107489 INFO  (zkConnectionManagerCallback-219-thread-1) [    ] o.a.s.c.c.ConnectionManager zkClient has connected
   [junit4]   2> 107495 INFO  (zkConnectionManagerCallback-221-thread-1-processing-n:127.0.0.1:63373_solr) [n:127.0.0.1:63373_solr    ] o.a.s.c.c.ConnectionManager zkClient has connected
   [junit4]   2> 107509 INFO  (TEST-TriggerIntegrationTest.testEventFromRestoredState-seed#[C276E306D93593F5]) [n:127.0.0.1:63373_solr    ] o.a.s.c.c.ZkStateReader Updated live nodes from ZooKeeper... (0) -> (3)
   [junit4]   2> 107514 INFO  (TEST-TriggerIntegrationTest.testEventFromRestoredState-seed#[C276E306D93593F5]) [n:127.0.0.1:63373_solr    ] o.a.s.c.Overseer Overseer (id=null) closing
   [junit4]   2> 107518 INFO  (TEST-TriggerIntegrationTest.testEventFromRestoredState-seed#[C276E306D93593F5]) [n:127.0.0.1:63373_solr    ] o.a.s.c.ZkController Register node as live in ZooKeeper:/live_nodes/127.0.0.1:63373_solr
   [junit4]   2> 107521 INFO  (zkCallback-202-thread-1) [    ] o.a.s.c.c.ZkStateReader Updated live nodes from ZooKeeper... (3) -> (4)
   [junit4]   2> 107521 INFO  (zkCallback-192-thread-1-processing-n:127.0.0.1:63312_solr) [n:127.0.0.1:63312_solr    ] o.a.s.c.c.ZkStateReader Updated live nodes from ZooKeeper... (3) -> (4)
   [junit4]   2> 107521 INFO  (zkCallback-190-thread-1-processing-n:127.0.0.1:63313_solr) [n:127.0.0.1:63313_solr    ] o.a.s.c.c.ZkStateReader Updated live nodes from ZooKeeper... (3) -> (4)
   [junit4]   2> 107521 INFO  (zkCallback-210-thread-1-processing-n:127.0.0.1:63369_solr) [n:127.0.0.1:63369_solr    ] o.a.s.c.c.ZkStateReader Updated live nodes from ZooKeeper... (3) -> (4)
   [junit4]   2> 107523 INFO  (zkCallback-220-thread-1-processing-n:127.0.0.1:63373_solr) [n:127.0.0.1:63373_solr    ] o.a.s.c.c.ZkStateReader Updated live nodes from ZooKeeper... (3) -> (4)
   [junit4]   2> 107559 INFO  (TEST-TriggerIntegrationTest.testEventFromRestoredState-seed#[C276E306D93593F5]) [n:127.0.0.1:63373_solr    ] o.a.s.m.r.SolrJmxReporter JMX monitoring for 'solr_63373.solr.node' (registry 'solr.node') enabled at server: com.sun.jmx.mbeanserver.JmxMBeanServer@3aeddcd
   [junit4]   2> 107579 INFO  (TEST-TriggerIntegrationTest.testEventFromRestoredState-seed#[C276E306D93593F5]) [n:127.0.0.1:63373_solr    ] o.a.s.m.r.SolrJmxReporter JMX monitoring for 'solr_63373.solr.jvm' (registry 'solr.jvm') enabled at server: com.sun.jmx.mbeanserver.JmxMBeanServer@3aeddcd
   [junit4]   2> 107580 INFO  (TEST-TriggerIntegrationTest.testEventFromRestoredState-seed#[C276E306D93593F5]) [n:127.0.0.1:63373_solr    ] o.a.s.m.r.SolrJmxReporter JMX monitoring for 'solr_63373.solr.jetty' (registry 'solr.jetty') enabled at server: com.sun.jmx.mbeanserver.JmxMBeanServer@3aeddcd
   [junit4]   2> 107581 INFO  (TEST-TriggerIntegrationTest.testEventFromRestoredState-seed#[C276E306D93593F5]) [n:127.0.0.1:63373_solr    ] o.a.s.c.CorePropertiesLocator Found 0 core definitions underneath /Users/jenkins/workspace/Lucene-Solr-7.x-MacOSX/solr/build/solr-core/test/J1/temp/solr.cloud.autoscaling.TriggerIntegrationTest_C276E306D93593F5-001/tempDir-001/node4/.
   [junit4]   2> 108482 DEBUG (ScheduledTrigger-611-thread-1) [n:127.0.0.1:63312_solr    ] o.a.s.c.a.NodeAddedTrigger Running NodeAddedTrigger node_added_trigger
   [junit4]   2> 108482 DEBUG (ScheduledTrigger-611-thread-1) [n:127.0.0.1:63312_solr    ] o.a.s.c.a.NodeAddedTrigger Found livenodes: 4
   [junit4]   2> 108482 DEBUG (ScheduledTrigger-611-thread-1) [n:127.0.0.1:63312_solr    ] o.a.s.c.a.NodeAddedTrigger Tracking new node: 127.0.0.1:63373_solr at time 287781986915679
   [junit4]   2> 109489 DEBUG (ScheduledTrigger-611-thread-1) [n:127.0.0.1:63312_solr    ] o.a.s.c.a.NodeAddedTrigger Running NodeAddedTrigger node_added_trigger
   [junit4]   2> 109489 DEBUG (ScheduledTrigger-611-thread-1) [n:127.0.0.1:63312_solr    ] o.a.s.c.a.NodeAddedTrigger Found livenodes: 4
   [junit4]   2> 110500 DEBUG (ScheduledTrigger-611-thread-1) [n:127.0.0.1:63312_solr    ] o.a.s.c.a.NodeAddedTrigger Running NodeAddedTrigger node_added_trigger
   [junit4]   2> 110500 DEBUG (ScheduledTrigger-611-thread-1) [n:127.0.0.1:63312_solr    ] o.a.s.c.a.NodeAddedTrigger Found livenodes: 4
   [junit4]   2> 111509 DEBUG (ScheduledTrigger-611-thread-1) [n:127.0.0.1:63312_solr    ] o.a.s.c.a.NodeAddedTrigger Running NodeAddedTrigger node_added_trigger
   [junit4]   2> 111509 DEBUG (ScheduledTrigger-611-thread-1) [n:127.0.0.1:63312_solr    ] o.a.s.c.a.NodeAddedTrigger Found livenodes: 4
   [junit4]   2> 112519 DEBUG (ScheduledTrigger-611-thread-1) [n:127.0.0.1:63312_solr    ] o.a.s.c.a.NodeAddedTrigger Running NodeAddedTrigger node_added_trigger
   [junit4]   2> 112519 DEBUG (ScheduledTrigger-611-thread-1) [n:127.0.0.1:63312_solr    ] o.a.s.c.a.NodeAddedTrigger Found livenodes: 4
   [junit4]   2> 113523 DEBUG (ScheduledTrigger-611-thread-1) [n:127.0.0.1:63312_solr    ] o.a.s.c.a.NodeAddedTrigger Running NodeAddedTrigger node_added_trigger
   [junit4]   2> 113523 DEBUG (ScheduledTrigger-611-thread-1) [n:127.0.0.1:63312_solr    ] o.a.s.c.a.NodeAddedTrigger Found livenodes: 4
   [junit4]   2> 114534 DEBUG (ScheduledTrigger-611-thread-1) [n:127.0.0.1:63312_solr    ] o.a.s.c.a.NodeAddedTrigger Running NodeAddedTrigger node_added_trigger
   [junit4]   2> 114534 DEBUG (ScheduledTrigger-611-thread-1) [n:127.0.0.1:63312_solr    ] o.a.s.c.a.NodeAddedTrigger Found livenodes: 4
   [junit4]   2> 115540 DEBUG (ScheduledTrigger-611-thread-1) [n:127.0.0.1:63312_solr    ] o.a.s.c.a.NodeAddedTrigger Running NodeAddedTrigger node_added_trigger
   [junit4]   2> 115540 DEBUG (ScheduledTrigger-611-thread-1) [n:127.0.0.1:63312_solr    ] o.a.s.c.a.NodeAddedTrigger Found livenodes: 4
   [junit4]   2> 116547 DEBUG (ScheduledTrigger-611-thread-1) [n:127.0.0.1:63312_solr    ] o.a.s.c.a.NodeAddedTrigger Running NodeAddedTrigger node_added_trigger
   [junit4]   2> 116547 DEBUG (ScheduledTrigger-611-thread-1) [n:127.0.0.1:63312_solr    ] o.a.s.c.a.NodeAddedTrigger Found livenodes: 4
   [junit4]   2> 117551 DEBUG (ScheduledTrigger-611-thread-1) [n:127.0.0.1:63312_solr    ] o.a.s.c.a.NodeAddedTrigger Running NodeAddedTrigger node_added_trigger
   [junit4]   2> 117551 DEBUG (ScheduledTrigger-611-thread-1) [n:127.0.0.1:63312_solr    ] o.a.s.c.a.NodeAddedTrigger Found livenodes: 4
   [junit4]   2> 117637 INFO  (TEST-TriggerIntegrationTest.testEventFromRestoredState-seed#[C276E306D93593F5]) [    ] o.e.j.s.AbstractConnector Stopped ServerConnector@12855281{HTTP/1.1,[http/1.1]}{127.0.0.1:0}
   [junit4]   2> 117638 INFO  (TEST-TriggerIntegrationTest.testEventFromRestoredState-seed#[C276E306D93593F5]) [    ] o.a.s.c.CoreContainer Shutting down CoreContainer instance=2006595813
   [junit4]   2> 117638 INFO  (TEST-TriggerIntegrationTest.testEventFromRestoredState-seed#[C276E306D93593F5]) [    ] o.a.s.m.SolrMetricManager Closing metric reporters for registry=solr.node, tag=null
   [junit4]   2> 117639 INFO  (TEST-TriggerIntegrationTest.testEventFromRestoredState-seed#[C276E306D93593F5]) [    ] o.a.s.m.r.SolrJmxReporter Closing reporter [org.apache.solr.metrics.reporters.SolrJmxReporter@1ea37925: rootName = solr_63312, domain = solr.node, service url = null, agent id = null] for registry solr.node / com.codahale.metrics.MetricRegistry@b7aff5f
   [junit4]   2> 117659 INFO  (TEST-TriggerIntegrationTest.testEventFromRestoredState-seed#[C276E306D93593F5]) [    ] o.a.s.m.SolrMetricManager Closing metric reporters for registry=solr.jvm, tag=null
   [junit4]   2> 117660 INFO  (TEST-TriggerIntegrationTest.testEventFromRestoredState-seed#[C276E306D93593F5]) [    ] o.a.s.m.r.SolrJmxReporter Closing reporter [org.apache.solr.metrics.reporters.SolrJmxReporter@617544e: rootName = solr_63312, domain = solr.jvm, service url = null, agent id = null] for registry solr.jvm / com.codahale.metrics.MetricRegistry@3fa04d6e
   [junit4]   2> 117686 INFO  (TEST-TriggerIntegrationTest.testEventFromRestoredState-seed#[C276E306D93593F5]) [    ] o.a.s.m.SolrMetricManager Closing metric reporters for registry=solr.jetty, tag=null
   [junit4]   2> 117687 INFO  (TEST-TriggerIntegrationTest.testEventFromRestoredState-seed#[C276E306D93593F5]) [    ] o.a.s.m.r.SolrJmxReporter Closing reporter [org.apache.solr.metrics.reporters.SolrJmxReporter@30714367: rootName = solr_63312, domain = solr.jetty, service url = null, agent id = null] for registry solr.jetty / com.codahale.metrics.MetricRegistry@5be3d77b
   [junit4]   2> 117697 INFO  (TEST-TriggerIntegrationTest.testEventFromRestoredState-seed#[C276E306D93593F5]) [    ] o.a.s.c.ZkController Remove node as live in ZooKeeper:/live_nodes/127.0.0.1:63312_solr
   [junit4]   2> 117701 INFO  (TEST-TriggerIntegrationTest.testEventFromRestoredState-seed#[C276E306D93593F5]) [    ] o.a.s.m.SolrMetricManager Closing metric reporters for registry=solr.cluster, tag=null
   [junit4]   2> 117704 INFO  (TEST-TriggerIntegrationTest.testEventFromRestoredState-seed#[C276E306D93593F5]) [    ] o.a.s.c.TransientSolrCoreCacheDefault Allocating transient cache for 2147483647 transient cores
   [junit4]   2> 117705 INFO  (TEST-TriggerIntegrationTest.testEventFromRestoredState-seed#[C276E306D93593F5]) [    ] o.a.s.c.Overseer Overseer (id=99390980233494534-127.0.0.1:63312_solr-n_0000000000) closing
   [junit4]   2> 117705 INFO  (OverseerStateUpdate-99390980233494534-127.0.0.1:63312_solr-n_0000000000) [n:127.0.0.1:63312_solr    ] o.a.s.c.Overseer Overseer Loop exiting : 127.0.0.1:63312_solr
   [junit4]   2> 117705 INFO  (zkCallback-210-thread-1-processing-n:127.0.0.1:63369_solr) [n:127.0.0.1:63369_solr    ] o.a.s.c.c.ZkStateReader Updated live nodes from ZooKeeper... (4) -> (3)
   [junit4]   2> 117706 INFO  (zkCallback-190-thread-1-processing-n:127.0.0.1:63313_solr) [n:127.0.0.1:63313_solr    ] o.a.s.c.c.ZkStateReader Updated live nodes from ZooKeeper... (4) -> (3)
   [junit4]   2> 117706 INFO  (zkCallback-202-thread-1) [    ] o.a.s.c.c.ZkStateReader Updated live nodes from ZooKeeper... (4) -> (3)
   [junit4]   2> 117706 INFO  (zkCallback-220-thread-1-processing-n:127.0.0.1:63373_solr) [n:127.0.0.1:63373_solr    ] o.a.s.c.c.ZkStateReader Updated live nodes from ZooKeeper... (4) -> (3)
   [junit4]   2> 117706 INFO  (zkCallback-192-thread-1-processing-n:127.0.0.1:63312_solr) [n:127.0.0.1:63312_solr    ] o.a.s.c.c.ZkStateReader Updated live nodes from ZooKeeper... (4) -> (3)
   [junit4]   2> 117720 WARN  (OverseerAutoScalingTriggerThread-99390980233494534-127.0.0.1:63312_solr-n_0000000000) [n:127.0.0.1:63312_solr    ] o.a.s.c.a.OverseerTriggerThread OverseerTriggerThread woken up but we are closed, exiting.
   [junit4]   2> 117723 DEBUG (TEST-TriggerIntegrationTest.testEventFromRestoredState-seed#[C276E306D93593F5]) [    ] o.a.s.c.a.OverseerTriggerThread OverseerTriggerThread has been closed explicitly
   [junit4]   2> 117733 INFO  (TEST-TriggerIntegrationTest.testEventFromRestoredState-seed#[C276E306D93593F5]) [    ] o.e.j.s.h.ContextHandler Stopped o.e.j.s.ServletContextHandler@12d32fd4{/solr,null,UNAVAILABLE}
   [junit4]   2> 117734 INFO  (TEST-TriggerIntegrationTest.testEventFromRestoredState-seed#[C276E306D93593F5]) [    ] o.e.j.s.session Stopped scavenging
   [junit4]   2> 117734 INFO  (zkCallback-190-thread-1-processing-n:127.0.0.1:63313_solr) [n:127.0.0.1:63313_solr    ] o.a.s.c.OverseerElectionContext I am going to be the leader 127.0.0.1:63313_solr
   [junit4]   2> 117737 INFO  (zkCallback-190-thread-1-processing-n:127.0.0.1:63313_solr) [n:127.0.0.1:63313_solr    ] o.a.s.c.Overseer Overseer (id=99390980233494533-127.0.0.1:63313_solr-n_0000000001) starting
   [junit4]   2> 117763 DEBUG (OverseerAutoScalingTriggerThread-99390980233494533-127.0.0.1:63313_solr-n_0000000001) [n:127.0.0.1:63313_solr    ] o.a.s.c.a.OverseerTriggerThread Adding .autoAddReplicas trigger
   [junit4]   2> 117779 DEBUG (OverseerAutoScalingTriggerThread-99390980233494533-127.0.0.1:63313_solr-n_0000000001) [n:127.0.0.1:63313_solr    ] o.a.s.c.a.OverseerTriggerThread Refreshing /autoscaling.json with znode version 5
   [junit4]   2> 117780 DEBUG (OverseerAutoScalingTriggerThread-99390980233494533-127.0.0.1:63313_solr-n_0000000001) [n:127.0.0.1:63313_solr    ] o.a.s.c.a.NodeAddedTrigger Initial livenodes: [127.0.0.1:63313_solr, 127.0.0.1:63369_solr, 127.0.0.1:63373_solr]
   [junit4]   2> 117780 DEBUG (OverseerAutoScalingTriggerThread-99390980233494533-127.0.0.1:63313_solr-n_0000000001) [n:127.0.0.1:63313_solr    ] o.a.s.c.a.NodeAddedTrigger NodeAddedTrigger node_added_trigger instantiated with properties: {event=nodeAdded, waitFor=10, actions=[{name=test, class=org.apache.solr.cloud.autoscaling.TriggerIntegrationTest$TestTriggerAction}], enabled=true}
   [junit4]   2> 117781 DEBUG (OverseerAutoScalingTriggerThread-99390980233494533-127.0.0.1:63313_solr-n_0000000001) [n:127.0.0.1:63313_solr    ] o.a.s.c.a.NodeLostTrigger Initial livenodes: [127.0.0.1:63313_solr, 127.0.0.1:63369_solr, 127.0.0.1:63373_solr]
   [junit4]   2> 117782 DEBUG (OverseerAutoScalingTriggerThread-99390980233494533-127.0.0.1:63313_solr-n_0000000001) [n:127.0.0.1:63313_solr    ] o.a.s.c.a.OverseerTriggerThread Current znodeVersion 5, lastZnodeVersion -1
   [junit4]   2> 117782 DEBUG (OverseerAutoScalingTriggerThread-99390980233494533-127.0.0.1:63313_solr-n_0000000001) [n:127.0.0.1:63313_solr    ] o.a.s.c.a.OverseerTriggerThread Processed trigger updates upto znodeVersion 5
   [junit4]   2> 117787 INFO  (OverseerAutoScalingTriggerThread-99390980233494533-127.0.0.1:63313_solr-n_0000000001) [n:127.0.0.1:63313_solr    ] o.a.s.c.a.TriggerIntegrationTest TestTriggerAction init
   [junit4]   2> 117787 DEBUG (OverseerAutoScalingTriggerThread-99390980233494533-127.0.0.1:63313_solr-n_0000000001) [n:127.0.0.1:63313_solr    ] o.a.s.c.a.NodeAddedTrigger Adding node from marker path: 127.0.0.1:63373_solr
   [junit4]   2> 117788 DEBUG (ScheduledTrigger-634-thread-1) [n:127.0.0.1:63313_solr    ] o.a.s.c.a.NodeLostTrigger Running NodeLostTrigger: .auto_add_replicas with currently live nodes: 3
   [junit4]   2> 117789 DEBUG (OverseerAutoScalingTriggerThread-99390980233494533-127.0.0.1:63313_solr-n_0000000001) [n:127.0.0.1:63313_solr    ] o.a.s.c.a.OverseerTriggerThread Current znodeVersion 5, lastZnodeVersion 5
   [junit4]   2> 117790 DEBUG (ScheduledTrigger-634-thread-2) [n:127.0.0.1:63313_solr    ] o.a.s.c.a.NodeAddedTrigger Running NodeAddedTrigger node_added_trigger
   [junit4]   2> 117790 DEBUG (ScheduledTrigger-634-thread-2) [n:127.0.0.1:63313_solr    ] o.a.s.c.a.NodeAddedTrigger Found livenodes: 3
   [junit4]   2> 118796 DEBUG (ScheduledTrigger-634-thread-1) [n:127.0.0.1:63313_solr    ] o.a.s.c.a.NodeLostTrigger Running NodeLostTrigger: .auto_add_replicas with currently live nodes: 3
   [junit4]   2> 118801 DEBUG (ScheduledTrigger-634-thread-1) [n:127.0.0.1:63313_solr    ] o.a.s.c.a.NodeAddedTrigger Running NodeAddedTrigger node_added_trigger
   [junit4]   2> 118801 DEBUG (ScheduledTrigger-634-thread-1) [n:127.0.0.1:63313_solr    ] o.a.s.c.a.NodeAddedTrigger Found livenodes: 3
   [junit4]   2> 118801 DEBUG (ScheduledTrigger-634-thread-1) [n:127.0.0.1:63313_solr    ] o.a.s.c.a.NodeAddedTrigger NodeAddedTrigger node_added_trigger firing registered processor for nodes: [127.0.0.1:63373_solr] added at times [287781986915679], now=287792305731524
   [junit4]   2> 118801 DEBUG (ScheduledTrigger-634-thread-1) [n:127.0.0.1:63313_solr    ] o.a.s.c.a.ScheduledTriggers ++++++++ Cooldown inactive - processing event: {
   [junit4]   2>   "id":"105bc771a555fT96gddw6kfhaajdgjs3u6dhmp7",
   [junit4]   2>   "source":"node_added_trigger",
   [junit4]   2>   "eventTime":287781986915679,
   [junit4]   2>   "eventType":"NODEADDED",
   [junit4]   2>   "properties":{
   [junit4]   2>     "eventTimes":[287781986915679],
   [junit4]   2>     "nodeNames":["127.0.0.1:63373_solr"]}}
   [junit4]   2> 118802 INFO  (ScheduledTrigger-634-thread-1) [n:127.0.0.1:63313_solr    ] o.a.s.c.a.SystemLogListener Collection .system does not exist, disabling logging.
   [junit4]   2> 118803 DEBUG (AutoscalingActionExecutor-635-thread-1-processing-n:127.0.0.1:63313_solr) [n:127.0.0.1:63313_solr    ] o.a.s.c.a.ScheduledTriggers -- processing actions for {
   [junit4]   2>   "id":"105bc771a555fT96gddw6kfhaajdgjs3u6dhmp7",
   [junit4]   2>   "source":"node_added_trigger",
   [junit4]   2>   "eventTime":287781986915679,
   [junit4]   2>   "eventType":"NODEADDED",
   [junit4]   2>   "properties":{
   [junit4]   2>     "eventTimes":[287781986915679],
   [junit4]   2>     "_enqueue_time_":287792305936359,
   [junit4]   2>     "nodeNames":["127.0.0.1:63373_solr"]}}
   [junit4]   2> 118804 INFO  (TEST-TriggerIntegrationTest.testEventFromRestoredState-seed#[C276E306D93593F5]) [    ] o.a.s.SolrTestCaseJ4 ###Ending testEventFromRestoredState
   [junit4]   2> 118812 DEBUG (AutoscalingActionExecutor-635-thread-1-processing-n:127.0.0.1:63313_solr) [n:127.0.0.1:63313_solr    ] o.a.s.c.a.ScheduledTriggers -- processing took 8 ms for event id=105bc771a555fT96gddw6kfhaajdgjs3u6dhmp7
   [junit4]   2> 118845 INFO  (TEST-TriggerIntegrationTest.testListeners-seed#[C276E306D93593F5]) [    ] o.a.s.SolrTestCaseJ4 ###Starting testListeners
   [junit4]   2> 118845 INFO  (TEST-TriggerIntegrationTest.testListeners-seed#[C276E306D93593F5]) [    ] o.a.s.c.a.TriggerIntegrationTest /autoscaling.json reset, new znode version 6
   [junit4]   2> 118846 DEBUG (zkCallback-190-thread-1-processing-n:127.0.0.1:63313_solr) [n:127.0.0.1:63313_solr    ] o.a.s.c.a.OverseerTriggerThread Refreshing /autoscaling.json with znode version 6
   [junit4]   2> 118852 DEBUG (OverseerAutoScalingTriggerThread-99390980233494533-127.0.0.1:63313_solr-n_0000000001) [n:127.0.0.1:63313_solr    ] o.a.s.c.a.OverseerTriggerThread Processed trigger updates upto znodeVersion 6
   [junit4]   2> 118857 DEBUG (OverseerAutoScalingTriggerThread-99390980233494533-127.0.0.1:63313_solr-n_0000000001) [n:127.0.0.1:63313_solr    ] o.a.s.c.a.OverseerTriggerThread -- clean old nodeLost markers
   [junit4]   2> 118857 DEBUG (OverseerAutoScalingTriggerThread-99390980233494533-127.0.0.1:63313_solr-n_0000000001) [n:127.0.0.1:63313_solr    ] o.a.s.c.a.OverseerTriggerThread -- clean old nodeAdded markers
   [junit4]   2> 118858 DEBUG (OverseerAutoScalingTriggerThread-99390980233494533-127.0.0.1:63313_solr-n_0000000001) [n:127.0.0.1:63313_solr    ] o.a.s.c.a.OverseerTriggerThread Current znodeVersion 6, lastZnodeVersion 6
   [junit4]   2> 118863 INFO  (qtp807813987-1226) [n:127.0.0.1:63369_solr    ] o.a.s.s.HttpSolrCall [admin] webapp=null path=/admin/metrics params={prefix=CONTAINER.fs.usableSpace,CORE.coreName&wt=javabin&version=2&group=solr.node,solr.core} status=0 QTime=1
   [junit4]   2> 118873 INFO  (qtp548655871-1252) [n:127.0.0.1:63373_solr    ] o.a.s.s.HttpSolrCall [admin] webapp=null path=/admin/metrics params={prefix=CONTAINER.fs.usableSpace,CORE.coreName&wt=javabin&version=2&group=solr.node,solr.core} status=0 QTime=1
   [junit4]   2> 118882 INFO  (qtp1618087901-1166) [n:127.0.0.1:63313_solr    ] o.a.s.s.HttpSolrCall [admin] webapp=null path=/admin/metrics params={prefix=CONTAINER.fs.usableSpace,CORE.coreName&wt=javabin&version=2&group=solr.node,solr.core} status=0 QTime=0
   [junit4]   2> 118882 DEBUG (qtp1618087901-1168) [n:127.0.0.1:63313_solr    ] o.a.s.c.a.AutoScalingHandler Verified autoscaling configuration
   [junit4]   2> 118883 INFO  (qtp1618087901-1168) [n:127.0.0.1:63313_solr    ] o.a.s.s.HttpSolrCall [admin] webapp=null path=/cluster/autoscaling params={wt=javabin&version=2} status=0 QTime=23
   [junit4]   2> 118883 DEBUG (zkCallback-190-thread-1-processing-n:127.0.0.1:63313_solr) [n:127.0.0.1:63313_solr    ] o.a.s.c.a.OverseerTriggerThread Refreshing /autoscaling.json with znode version 7
   [junit4]   2> 118884 DEBUG (zkCallback-190-thread-1-processing-n:127.0.0.1:63313_solr) [n:127.0.0.1:63313_solr    ] o.a.s.c.a.NodeAddedTrigger Initial livenodes: [127.0.0.1:63313_solr, 127.0.0.1:63369_solr, 127.0.0.1:63373_solr]
   [junit4]   2> 118884 DEBUG (zkCallback-190-thread-1-processing-n:127.0.0.1:63313_solr) [n:127.0.0.1:63313_solr    ] o.a.s.c.a.NodeAddedTrigger NodeAddedTrigger node_added_trigger instantiated with properties: {event=nodeAdded, waitFor=2, actions=[{name=test, class=org.apache.solr.cloud.autoscaling.TriggerIntegrationTest$TestTriggerAction}, {name=test1, class=org.apache.solr.cloud.autoscaling.TriggerIntegrationTest$TestDummyAction}], enabled=true}
   [junit4]   2> 118884 DEBUG (OverseerAutoScalingTriggerThread-99390980233494533-127.0.0.1:63313_solr-n_0000000001) [n:127.0.0.1:63313_solr    ] o.a.s.c.a.OverseerTriggerThread Processed trigger updates upto znodeVersion 7
   [junit4]   2> 118888 INFO  (OverseerAutoScalingTriggerThread-99390980233494533-127.0.0.1:63313_solr-n_0000000001) [n:127.0.0.1:63313_solr    ] o.a.s.c.a.TriggerIntegrationTest TestTriggerAction init
   [junit4]   2> 118888 DEBUG (OverseerAutoScalingTriggerThread-99390980233494533-127.0.0.1:63313_solr-n_0000000001) [n:127.0.0.1:63313_solr    ] o.a.s.c.a.OverseerTriggerThread -- clean old nodeLost markers
   [junit4]   2> 118888 DEBUG (OverseerAutoScalingTriggerThread-99390980233494533-127.0.0.1:63313_solr-n_0000000001) [n:127.0.0.1:63313_solr    ] o.a.s.c.a.OverseerTriggerThread Current znodeVersion 7, lastZnodeVersion 7
   [junit4]   2> 118889 DEBUG (ScheduledTrigger-634-thread-4) [n:127.0.0.1:63313_solr    ] o.a.s.c.a.NodeAddedTrigger Running NodeAddedTrigger node_added_trigger
   [junit4]   2> 118889 DEBUG (ScheduledTrigger-634-thread-4) [n:127.0.0.1:63313_solr    ] o.a.s.c.a.NodeAddedTrigger Found livenodes: 3
   [junit4]   2> 118891 INFO  (qtp807813987-1228) [n:127.0.0.1:63369_solr    ] o.a.s.s.HttpSolrCall [admin] webapp=null path=/admin/metrics params={prefix=CONTAINER.fs.usableSpace,CORE.coreName&wt=javabin&version=2&group=solr.node,solr.core} status=0 QTime=0
   [junit4]   2> 118892 INFO  (qtp548655871-1254) [n:127.0.0.1:63373_solr    ] o.a.s.s.HttpSolrCall [admin] webapp=null path=/admin/metrics params={prefix=CONTAINER.fs.usableSpace,CORE.coreName&wt=javabin&version=2&group=solr.node,solr.core} status=0 QTime=0
   [junit4]   2> 118893 INFO  (qtp1618087901-1168) [n:127.0.0.1:63313_solr    ] o.a.s.s.HttpSolrCall [admin] webapp=null path=/admin/metrics params={prefix=CONTAINER.fs.usableSpace,CORE.coreName&wt=javabin&version=2&group=solr.node,solr.core} status=0 QTime=0
   [junit4]   2> 118893 DEBUG (qtp1618087901-1161) [n:127.0.0.1:63313_solr    ] o.a.s.c.a.AutoScalingHandler Verified autoscaling configuration
   [junit4]   2> 118894 INFO  (qtp1618087901-1161) [n:127.0.0.1:63313_solr    ] o.a.s.s.HttpSolrCall [admin] webapp=null path=/cluster/autoscaling params={wt=javabin&version=2} status=0 QTime=5
   [junit4]   2> 118894 DEBUG (zkCallback-190-thread-1-processing-n:127.0.0.1:63313_solr) [n:127.0.0.1:63313_solr    ] o.a.s.c.a.OverseerTriggerThread Refreshing /autoscaling.json with znode version 8
   [junit4]   2> 118895 DEBUG (zkCallback-190-thread-1-processing-n:127.0.0.1:63313_solr) [n:127.0.0.1:63313_solr    ] o.a.s.c.a.NodeAddedTrigger Initial livenodes: [127.0.0.1:63313_solr, 127.0.0.1:63369_solr, 127.0.0.1:63373_solr]
   [junit4]   2> 118895 DEBUG (zkCallback-190-thread-1-processing-n:127.0.0.1:63313_solr) [n:127.0.0.1:63313_solr    ] o.a.s.c.a.NodeAddedTrigger NodeAddedTrigger node_added_trigger instantiated with properties: {event=nodeAdded, waitFor=2, actions=[{name=test, class=org.apache.solr.cloud.autoscaling.TriggerIntegrationTest$TestTriggerAction}, {name=test1, class=org.apache.solr.cloud.autoscaling.TriggerIntegrationTest$TestDummyAction}], enabled=true}
   [junit4]   2> 118895 DEBUG (OverseerAutoScalingTriggerThread-99390980233494533-127.0.0.1:63313_solr-n_0000000001) [n:127.0.0.1:63313_solr    ] o.a.s.c.a.OverseerTriggerThread Processed trigger updates upto znodeVersion 8
   [junit4]   2> 118896 DEBUG (OverseerAutoScalingTriggerThread-99390980233494533-127.0.0.1:63313_solr-n_0000000001) [n:127.0.0.1:63313_solr    ] o.a.s.c.a.OverseerTriggerThread -- clean old nodeLost markers
   [junit4]   2> 118896 DEBUG (OverseerAutoScalingTriggerThread-99390980233494533-127.0.0.1:63313_solr-n_0000000001) [n:127.0.0.1:63313_solr    ] o.a.s.c.a.OverseerTriggerThread Current znodeVersion 8, lastZnodeVersion 8
   [junit4]   2> 118897 INFO  (qtp1618087901-1161) [n:127.0.0.1:63313_solr    ] o.a.s.s.HttpSolrCall [admin] webapp=null path=/admin/metrics params={prefix=CONTAINER.fs.usableSpace,CORE.coreName&wt=javabin&version=2&group=solr.node,solr.core} status=0 QTime=0
   [junit4]   2> 118899 INFO  (qtp807813987-1231) [n:127.0.0.1:63369_solr    ] o.a.s.s.HttpSolrCall [admin] webapp=null path=/admin/metrics params={prefix=CONTAINER.fs.usableSpace,CORE.coreName&wt=javabin&version=2&group=solr.node,solr.core} status=0 QTime=0
   [junit4]   2> 118900 INFO  (qtp548655871-1254) [n:127.0.0.1:63373_solr    ] o.a.s.s.HttpSolrCall [admin] webapp=null path=/admin/metrics params={prefix=CONTAINER.fs.usableSpace,CORE.coreName&wt=javabin&version=2&group=solr.node,solr.core} status=0 QTime=0
   [junit4]   2> 118900 DEBUG (qtp807813987-1228) [n:127.0.0.1:63369_solr    ] o.a.s.c.a.AutoScalingHandler Verified autoscaling configuration
   [junit4]   2> 118901 INFO  (qtp807813987-1228) [n:127.0.0.1:63369_solr    ] o.a.s.s.HttpSolrCall [admin] webapp=null path=/cluster/autoscaling params={wt=javabin&version=2} status=0 QTime=5
   [junit4]   2> 118901 DEBUG (zkCallback-190-thread-1-processing-n:127.0.0.1:63313_solr) [n:127.0.0.1:63313_solr    ] o.a.s.c.a.OverseerTriggerThread Refreshing /autoscaling.json with znode version 9
   [junit4]   2> 118901 INFO  (TEST-TriggerIntegrationTest.testListeners-seed#[C276E306D93593F5]) [    ] o.e.j.s.Server jetty-9.4.8.v20171121, build timestamp: 2017-11-22T05:27:37+08:00, git hash: 82b8fb23f757335bb3329d540ce37a2a2615f0a8
   [junit4]   2> 118902 DEBUG (zkCallback-190-thread-1-processing-n:127.0.0.1:63313_solr) [n:127.0.0.1:63313_solr    ] o.a.s.c.a.NodeAddedTrigger Initial livenodes: [127.0.0.1:63313_solr, 127.0.0.1:63369_solr, 127.0.0.1:63373_solr]
   [junit4]   2> 118902 DEBUG (zkCallback-190-thread-1-processing-n:127.0.0.1:63313_solr) [n:127.0.0.1:63313_solr    ] o.a.s.c.a.NodeAddedTrigger NodeAddedTrigger node_added_trigger instantiated with properties: {event=nodeAdded, waitFor=2, actions=[{name=test, class=org.apache.solr.cloud.autoscaling.TriggerIntegrationTest$TestTriggerAction}, {name=test1, class=org.apache.solr.cloud.autoscaling.TriggerIntegrationTest$TestDummyAction}], enabled=true}
   [junit4]   2> 118902 DEBUG (OverseerAutoScalingTriggerThread-99390980233494533-127.0.0.1:63313_solr-n_0000000001) [n:127.0.0.1:63313_solr    ] o.a.s.c.a.OverseerTriggerThread Processed trigger updates upto znodeVersion 9
   [junit4]   2> 118902 DEBUG (OverseerAutoScalingTriggerThread-99390980233494533-127.0.0.1:63313_solr-n_0000000001) [n:127.0.0.1:63313_solr    ] o.a.s.c.a.OverseerTriggerThread -- clean old nodeLost markers
   [junit4]   2> 118902 INFO  (TEST-TriggerIntegrationTest.testListeners-seed#[C276E306D93593F5]) [    ] o.e.j.s.session DefaultSessionIdManager workerName=node0
   [junit4]   2> 118902 INFO  (TEST-TriggerIntegrationTest.testListeners-seed#[C276E306D93593F5]) [    ] o.e.j.s.session No SessionScavenger set, using defaults
   [junit4]   2> 118902 INFO  (TEST-TriggerIntegrationTest.testListeners-seed#[C276E306D93593F5]) [    ] o.e.j.s.session Scavenging every 600000ms
   [junit4]   2> 118903 DEBUG (OverseerAutoScalingTriggerThread-99390980233494533-127.0.0.1:63313_solr-n_0000000001) [n:127.0.0.1:63313_solr    ] o.a.s.c.a.OverseerTriggerThread Current znodeVersion 9, lastZnodeVersion 9
   [junit4]   2> 118903 INFO  (TEST-TriggerIntegrationTest.testListeners-seed#[C276E306D93593F5]) [    ] o.e.j.s.h.ContextHandler Started o.e.j.s.ServletContextHandler@1a140a89{/solr,null,AVAILABLE}
   [junit4]   2> 118903 INFO  (TEST-TriggerIntegrationTest.testListeners-seed#[C276E306D93593F5]) [    ] o.e.j.s.AbstractConnector Started ServerConnector@46f098fc{HTTP/1.1,[http/1.1]}{127.0.0.1:63401}
   [junit4]   2> 118903 INFO  (TEST-TriggerIntegrationTest.testListeners-seed#[C276E306D93593F5]) [    ] o.e.j.s.Server Started @121327ms
   [junit4]   2> 118903 INFO  (TEST-TriggerIntegrationTest.testListeners-seed#[C276E306D93593F5]) [    ] o.a.s.c.s.e.JettySolrRunner Jetty properties: {hostContext=/solr, hostPort=63401}
   [junit4]   2> 118903 ERROR (TEST-TriggerIntegrationTest.testListeners-seed#[C276E306D93593F5]) [    ] o.a.s.u.StartupLoggingUtils Missing Java Option solr.log.dir. Logging may be missing or incomplete.
   [junit4]   2> 118904 INFO  (TEST-TriggerIntegrationTest.testListeners-seed#[C276E306D93593F5]) [    ] o.a.s.s.SolrDispatchFilter  ___      _       Welcome to Apache Solr? version 7.3.0
   [junit4]   2> 118904 INFO  (TEST-TriggerIntegrationTest.testListeners-seed#[C276E306D93593F5]) [    ] o.a.s.s.SolrDispatchFilter / __| ___| |_ _   Starting in cloud mode on port null
   [junit4]   2> 118904 INFO  (TEST-TriggerIntegrationTest.testListeners-seed#[C276E306D93593F5]) [    ] o.a.s.s.SolrDispatchFilter \__ \/ _ \ | '_|  Install dir: null
   [junit4]   2> 118904 INFO  (TEST-TriggerIntegrationTest.testListeners-seed#[C276E306D93593F5]) [    ] o.a.s.s.SolrDispatchFilter |___/\___/_|_|    Start time: 2018-01-22T01:54:11.345434Z
   [junit4]   2> 118906 INFO  (zkConnectionManagerCallback-225-thread-1) [    ] o.a.s.c.c.ConnectionManager zkClient has connected
   [junit4]   2> 118907 INFO  (TEST-TriggerIntegrationTest.testListeners-seed#[C276E306D93593F5]) [    ] o.a.s.s.SolrDispatchFilter solr.xml found in ZooKeeper. Loading...
   [junit4]   2> 118914 INFO  (TEST-TriggerIntegrationTest.testListeners-seed#[C276E306D93593F5]) [    ] o.a.s.c.ZkContainer Zookeeper client=127.0.0.1:63310/solr
   [junit4]   2> 118916 INFO  (zkConnectionManagerCallback-229-thread-1) [    ] o.a.s.c.c.ConnectionManager zkClient has connected
   [junit4]   2> 118919 INFO  (zkConnectionManagerCallback-231-thread-1-processing-n:127.0.0.1:63401_solr) [n:127.0.0.1:63401_solr    ] o.a.s.c.c.ConnectionManager zkClient has connected
   [junit4]   2> 118930 INFO  (TEST-TriggerIntegrationTest.testListeners-seed#[C276E306D93593F5]) [n:127.0.0.1:63401_solr    ] o.a.s.c.c.ZkStateReader Updated live nodes from ZooKeeper... (0) -> (3)
   [junit4]   2> 118933 INFO  (TEST-TriggerIntegrationTest.testListeners-seed#[C276E306D93593F5]) [n:127.0.0.1:63401_solr    ] o.a.s.c.Overseer Overseer (id=null) closing
   [junit4]   2> 118936 INFO  (TEST-TriggerIntegrationTest.testListeners-seed#[C276E306D93593F5]) [n:127.0.0.1:63401_solr    ] o.a.s.c.ZkController Register node as live in ZooKeeper:/live_nodes/127.0.0.1:63401_solr
   [junit4]   2> 118938 INFO  (zkCallback-220-thread-1-processing-n:127.0.0.1:63373_solr) [n:127.0.0.1:63373_solr    ] o.a.s.c.c.ZkStateReader Updated live nodes from ZooKeeper... (3) -> (4)
   [junit4]   2> 118938 INFO  (zkCallback-202-thread-1) [    ] o.a.s.c.c.ZkStateReader Updated live nodes from ZooKeeper... (3) -> (4)
   [junit4]   2> 118938 INFO  (zkCallback-190-thread-1-processing-n:127.0.0.1:63313_solr) [n:127.0.0.1:63313_solr    ] o.a.s.c.c.ZkStateReader Updated live nodes from ZooKeeper... (3) -> (4)
   [junit4]   2> 118938 INFO  (zkCallback-210-thread-1-processing-n:127.0.0.1:63369_solr) [n:127.0.0.1:63369_solr    ] o.a.s.c.c.ZkStateReader Updated live nodes from ZooKeeper... (3) -> (4)
   [junit4]   2> 118939 INFO  (zkCallback-230-thread-1-processing-n:127.0.0.1:63401_solr) [n:127.0.0.1:63401_solr    ] o.a.s.c.c.ZkStateReader Updated live nodes from ZooKeeper... (3) -> (4)
   [junit4]   2> 118981 INFO  (TEST-TriggerIntegrationTest.testListeners-seed#[C276E306D93593F5]) [n:127.0.0.1:63401_solr    ] o.a.s.m.r.SolrJmxReporter JMX monitoring for 'solr_63401.solr.node' (registry 'solr.node') enabled at server: com.sun.jmx.mbeanserver.JmxMBeanServer@3aeddcd
   [junit4]   2> 118991 INFO  (TEST-TriggerIntegrationTest.testListeners-seed#[C276E306D93593F5]) [n:127.0.0.1:63401_solr    ] o.a.s.m.r.SolrJmxReporter JMX monitoring for 'solr_63401.solr.jvm' (registry 'solr.jvm') enabled at server: com.sun.jmx.mbeanserver.JmxMBeanServer@3aeddcd
   [junit4]   2> 118991 INFO  (TEST-TriggerIntegrationTest.testListeners-seed#[C276E306D93593F5]) [n:127.0.0.1:63401_solr    ] o.a.s.m.r.SolrJmxReporter JMX monitoring for 'solr_63401.solr.jetty' (registry 'solr.jetty') enabled at server: com.sun.jmx.mbeanserver.JmxMBeanServer@3aeddcd
   [junit4]   2> 118992 INFO  (TEST-TriggerIntegrationTest.testListeners-seed#[C276E306D93593F5]) [n:127.0.0.1:63401_solr    ] o.a.s.c.CorePropertiesLocator Found 0 core definitions underneath /Users/jenkins/workspace/Lucene-Solr-7.x-MacOSX/solr/build/solr-core/test/J1/temp/solr.cloud.autoscaling.TriggerIntegrationTest_C276E306D93593F5-001/tempDir-001/node5/.
   [junit4]   2> 119900 DEBUG (ScheduledTrigger-634-thread-4) [n:127.0.0.1:63313_solr    ] o.a.s.c.a.NodeAddedTrigger Running NodeAddedTrigger node_added_trigger
   [junit4]   2> 119901 DEBUG (ScheduledTrigger-634-thread-4) [n:127.0.0.1:63313_solr    ] o.a.s.c.a.NodeAddedTrigger Found livenodes: 4
   [junit4]   2> 119901 DEBUG (ScheduledTrigger-634-thread-4) [n:127.0.0.1:63313_solr    ] o.a.s.c.a.NodeAddedTrigger Tracking new node: 127.0.0.1:63401_solr at time 287793405246291
   [junit4]   2> 120904 DEBUG (ScheduledTrigger-634-thread-4) [n:127.0.0.1:63313_solr    ] o.a.s.c.a.NodeAddedTrigger Running NodeAddedTrigger node_added_trigger
   [junit4]   2> 120904 DEBUG (ScheduledTrigger-634-thread-4) [n:127.0.0.1:63313_solr    ] o.a.s.c.a.NodeAddedTrigger Found livenodes: 4
   [junit4]   2> 121908 DEBUG (ScheduledTrigger-634-thread-4) [n:127.0.0.1:63313_solr    ] o.a.s.c.a.NodeAddedTrigger Running NodeAddedTrigger node_added_trigger
   [junit4]   2> 121908 DEBUG (ScheduledTrigger-634-thread-4) [n:127.0.0.1:63313_solr    ] o.a.s.c.a.NodeAddedTrigger Found livenodes: 4
   [junit4]   2> 121908 DEBUG (ScheduledTrigger-634-thread-4) [n:127.0.0.1:63313_solr    ] o.a.s.c.a.NodeAddedTrigger NodeAddedTrigger node_added_trigger firing registered processor for nodes: [127.0.0.1:63401_solr] added at times [287793405246291], now=287795412456395
   [junit4]   2> 121908 DEBUG (ScheduledTrigger-634-thread-4) [n:127.0.0.1:63313_solr    ] o.a.s.c.a.ScheduledTriggers ++++++++ Cooldown inactive - processing event: {
   [junit4]   2>   "id":"105bf1fb03b53T96gddw6kfhaajdgjs3u6dhmp9",
   [junit4]   2>   "source":"node_added_trigger",
   [junit4]   2>   "eventTime":287793405246291,
   [junit4]   2>   "eventType":"NODEADDED",
   [junit4]   2>   "properties":{
   [junit4]   2>     "eventTimes":[287793405246291],
   [junit4]   2>     "nodeNames":["127.0.0.1:63401_solr"]}}
   [junit4]   2> 121909 INFO  (ScheduledTrigger-634-thread-4) [n:127.0.0.1:63313_solr    ] o.a.s.c.a.SystemLogListener Collection .system does not exist, disabling logging.
   [junit4]   2> 121909 DEBUG (AutoscalingActionExecutor-635-thread-1-processing-n:127.0.0.1:63313_solr) [n:127.0.0.1:63313_solr    ] o.a.s.c.a.ScheduledTriggers -- processing actions for {
   [junit4]   2>   "id":"105bf1fb03b53T96gddw6kfhaajdgjs3u6dhmp9",
   [junit4]   2>   "source":"node_added_trigger",
   [junit4]   2>   "eventTime":287793405246291,
   [junit4]   2>   "eventType":"NODEADDED",
   [junit4]   2>   "properties":{
   [junit4]   2>     "eventTimes":[287793405246291],
   [junit4]   2>     "_enqueue_time_":287795412621295,
   [junit4]   2>     "nodeNames":["127.0.0.1:63401_solr"]}}
   [junit4]   2> 121911 DEBUG (AutoscalingActionExecutor-635-thread-1-processing-n:127.0.0.1:63313_solr) [n:127.0.0.1:63313_solr    ] o.a.s.c.a.ScheduledTriggers -- processing took 1 ms for event id=105bf1fb03b53T96gddw6kfhaajdgjs3u6dhmp9
   [junit4]   2> 122912 DEBUG (ScheduledTrigger-634-thread-4) [n:127.0.0.1:63313_solr    ] o.a.s.c.a.NodeAddedTrigger Running NodeAddedTrigger node_added_trigger
   [junit4]   2> 122912 DEBUG (ScheduledTrigger-634-thread-4) [n:127.0.0.1:63313_solr    ] o.a.s.c.a.NodeAddedTrigger Found livenodes: 4
   [junit4]   2> 123915 INFO  (TEST-TriggerIntegrationTest.testListeners-seed#[C276E306D93593F5]) [    ] o.e.j.s.Server jetty-9.4.8.v20171121, build timestamp: 2017-11-22T05:27:37+08:00, git hash: 82b8fb23f757335bb3329d540ce37a2a2615f0a8
   [junit4]   2> 123915 DEBUG (ScheduledTrigger-634-thread-4) [n:127.0.0.1:63313_solr    ] o.a.s.c.a.NodeAddedTrigger Running NodeAddedTrigger node_added_trigger
   [junit4]   2> 123915 DEBUG (ScheduledTrigger-634-thread-4) [n:127.0.0.1:63313_solr    ] o.a.s.c.a.NodeAddedTrigger Found livenodes: 4
   [junit4]   2> 123916 INFO  (TEST-TriggerIntegrationTest.testListeners-seed#[C276E306D93593F5]) [    ] o.e.j.s.session DefaultSessionIdManager workerName=node0
   [junit4]   2> 123916 INFO  (TEST-TriggerIntegrationTest.testListeners-seed#[C276E306D93593F5]) [    ] o.e.j.s.session No SessionScavenger set, using defaults
   [junit4]   2> 123916 INFO  (TEST-TriggerIntegrationTest.testListeners-seed#[C276E306D93593F5]) [    ] o.e.j.s.session Scavenging every 600000ms
   [junit4]   2> 123919 INFO  (TEST-TriggerIntegrationTest.testListeners-seed#[C276E306D93593F5]) [    ] o.e.j.s.h.ContextHandler Started o.e.j.s.ServletContextHandler@19e5e863{/solr,null,AVAILABLE}
   [junit4]   2> 123919 INFO  (TEST-TriggerIntegrationTest.testListeners-seed#[C276E306D93593F5]) [    ] o.e.j.s.AbstractConnector Started ServerConnector@f2a4d76{HTTP/1.1,[http/1.1]}{127.0.0.1:63416}
   [junit4]   2> 123919 INFO  (TEST-TriggerIntegrationTest.testListeners-seed#[C276E306D93593F5]) [    ] o.e.j.s.Server Started @126343ms
   [junit4]   2> 123919 INFO  (TEST-TriggerIntegrationTest.testListeners-seed#[C276E306D93593F5]) [    ] o.a.s.c.s.e.JettySolrRunner Jetty properties: {hostContext=/solr, hostPort=63416}
   [junit4]   2> 123919 ERROR (TEST-TriggerIntegrationTest.testListeners-seed#[C276E306D93593F5]) [    ] o.a.s.u.StartupLoggingUtils Missing Java Option solr.log.dir. Logging may be missing or incomplete.
   [junit4]   2> 123920 INFO  (TEST-TriggerIntegrationTest.testListeners-seed#[C276E306D93593F5]) [    ] o.a.s.s.SolrDispatchFilter  ___      _       Welcome to Apache Solr? version 7.3.0
   [junit4]   2> 123920 INFO  (TEST-TriggerIntegrationTest.testListeners-seed#[C276E306D93593F5]) [    ] o.a.s.s.SolrDispatchFilter / __| ___| |_ _   Starting in cloud mode on port null
   [junit4]   2> 123920 INFO  (TEST-TriggerIntegrationTest.testListeners-seed#[C276E306D93593F5]) [    ] o.a.s.s.SolrDispatchFilter \__ \/ _ \ | '_|  Install dir: null
   [junit4]   2> 123920 INFO  (TEST-TriggerIntegrationTest.testListeners-seed#[C276E306D93593F5]) [    ] o.a.s.s.SolrDispatchFilter |___/\___/_|_|    Start time: 2018-01-22T01:54:16.361195Z
   [junit4]   2> 123924 INFO  (zkConnectionManagerCallback-235-thread-1) [    ] o.a.s.c.c.ConnectionManager zkClient has connected
   [junit4]   2> 123925 INFO  (TEST-TriggerIntegrationTest.testListeners-seed#[C276E306D93593F5]) [    ] o.a.s.s.SolrDispatchFilter solr.xml found in ZooKeeper. Loading...
   [junit4]   2> 123932 INFO  (TEST-TriggerIntegrationTest.testListeners-seed#[C276E306D93593F5]) [    ] o.a.s.c.ZkContainer Zookeeper client=127.0.0.1:63310/solr
   [junit4]   2> 123937 INFO  (zkConnectionManagerCallback-239-thread-1) [    ] o.a.s.c.c.ConnectionManager zkClient has connected
   [junit4]   2> 123941 INFO  (zkConnectionManagerCallback-241-thread-1-processing-n:127.0.0.1:63416_solr) [n:127.0.0.1:63416_solr    ] o.a.s.c.c.ConnectionManager zkClient has connected
   [junit4]   2> 123953 INFO  (TEST-TriggerIntegrationTest.testListeners-seed#[C276E306D93593F5]) [n:127.0.0.1:63416_solr    ] o.a.s.c.c.ZkStateReader Updated live nodes from ZooKeeper... (0) -> (4)
   [junit4]   2> 123956 INFO  (TEST-TriggerIntegrationTest.testListeners-seed#[C276E306D93593F5]) [n:127.0.0.1:63416_solr    ] o.a.s.c.Overseer Overseer (id=null) closing
   [junit4]   2> 123960 INFO  (TEST-TriggerIntegrationTest.testListeners-seed#[C276E306D93593F5]) [n:127.0.0.1:63416_solr    ] o.a.s.c.ZkController Register node as live in ZooKeeper:/live_nodes/127.0.0.1:63416_solr
   [junit4]   2> 123962 INFO  (zkCallback-202-thread-1) [    ] o.a.s.c.c.ZkStateReader Updated live nodes from ZooKeeper... (4) -> (5)
   [junit4]   2> 123962 INFO  (zkCallback-190-thread-1-processing-n:127.0.0.1:63313_solr) [n:127.0.0.1:63313_solr    ] o.a.s.c.c.ZkStateReader Updated live nodes from ZooKeeper... (4) -> (5)
   [junit4]   2> 123962 INFO  (zkCallback-210-thread-1-processing-n:127.0.0.1:63369_solr) [n:127.0.0.1:63369_solr    ] o.a.s.c.c.ZkStateReader Updated live nodes from ZooKeeper... (4) -> (5)
   [junit4]   2> 123962 INFO  (zkCallback-220-thread-1-processing-n:127.0.0.1:63373_solr) [n:127.0.0.1:63373_solr    ] o.a.s.c.c.ZkStateReader Updated live nodes from ZooKeeper... (4) -> (5)
   [junit4]   2> 123962 INFO  (zkCallback-230-thread-1-processing-n:127.0.0.1:63401_solr) [n:127.0.0.1:63401_solr    ] o.a.s.c.c.ZkStateReader Updated live nodes from ZooKeeper... (4) -> (5)
   [junit4]   2> 123963 INFO  (zkCallback-240-thread-1-processing-n:127.0.0.1:63416_solr) [n:127.0.0.1:63416_solr    ] o.a.s.c.c.ZkStateReader Updated live nodes from ZooKeeper... (4) -> (5)
   [junit4]   2> 123994 INFO  (TEST-TriggerIntegrationTest.testListeners-seed#[C276E306D93593F5]) [n:127.0.0.1:63416_solr    ] o.a.s.m.r.SolrJmxReporter JMX monitoring for 'solr_63416.solr.node' (registry 'solr.node') enabled at server: com.sun.jmx.mbeanserver.JmxMBeanServer@3aeddcd
   [junit4]   2> 124003 INFO  (TEST-TriggerIntegrationTest.testListeners-seed#[C276E306D93593F5]) [n:127.0.0.1:63416_solr    ] o.a.s.m.r.SolrJmxReporter JMX monitoring for 'solr_63416.solr.jvm' (registry 'solr.jvm') enabled at server: com.sun.jmx.mbeanserver.JmxMBeanServer@3aeddcd
   [junit4]   2> 124004 INFO  (TEST-TriggerIntegrationTest.testListeners-seed#[C276E306D93593F5]) [n:127.0.0.1:63416_solr    ] o.a.s.m.r.SolrJmxReporter JMX monitoring for 'solr_63416.solr.jetty' (registry 'solr.jetty') enabled at server: com.sun.jmx.mbeanserver.JmxMBeanServer@3aeddcd
   [junit4]   2> 124005 INFO  (TEST-TriggerIntegrationTest.testListeners-seed#[C276E306D93593F5]) [n:127.0.0.1:63416_solr    ] o.a.s.c.CorePropertiesLocator Found 0 core definitions underneath /Users/jenkins/workspace/Lucene-Solr-7.x-MacOSX/solr/build/solr-core/test/J1/temp/solr.cloud.autoscaling.TriggerIntegrationTest_C276E306D93593F5-001/tempDir-001/node6/.
   [junit4]   2> 124926 DEBUG (ScheduledTrigger-634-thread-4) [n:127.0.0.1:63313_solr    ] o.a.s.c.a.NodeAddedTrigger Running NodeAddedTrigger node_added_trigger
   [junit4]   2> 124926 DEBUG (ScheduledTrigger-634-thread-4) [n:127.0.0.1:63313_solr    ] o.a.s.c.a.NodeAddedTrigger Found livenodes: 5
   [junit4]   2> 124926 DEBUG (ScheduledTrigger-634-thread-4) [n:127.0.0.1:63313_solr    ] o.a.s.c.a.NodeAddedTrigger Tracking new node: 127.0.0.1:63416_solr at time 287798430668993
   [junit4]   2> 125938 DEBUG (ScheduledTrigger-634-thread-4) [n:127.0.0.1:63313_solr    ] o.a.s.c.a.NodeAddedTrigger Running NodeAddedTrigger node_added_trigger
   [junit4]   2> 125939 DEBUG (ScheduledTrigger-634-thread-4) [n:127.0.0.1:63313_solr    ] o.a.s.c.a.NodeAddedTrigger Found livenodes: 5
   [junit4]   2> 126944 DEBUG (ScheduledTrigger-634-thread-4) [n:127.0.0.1:63313_solr    ] o.a.s.c.a.NodeAddedTrigger Running NodeAddedTrigger node_added_trigger
   [junit4]   2> 126944 DEBUG (ScheduledTrigger-634-thread-4) [n:127.0.0.1:63313_solr    ] o.a.s.c.a.NodeAddedTrigger Found livenodes: 5
   [junit4]   2> 126944 DEBUG (ScheduledTrigger-634-thread-4) [n:127.0.0.1:63313_solr    ] o.a.s.c.a.NodeAddedTrigger NodeAddedTrigger node_added_trigger firing registered processor for nodes: [127.0.0.1:63416_solr] added at times [287798430668993], now=287800449099475
   [junit4]   2> 126944 DEBUG (ScheduledTrigger-634-thread-4) [n:127.0.0.1:63313_solr    ] o.a.s.c.a.ScheduledTriggers ++++++++ Cooldown inactive - processing event: {
   [junit4]   2>   "id":"105c04b3a18c1T96gddw6kfhaajdgjs3u6dhmpb",
   [junit4]   2>   "source":"node_added_trigger",
   [junit4]   2>   "eventTime":287798430668993,
   [junit4]   2>   "eventType":"NODEADDED",
   [junit4]   2>   "properties":{
   [junit4]   2>     "eventTimes":[287798430668993],
   [junit4]   2>     "nodeNames":["127.0.0.1:63416_solr"]}}
   [junit4]   2> 126945 DEBUG (AutoscalingActionExecutor-635-thread-1-processing-n:127.0.0.1:63313_solr) [n:127.0.0.1:63313_solr    ] o.a.s.c.a.ScheduledTriggers -- processing actions for {
   [junit4]   2>   "id":"105c04b3a18c1T96gddw6kfhaajdgjs3u6dhmpb",
   [junit4]   2>   "source":"node_added_trigger",
   [junit4]   2>   "eventTime":287798430668993,
   [junit4]   2>   "eventType":"NODEADDED",
   [junit4]   2>   "properties":{
   [junit4]   2>     "eventTimes":[287798430668993],
   [junit4]   2>     "_enqueue_time_":287800449228030,
   [junit4]   2>     "nodeNames":["127.0.0.1:63416_solr"]}}
   [junit4]   2> 126946 WARN  (AutoscalingActionExecutor-635-thread-1-processing-n:127.0.0.1:63313_solr) [n:127.0.0.1:63313_solr    ] o.a.s.c.a.ScheduledTriggers Exception executing actions
   [junit4]   2> java.lang.Exception: Error executing action: test1 for trigger event: {
   [junit4]   2>   "id":"105c04b3a18c1T96gddw6kfhaajdgjs3u6dhmpb",
   [junit4]   2>   "source":"node_added_trigger",
   [junit4]   2>   "eventTime":287798430668993,
   [junit4]   2>   "eventType":"NODEADDED",
   [junit4]   2>   "properties":{
   [junit4]   2>     "eventTimes":[287798430668993],
   [junit4]   2>     "_enqueue_time_":287800449228030,
   [junit4]   2>     "nodeNames":["127.0.0.1:63416_solr"]}}
   [junit4]   2> 	at org.apache.solr.cloud.autoscaling.ScheduledTriggers.lambda$add$3(ScheduledTriggers.java:299)
   [junit4]   2> 	at java.base/java.util.concurrent.Executors$RunnableAdapter.call(Executors.java:514)
   [junit4]   2> 	at java.base/java.util.concurrent.FutureTask.run(FutureTask.java:264)
   [junit4]   2> 	at org.apache.solr.common.util.ExecutorUtil$MDCAwareThreadPoolExecutor.lambda$execute$0(ExecutorUtil.java:188)
   [junit4]   2> 	at java.base/java.util.concurrent.ThreadPoolExecutor.runWorker(ThreadPoolExecutor.java:1167)
   [junit4]   2> 	at java.base/java.util.concurrent.ThreadPoolExecutor$Worker.run(ThreadPoolExecutor.java:641)
   [junit4]   2> 	at java.base/java.lang.Thread.run(Thread.java:844)
   [junit4]   2> Caused by: java.lang.RuntimeException: failure
   [junit4]   2> 	at org.apache.solr.cloud.autoscaling.TriggerIntegrationTest$TestDummyAction.process(TriggerIntegrationTest.java:987)
   [junit4]   2> 	at org.apache.solr.cloud.autoscaling.ScheduledTriggers.lambda$add$3(ScheduledTriggers.java:296)
   [junit4]   2> 	... 6 more
   [junit4]   2> 126946 DEBUG (AutoscalingActionExecutor-635-thread-1-processing-n:127.0.0.1:63313_solr) [n:127.0.0.1:63313_solr    ] o.a.s.c.a.ScheduledTriggers -- processing took 0 ms for event id=105c04b3a18c1T96gddw6kfhaajdgjs3u6dhmpb
   [junit4]   2> 127954 DEBUG (ScheduledTrigger-634-thread-4) [n:127.0.0.1:63313_solr    ] o.a.s.c.a.NodeAddedTrigger Running NodeAddedTrigger node_added_trigger
   [junit4]   2> 127955 DEBUG (ScheduledTrigger-634-thread-4) [n:127.0.0.1:63313_solr    ] o.a.s.c.a.NodeAddedTrigger Found livenodes: 5
   [junit4]   2> 128953 INFO  (TEST-TriggerIntegrationTest.testListeners-seed#[C276E306D93593F5]) [    ] o.a.s.SolrTestCaseJ4 ###Ending testListeners
   [junit4]   2> 128957 DEBUG (ScheduledTrigger-634-thread-4) [n:127.0.0.1:63313_solr    ] o.a.s.c.a.NodeAddedTrigger Running NodeAddedTrigger node_added_trigger
   [junit4]   2> 128957 DEBUG (ScheduledTrigger-634-thread-4) [n:127.0.0.1:63313_solr    ] o.a.s.c.a.NodeAddedTrigger Found livenodes: 5
   [junit4]   2> 128976 INFO  (TEST-TriggerIntegrationTest.testCooldown-seed#[C276E306D93593F5]) [    ] o.a.s.SolrTestCaseJ4 ###Starting testCooldown
   [junit4]   2> 128977 INFO  (TEST-TriggerIntegrationTest.testCooldown-seed#[C276E306D93593F5]) [    ] o.a.s.c.a.TriggerIntegrationTest /autoscaling.json reset, new znode version 10
   [junit4]   2> 128977 DEBUG (zkCallback-190-thread-1-processing-n:127.0.0.1:63313_solr) [n:127.0.0.1:63313_solr    ] o.a.s.c.a.OverseerTriggerThread Refreshing /autoscaling.json with znode version 10
   [junit4]   2> 128977 DEBUG (OverseerAutoScalingTriggerThread-99390980233494533-127.0.0.1:63313_solr-n_0000000001) [n:127.0.0.1:63313_solr    ] o.a.s.c.a.OverseerTriggerThread Processed trigger updates upto znodeVersion 10
   [junit4]   2> 128979 DEBUG (OverseerAutoScalingTriggerThread-99390980233494533-127.0.0.1:63313_solr-n_0000000001) [n:127.0.0.1:63313_solr    ] o.a.s.c.a.OverseerTriggerThread -- clean old nodeLost markers
   [junit4]   2> 128980 DEBUG (OverseerAutoScalingTriggerThread-99390980233494533-127.0.0.1:63313_solr-n_0000000001) [n:127.0.0.1:63313_solr    ] o.a.s.c.a.OverseerTriggerThread -- clean old nodeAdded markers
   [junit4]   2> 128980 DEBUG (OverseerAutoScalingTriggerThread-99390980233494533-127.0.0.1:63313_solr-n_0000000001) [n:127.0.0.1:63313_solr    ] o.a.s.c.a.OverseerTriggerThread Current znodeVersion 10, lastZnodeVersion 10
   [junit4]   2> 128987 INFO  (qtp1618087901-1161) [n:127.0.0.1:63313_solr    ] o.a.s.s.HttpSolrCall [admin] webapp=null path=/admin/metrics params={prefix=CONTAINER.fs.usableSpace,CORE.coreName&wt=javabin&version=2&group=solr.node,solr.core} status=0 QTime=0
   [junit4]   2> 128990 INFO  (qtp807813987-1230) [n:127.0.0.1:63369_solr    ] o.a.s.s.HttpSolrCall [admin] webapp=null path=/admin/metrics params={prefix=CONTAINER.fs.usableSpace,CORE.coreName&wt=javabin&version=2&group=solr.node,solr.core} status=0 QTime=0
   [junit4]   2> 128992 INFO  (qtp548655871-1256) [n:127.0.0.1:63373_solr    ] o.a.s.s.HttpSolrCall [admin] webapp=null path=/admin/metrics params={prefix=CONTAINER.fs.usableSpace,CORE.coreName&wt=javabin&version=2&group=solr.node,solr.core} status=0 QTime=0
   [junit4]   2> 128994 INFO  (qtp253179940-1287) [n:127.0.0.1:63401_solr    ] o.a.s.s.HttpSolrCall [admin] webapp=null path=/admin/metrics params={prefix=CONTAINER.fs.usableSpace,CORE.coreName&wt=javabin&version=2&group=solr.node,solr.core} status=0 QTime=0
   [junit4]   2> 128999 INFO  (qtp496136829-1311) [n:127.0.0.1:63416_solr    ] o.a.s.s.HttpSolrCall [admin] webapp=null path=/admin/metrics params={prefix=CONTAINER.fs.usableSpace,CORE.coreName&wt=javabin&version=2&group=solr.node,solr.core} status=0 QTime=1
   [junit4]   2> 128999 DEBUG (qtp1618087901-1166) [n:127.0.0.1:63313_solr    ] o.a.s.c.a.AutoScalingHandler Verified autoscaling configuration
   [junit4]   2> 129001 INFO  (qtp1618087901-1166) [n:127.0.0.1:63313_solr    ] o.a.s.s.HttpSolrCall [admin] webapp=null path=/cluster/autoscaling params={wt=javabin&version=2} status=0 QTime=17
   [junit4]   2> 129003 DEBUG (zkCallback-190-thread-1-processing-n:127.0.0.1:63313_solr) [n:127.0.0.1:63313_solr    ] o.a.s.c.a.OverseerTriggerThread Refreshing /autoscaling.json with znode version 11
   [junit4]   2> 129005 DEBUG (zkCallback-190-thread-1-processing-n:127.0.0.1:63313_solr) [n:127.0.0.1:63313_solr    ] o.a.s.c.a.NodeAddedTrigger Initia

[...truncated too long message...]

lica_n5] o.a.s.m.SolrMetricManager Closing metric reporters for registry=solr.collection.testMetricTrigger.shard1.leader, tag=1703961814
   [junit4]   2> 224381 INFO  (jetty-closer-175-thread-4) [    ] o.e.j.s.h.ContextHandler Stopped o.e.j.s.ServletContextHandler@6209d65d{/solr,null,UNAVAILABLE}
   [junit4]   2> 224382 INFO  (jetty-closer-175-thread-4) [    ] o.e.j.s.session Stopped scavenging
   [junit4]   2> 254374 WARN  (jetty-closer-175-thread-10) [    ] o.e.j.u.t.QueuedThreadPool QueuedThreadPool@qtp56261047{STOPPING,8<=8<=10000,i=0,q=1} Couldn't stop Thread[qtp56261047-1737,5,TGRP-TriggerIntegrationTest]
   [junit4]   2> 254374 ERROR (SUITE-TriggerIntegrationTest-seed#[C276E306D93593F5]-worker) [    ] o.a.z.s.ZooKeeperServer ZKShutdownHandler is not registered, so ZooKeeper server won't take any action on ERROR or SHUTDOWN server state changes
   [junit4]   2> 254375 INFO  (SUITE-TriggerIntegrationTest-seed#[C276E306D93593F5]-worker) [    ] o.a.s.c.ZkTestServer connecting to 127.0.0.1:63310 63310
   [junit4]   2> 254416 INFO  (Thread-313) [    ] o.a.s.c.ZkTestServer connecting to 127.0.0.1:63310 63310
   [junit4]   2> 254574 WARN  (Thread-313) [    ] o.a.s.c.ZkTestServer Watch limit violations: 
   [junit4]   2> Maximum concurrent create/delete watches above limit:
   [junit4]   2> 
   [junit4]   2> 	19	/solr/aliases.json
   [junit4]   2> 	19	/solr/clusterprops.json
   [junit4]   2> 	18	/solr/security.json
   [junit4]   2> 	3	/solr/configs/conf
   [junit4]   2> 
   [junit4]   2> Maximum concurrent data watches above limit:
   [junit4]   2> 
   [junit4]   2> 	23	/solr/collections/testMetricTrigger/state.json
   [junit4]   2> 	19	/solr/clusterstate.json
   [junit4]   2> 	6	/solr/autoscaling.json
   [junit4]   2> 	3	/solr/overseer_elect/election/99390980233494563-127.0.0.1:63499_solr-n_0000000010
   [junit4]   2> 	3	/solr/overseer_elect/election/99390980233494566-127.0.0.1:63518_solr-n_0000000011
   [junit4]   2> 	2	/solr/overseer_elect/election/99390980233494576-127.0.0.1:63634_solr-n_0000000014
   [junit4]   2> 	2	/solr/overseer_elect/election/99390980233494579-127.0.0.1:63731_solr-n_0000000015
   [junit4]   2> 	2	/solr/overseer_elect/election/99390980233494557-127.0.0.1:63465_solr-n_0000000008
   [junit4]   2> 
   [junit4]   2> Maximum concurrent children watches above limit:
   [junit4]   2> 
   [junit4]   2> 	19	/solr/live_nodes
   [junit4]   2> 	19	/solr/collections
   [junit4]   2> 	6	/solr/overseer/queue-work
   [junit4]   2> 	6	/solr/autoscaling/events/.auto_add_replicas
   [junit4]   2> 	6	/solr/overseer/queue
   [junit4]   2> 	6	/solr/overseer/collection-queue-work
   [junit4]   2> 	3	/solr/autoscaling/events/node_added_trigger
   [junit4]   2> 	2	/solr/autoscaling/events/node_lost_trigger
   [junit4]   2> 
   [junit4]   2> 254575 INFO  (SUITE-TriggerIntegrationTest-seed#[C276E306D93593F5]-worker) [    ] o.a.s.SolrTestCaseJ4 ------------------------------------------------------- Done waiting for tracked resources to be released
   [junit4]   2> Jan 22, 2018 1:56:27 AM com.carrotsearch.randomizedtesting.ThreadLeakControl checkThreadLeaks
   [junit4]   2> WARNING: Will linger awaiting termination of 1 leaked thread(s).
   [junit4]   2> Jan 22, 2018 1:56:47 AM com.carrotsearch.randomizedtesting.ThreadLeakControl checkThreadLeaks
   [junit4]   2> SEVERE: 1 thread leaked from SUITE scope at org.apache.solr.cloud.autoscaling.TriggerIntegrationTest: 
   [junit4]   2>    1) Thread[id=1737, name=qtp56261047-1737, state=TIMED_WAITING, group=TGRP-TriggerIntegrationTest]
   [junit4]   2>         at java.base@9/jdk.internal.misc.Unsafe.park(Native Method)
   [junit4]   2>         at java.base@9/java.util.concurrent.locks.LockSupport.parkNanos(LockSupport.java:234)
   [junit4]   2>         at java.base@9/java.util.concurrent.locks.AbstractQueuedSynchronizer$ConditionObject.await(AbstractQueuedSynchronizer.java:2192)
   [junit4]   2>         at app//org.eclipse.jetty.util.thread.ReservedThreadExecutor$ReservedThread.reservedWait(ReservedThreadExecutor.java:308)
   [junit4]   2>         at app//org.eclipse.jetty.util.thread.ReservedThreadExecutor$ReservedThread.run(ReservedThreadExecutor.java:373)
   [junit4]   2>         at app//org.eclipse.jetty.util.thread.QueuedThreadPool.runJob(QueuedThreadPool.java:708)
   [junit4]   2>         at app//org.eclipse.jetty.util.thread.QueuedThreadPool$2.run(QueuedThreadPool.java:626)
   [junit4]   2>         at java.base@9/java.lang.Thread.run(Thread.java:844)
   [junit4]   2> Jan 22, 2018 1:56:47 AM com.carrotsearch.randomizedtesting.ThreadLeakControl tryToInterruptAll
   [junit4]   2> INFO: Starting to interrupt leaked threads:
   [junit4]   2>    1) Thread[id=1737, name=qtp56261047-1737, state=TIMED_WAITING, group=TGRP-TriggerIntegrationTest]
   [junit4]   2> Jan 22, 2018 1:56:50 AM com.carrotsearch.randomizedtesting.ThreadLeakControl tryToInterruptAll
   [junit4]   2> SEVERE: There are still zombie threads that couldn't be terminated:
   [junit4]   2>    1) Thread[id=1737, name=qtp56261047-1737, state=TIMED_WAITING, group=TGRP-TriggerIntegrationTest]
   [junit4]   2>         at java.base@9/jdk.internal.misc.Unsafe.park(Native Method)
   [junit4]   2>         at java.base@9/java.util.concurrent.locks.LockSupport.parkNanos(LockSupport.java:234)
   [junit4]   2>         at java.base@9/java.util.concurrent.locks.AbstractQueuedSynchronizer$ConditionObject.await(AbstractQueuedSynchronizer.java:2192)
   [junit4]   2>         at app//org.eclipse.jetty.util.thread.ReservedThreadExecutor$ReservedThread.reservedWait(ReservedThreadExecutor.java:308)
   [junit4]   2>         at app//org.eclipse.jetty.util.thread.ReservedThreadExecutor$ReservedThread.run(ReservedThreadExecutor.java:373)
   [junit4]   2>         at app//org.eclipse.jetty.util.thread.QueuedThreadPool.runJob(QueuedThreadPool.java:708)
   [junit4]   2>         at app//org.eclipse.jetty.util.thread.QueuedThreadPool$2.run(QueuedThreadPool.java:626)
   [junit4]   2>         at java.base@9/java.lang.Thread.run(Thread.java:844)
   [junit4]   2> NOTE: test params are: codec=FastCompressingStoredFields(storedFieldsFormat=CompressingStoredFieldsFormat(compressionMode=FAST, chunkSize=3478, maxDocsPerChunk=933, blockSize=949), termVectorsFormat=CompressingTermVectorsFormat(compressionMode=FAST, chunkSize=3478, blockSize=949)), sim=RandomSimilarity(queryNorm=false): {}, locale=sr-ME, timezone=Europe/Mariehamn
   [junit4]   2> NOTE: Mac OS X 10.11.6 x86_64/Oracle Corporation 9 (64-bit)/cpus=3,threads=2,free=35418536,total=210956288
   [junit4]   2> NOTE: All tests run in this JVM: [TestLegacyNumericUtils, TestSimpleTrackingShardHandler, TestBulkSchemaConcurrent, TestAtomicUpdateErrorCases, TestPHPSerializedResponseWriter, DistributedFacetSimpleRefinementLongTailTest, TestComputePlanAction, DistributedFacetExistsSmallTest, TestConfigSetImmutable, TestConfig, TestCrossCoreJoin, TestLocalFSCloudBackupRestore, HdfsRecoverLeaseTest, TestXmlQParser, TestFastWriter, TriggerIntegrationTest]
   [junit4]   2> NOTE: reproduce with: ant test  -Dtestcase=TriggerIntegrationTest -Dtests.seed=C276E306D93593F5 -Dtests.slow=true -Dtests.locale=sr-ME -Dtests.timezone=Europe/Mariehamn -Dtests.asserts=true -Dtests.file.encoding=ISO-8859-1
   [junit4] ERROR   0.00s J1 | TriggerIntegrationTest (suite) <<<
   [junit4]    > Throwable #1: com.carrotsearch.randomizedtesting.ThreadLeakError: 1 thread leaked from SUITE scope at org.apache.solr.cloud.autoscaling.TriggerIntegrationTest: 
   [junit4]    >    1) Thread[id=1737, name=qtp56261047-1737, state=TIMED_WAITING, group=TGRP-TriggerIntegrationTest]
   [junit4]    >         at java.base@9/jdk.internal.misc.Unsafe.park(Native Method)
   [junit4]    >         at java.base@9/java.util.concurrent.locks.LockSupport.parkNanos(LockSupport.java:234)
   [junit4]    >         at java.base@9/java.util.concurrent.locks.AbstractQueuedSynchronizer$ConditionObject.await(AbstractQueuedSynchronizer.java:2192)
   [junit4]    >         at app//org.eclipse.jetty.util.thread.ReservedThreadExecutor$ReservedThread.reservedWait(ReservedThreadExecutor.java:308)
   [junit4]    >         at app//org.eclipse.jetty.util.thread.ReservedThreadExecutor$ReservedThread.run(ReservedThreadExecutor.java:373)
   [junit4]    >         at app//org.eclipse.jetty.util.thread.QueuedThreadPool.runJob(QueuedThreadPool.java:708)
   [junit4]    >         at app//org.eclipse.jetty.util.thread.QueuedThreadPool$2.run(QueuedThreadPool.java:626)
   [junit4]    >         at java.base@9/java.lang.Thread.run(Thread.java:844)
   [junit4]    > 	at __randomizedtesting.SeedInfo.seed([C276E306D93593F5]:0)Throwable #2: com.carrotsearch.randomizedtesting.ThreadLeakError: There are still zombie threads that couldn't be terminated:
   [junit4]    >    1) Thread[id=1737, name=qtp56261047-1737, state=TIMED_WAITING, group=TGRP-TriggerIntegrationTest]
   [junit4]    >         at java.base@9/jdk.internal.misc.Unsafe.park(Native Method)
   [junit4]    >         at java.base@9/java.util.concurrent.locks.LockSupport.parkNanos(LockSupport.java:234)
   [junit4]    >         at java.base@9/java.util.concurrent.locks.AbstractQueuedSynchronizer$ConditionObject.await(AbstractQueuedSynchronizer.java:2192)
   [junit4]    >         at app//org.eclipse.jetty.util.thread.ReservedThreadExecutor$ReservedThread.reservedWait(ReservedThreadExecutor.java:308)
   [junit4]    >         at app//org.eclipse.jetty.util.thread.ReservedThreadExecutor$ReservedThread.run(ReservedThreadExecutor.java:373)
   [junit4]    >         at app//org.eclipse.jetty.util.thread.QueuedThreadPool.runJob(QueuedThreadPool.java:708)
   [junit4]    >         at app//org.eclipse.jetty.util.thread.QueuedThreadPool$2.run(QueuedThreadPool.java:626)
   [junit4]    >         at java.base@9/java.lang.Thread.run(Thread.java:844)
   [junit4]    > 	at __randomizedtesting.SeedInfo.seed([C276E306D93593F5]:0)
   [junit4] Completed [49/767 (1!)] on J1 in 208.21s, 14 tests, 2 errors, 1 skipped <<< FAILURES!

[...truncated 43151 lines...]