You are viewing a plain text version of this content. The canonical link for it is here.
Posted to dev@kafka.apache.org by Apache Jenkins Server <je...@builds.apache.org> on 2023/08/13 17:14:38 UTC

Jenkins build is still unstable: Kafka » Kafka Branch Builder » trunk #2097

See <https://ci-builds.apache.org/job/Kafka/job/kafka/job/trunk/2097/display/redirect>


Jenkins build is still unstable: Kafka » Kafka Branch Builder » trunk #2109

Posted by Apache Jenkins Server <je...@builds.apache.org>.
See <https://ci-builds.apache.org/job/Kafka/job/kafka/job/trunk/2109/display/redirect>


Jenkins build is still unstable: Kafka » Kafka Branch Builder » trunk #2108

Posted by Apache Jenkins Server <je...@builds.apache.org>.
See <https://ci-builds.apache.org/job/Kafka/job/kafka/job/trunk/2108/display/redirect>


Jenkins build is unstable: Kafka » Kafka Branch Builder » trunk #2107

Posted by Apache Jenkins Server <je...@builds.apache.org>.
See <https://ci-builds.apache.org/job/Kafka/job/kafka/job/trunk/2107/display/redirect>


Build failed in Jenkins: Kafka » Kafka Branch Builder » trunk #2106

Posted by Apache Jenkins Server <je...@builds.apache.org>.
See <https://ci-builds.apache.org/job/Kafka/job/kafka/job/trunk/2106/display/redirect>

Changes:


------------------------------------------
[...truncated 422811 lines...]

Gradle Test Run :streams:test > Gradle Test Executor 85 > StoreQueryIntegrationTest > shouldQuerySpecificStalePartitionStoresMultiStreamThreads() PASSED

Gradle Test Run :streams:test > Gradle Test Executor 85 > StoreQueryIntegrationTest > shouldQuerySpecificStalePartitionStores() STARTED

Gradle Test Run :streams:test > Gradle Test Executor 85 > StoreQueryIntegrationTest > shouldQuerySpecificStalePartitionStores() PASSED

Gradle Test Run :streams:test > Gradle Test Executor 85 > StoreQueryIntegrationTest > shouldQueryOnlyActivePartitionStoresByDefault() STARTED

Gradle Test Run :streams:test > Gradle Test Executor 85 > StoreQueryIntegrationTest > shouldQueryOnlyActivePartitionStoresByDefault() PASSED

Gradle Test Run :streams:test > Gradle Test Executor 85 > StoreQueryIntegrationTest > shouldQueryStoresAfterAddingAndRemovingStreamThread() STARTED

Gradle Test Run :streams:test > Gradle Test Executor 85 > StoreQueryIntegrationTest > shouldQueryStoresAfterAddingAndRemovingStreamThread() PASSED

Gradle Test Run :streams:test > Gradle Test Executor 85 > StoreQueryIntegrationTest > shouldQuerySpecificStalePartitionStoresMultiStreamThreadsNamedTopology() STARTED

Gradle Test Run :streams:test > Gradle Test Executor 85 > StoreQueryIntegrationTest > shouldQuerySpecificStalePartitionStoresMultiStreamThreadsNamedTopology() PASSED

Gradle Test Run :streams:test > Gradle Test Executor 85 > ReadOnlyTaskTest > shouldThrowUnsupportedOperationExceptionForForbiddenMethods() STARTED

Gradle Test Run :streams:test > Gradle Test Executor 85 > ReadOnlyTaskTest > shouldThrowUnsupportedOperationExceptionForForbiddenMethods() PASSED

Gradle Test Run :streams:test > Gradle Test Executor 85 > ReadOnlyTaskTest > shouldDelegateChangelogPartitions() STARTED

Gradle Test Run :streams:test > Gradle Test Executor 85 > ReadOnlyTaskTest > shouldDelegateChangelogPartitions() PASSED

Gradle Test Run :streams:test > Gradle Test Executor 85 > ReadOnlyTaskTest > shouldDelegateState() STARTED

Gradle Test Run :streams:test > Gradle Test Executor 85 > ReadOnlyTaskTest > shouldDelegateState() PASSED

Gradle Test Run :streams:test > Gradle Test Executor 85 > ReadOnlyTaskTest > shouldDelegateIsActive() STARTED

Gradle Test Run :streams:test > Gradle Test Executor 85 > ReadOnlyTaskTest > shouldDelegateIsActive() PASSED

Gradle Test Run :streams:test > Gradle Test Executor 85 > ReadOnlyTaskTest > shouldDelegateId() STARTED

Gradle Test Run :streams:test > Gradle Test Executor 85 > ReadOnlyTaskTest > shouldDelegateId() PASSED

Gradle Test Run :streams:test > Gradle Test Executor 85 > ReadOnlyTaskTest > shouldDelegateInputPartitions() STARTED

Gradle Test Run :streams:test > Gradle Test Executor 85 > ReadOnlyTaskTest > shouldDelegateInputPartitions() PASSED

Gradle Test Run :streams:test > Gradle Test Executor 85 > ReadOnlyTaskTest > shouldDelegateCommitRequested() STARTED

Gradle Test Run :streams:test > Gradle Test Executor 85 > ReadOnlyTaskTest > shouldDelegateCommitRequested() PASSED

Gradle Test Run :streams:test > Gradle Test Executor 85 > ReadOnlyTaskTest > shouldDelegateNeedsInitializationOrRestoration() STARTED

Gradle Test Run :streams:test > Gradle Test Executor 85 > ReadOnlyTaskTest > shouldDelegateNeedsInitializationOrRestoration() PASSED

Gradle Test Run :streams:test > Gradle Test Executor 85 > TaskAndActionTest > shouldThrowIfAddTaskActionIsCreatedWithNullTask() STARTED

Gradle Test Run :streams:test > Gradle Test Executor 85 > TaskAndActionTest > shouldThrowIfAddTaskActionIsCreatedWithNullTask() PASSED

Gradle Test Run :streams:test > Gradle Test Executor 85 > TaskAndActionTest > shouldCreateAddTaskAction() STARTED

Gradle Test Run :streams:test > Gradle Test Executor 85 > TaskAndActionTest > shouldCreateAddTaskAction() PASSED

Gradle Test Run :streams:test > Gradle Test Executor 85 > TaskAndActionTest > shouldCreateRemoveTaskAction() STARTED

Gradle Test Run :streams:test > Gradle Test Executor 85 > TaskAndActionTest > shouldCreateRemoveTaskAction() PASSED

Gradle Test Run :streams:test > Gradle Test Executor 85 > TaskAndActionTest > shouldThrowIfRemoveTaskActionIsCreatedWithNullTaskId() STARTED

Gradle Test Run :streams:test > Gradle Test Executor 85 > TaskAndActionTest > shouldThrowIfRemoveTaskActionIsCreatedWithNullTaskId() PASSED

Gradle Test Run :streams:test > Gradle Test Executor 85 > TasksTest > onlyRemovePendingTaskToSuspendShouldRemoveTaskFromPendingUpdateActions() STARTED

Gradle Test Run :streams:test > Gradle Test Executor 85 > TasksTest > onlyRemovePendingTaskToSuspendShouldRemoveTaskFromPendingUpdateActions() PASSED

Gradle Test Run :streams:test > Gradle Test Executor 85 > TasksTest > shouldOnlyKeepLastUpdateAction() STARTED

Gradle Test Run :streams:test > Gradle Test Executor 85 > TasksTest > shouldOnlyKeepLastUpdateAction() PASSED

Gradle Test Run :streams:test > Gradle Test Executor 85 > TasksTest > shouldAddAndRemovePendingTaskToRecycle() STARTED

Gradle Test Run :streams:test > Gradle Test Executor 85 > TasksTest > shouldAddAndRemovePendingTaskToRecycle() PASSED

Gradle Test Run :streams:test > Gradle Test Executor 85 > TasksTest > onlyRemovePendingTaskToUpdateInputPartitionsShouldRemoveTaskFromPendingUpdateActions() STARTED

Gradle Test Run :streams:test > Gradle Test Executor 85 > TasksTest > onlyRemovePendingTaskToUpdateInputPartitionsShouldRemoveTaskFromPendingUpdateActions() PASSED

Gradle Test Run :streams:test > Gradle Test Executor 85 > TasksTest > shouldVerifyIfPendingTaskToRecycleExist() STARTED

Gradle Test Run :streams:test > Gradle Test Executor 85 > TasksTest > shouldVerifyIfPendingTaskToRecycleExist() PASSED

Gradle Test Run :streams:test > Gradle Test Executor 85 > TasksTest > shouldAddAndRemovePendingTaskToUpdateInputPartitions() STARTED

Gradle Test Run :streams:test > Gradle Test Executor 85 > TasksTest > shouldAddAndRemovePendingTaskToUpdateInputPartitions() PASSED

Gradle Test Run :streams:test > Gradle Test Executor 85 > TasksTest > onlyRemovePendingTaskToCloseDirtyShouldRemoveTaskFromPendingUpdateActions() STARTED

Gradle Test Run :streams:test > Gradle Test Executor 85 > TasksTest > onlyRemovePendingTaskToCloseDirtyShouldRemoveTaskFromPendingUpdateActions() PASSED

Gradle Test Run :streams:test > Gradle Test Executor 85 > TasksTest > shouldAddAndRemovePendingTaskToSuspend() STARTED

Gradle Test Run :streams:test > Gradle Test Executor 85 > TasksTest > shouldAddAndRemovePendingTaskToSuspend() PASSED

Gradle Test Run :streams:test > Gradle Test Executor 85 > TasksTest > onlyRemovePendingTaskToCloseCleanShouldRemoveTaskFromPendingUpdateActions() STARTED

Gradle Test Run :streams:test > Gradle Test Executor 85 > TasksTest > onlyRemovePendingTaskToCloseCleanShouldRemoveTaskFromPendingUpdateActions() PASSED

Gradle Test Run :streams:test > Gradle Test Executor 85 > TasksTest > shouldDrainPendingTasksToCreate() STARTED

Gradle Test Run :streams:test > Gradle Test Executor 85 > TasksTest > shouldDrainPendingTasksToCreate() PASSED

Gradle Test Run :streams:test > Gradle Test Executor 85 > TasksTest > onlyRemovePendingTaskToRecycleShouldRemoveTaskFromPendingUpdateActions() STARTED

Gradle Test Run :streams:test > Gradle Test Executor 85 > TasksTest > onlyRemovePendingTaskToRecycleShouldRemoveTaskFromPendingUpdateActions() PASSED

Gradle Test Run :streams:test > Gradle Test Executor 85 > TasksTest > shouldAddAndRemovePendingTaskToCloseClean() STARTED

Gradle Test Run :streams:test > Gradle Test Executor 85 > TasksTest > shouldAddAndRemovePendingTaskToCloseClean() PASSED

Gradle Test Run :streams:test > Gradle Test Executor 85 > TasksTest > shouldAddAndRemovePendingTaskToCloseDirty() STARTED

Gradle Test Run :streams:test > Gradle Test Executor 85 > TasksTest > shouldAddAndRemovePendingTaskToCloseDirty() PASSED

Gradle Test Run :streams:test > Gradle Test Executor 85 > TasksTest > shouldKeepAddedTasks() STARTED

Gradle Test Run :streams:test > Gradle Test Executor 85 > TasksTest > shouldKeepAddedTasks() PASSED

Gradle Test Run :streams:test > Gradle Test Executor 85 > DefaultTaskManagerTest > shouldAssignTasksThatCanBeSystemTimePunctuated() STARTED

Gradle Test Run :streams:test > Gradle Test Executor 85 > DefaultTaskManagerTest > shouldAssignTasksThatCanBeSystemTimePunctuated() PASSED

Gradle Test Run :streams:test > Gradle Test Executor 85 > DefaultTaskManagerTest > shouldNotUnassignNotOwnedTask() STARTED

Gradle Test Run :streams:test > Gradle Test Executor 85 > DefaultTaskManagerTest > shouldNotUnassignNotOwnedTask() PASSED

Gradle Test Run :streams:test > Gradle Test Executor 85 > DefaultTaskManagerTest > shouldNotSetUncaughtExceptionsTwice() STARTED

Gradle Test Run :streams:test > Gradle Test Executor 85 > DefaultTaskManagerTest > shouldNotSetUncaughtExceptionsTwice() PASSED

Gradle Test Run :streams:test > Gradle Test Executor 85 > DefaultTaskManagerTest > shouldNotAssignTasksForPunctuationIfPunctuationDisabled() STARTED

Gradle Test Run :streams:test > Gradle Test Executor 85 > DefaultTaskManagerTest > shouldNotAssignTasksForPunctuationIfPunctuationDisabled() PASSED

Gradle Test Run :streams:test > Gradle Test Executor 85 > DefaultTaskManagerTest > shouldAddTask() STARTED

Gradle Test Run :streams:test > Gradle Test Executor 85 > DefaultTaskManagerTest > shouldAddTask() PASSED

Gradle Test Run :streams:test > Gradle Test Executor 85 > DefaultTaskManagerTest > shouldNotAssignAnyLockedTask() STARTED

Gradle Test Run :streams:test > Gradle Test Executor 85 > DefaultTaskManagerTest > shouldNotAssignAnyLockedTask() PASSED

Gradle Test Run :streams:test > Gradle Test Executor 85 > DefaultTaskManagerTest > shouldRemoveTask() STARTED

Gradle Test Run :streams:test > Gradle Test Executor 85 > DefaultTaskManagerTest > shouldRemoveTask() PASSED

Gradle Test Run :streams:test > Gradle Test Executor 85 > DefaultTaskManagerTest > shouldNotRemoveAssignedTask() STARTED

Gradle Test Run :streams:test > Gradle Test Executor 85 > DefaultTaskManagerTest > shouldNotRemoveAssignedTask() PASSED

Gradle Test Run :streams:test > Gradle Test Executor 85 > DefaultTaskManagerTest > shouldAssignTaskThatCanBeProcessed() STARTED

Gradle Test Run :streams:test > Gradle Test Executor 85 > DefaultTaskManagerTest > shouldAssignTaskThatCanBeProcessed() PASSED

Gradle Test Run :streams:test > Gradle Test Executor 85 > DefaultTaskManagerTest > shouldNotRemoveUnlockedTask() STARTED

Gradle Test Run :streams:test > Gradle Test Executor 85 > DefaultTaskManagerTest > shouldNotRemoveUnlockedTask() PASSED

Gradle Test Run :streams:test > Gradle Test Executor 85 > DefaultTaskManagerTest > shouldReturnAndClearExceptionsOnDrainExceptions() STARTED

Gradle Test Run :streams:test > Gradle Test Executor 85 > DefaultTaskManagerTest > shouldReturnAndClearExceptionsOnDrainExceptions() PASSED

Gradle Test Run :streams:test > Gradle Test Executor 85 > DefaultTaskManagerTest > shouldUnassignTask() STARTED

Gradle Test Run :streams:test > Gradle Test Executor 85 > DefaultTaskManagerTest > shouldUnassignTask() PASSED

Gradle Test Run :streams:test > Gradle Test Executor 85 > DefaultTaskManagerTest > shouldNotAssignTasksForProcessingIfProcessingDisabled() STARTED

Gradle Test Run :streams:test > Gradle Test Executor 85 > DefaultTaskManagerTest > shouldNotAssignTasksForProcessingIfProcessingDisabled() PASSED

Gradle Test Run :streams:test > Gradle Test Executor 85 > DefaultTaskManagerTest > shouldNotSetUncaughtExceptionsForUnassignedTasks() STARTED

Gradle Test Run :streams:test > Gradle Test Executor 85 > DefaultTaskManagerTest > shouldNotSetUncaughtExceptionsForUnassignedTasks() PASSED

Gradle Test Run :streams:test > Gradle Test Executor 85 > DefaultTaskManagerTest > shouldNotAssignLockedTask() STARTED

Gradle Test Run :streams:test > Gradle Test Executor 85 > DefaultTaskManagerTest > shouldNotAssignLockedTask() PASSED

Gradle Test Run :streams:test > Gradle Test Executor 85 > DefaultTaskManagerTest > shouldUnassignLockingTask() STARTED

Gradle Test Run :streams:test > Gradle Test Executor 85 > DefaultTaskManagerTest > shouldUnassignLockingTask() PASSED

Gradle Test Run :streams:test > Gradle Test Executor 85 > DefaultTaskManagerTest > shouldAssignTasksThatCanBeStreamTimePunctuated() STARTED

Gradle Test Run :streams:test > Gradle Test Executor 85 > DefaultTaskManagerTest > shouldAssignTasksThatCanBeStreamTimePunctuated() PASSED
streams-3: SMOKE-TEST-CLIENT-CLOSED
streams-2: SMOKE-TEST-CLIENT-CLOSED
streams-0: SMOKE-TEST-CLIENT-CLOSED
streams-0: SMOKE-TEST-CLIENT-CLOSED
streams-1: SMOKE-TEST-CLIENT-CLOSED
streams-5: SMOKE-TEST-CLIENT-CLOSED
streams-3: SMOKE-TEST-CLIENT-CLOSED
streams-2: SMOKE-TEST-CLIENT-CLOSED
streams-1: SMOKE-TEST-CLIENT-CLOSED
streams-4: SMOKE-TEST-CLIENT-CLOSED
streams-4: SMOKE-TEST-CLIENT-CLOSED
streams-5: SMOKE-TEST-CLIENT-CLOSED

Deprecated Gradle features were used in this build, making it incompatible with Gradle 9.0.

You can use '--warning-mode all' to show the individual deprecation warnings and determine if they come from your own scripts or plugins.

For more on this, please refer to https://docs.gradle.org/8.2.1/userguide/command_line_interface.html#sec:command_line_warnings in the Gradle documentation.

BUILD SUCCESSFUL in 2h 45m 17s
291 actionable tasks: 107 executed, 184 up-to-date

Publishing build scan...
https://ge.apache.org/s/egxrxsvxip6a2


See the profiling report at: file:///home/jenkins/workspace/Kafka_kafka_trunk/build/reports/profile/profile-2023-08-16-01-47-48.html
A fine-grained performance profile is available: use the --scan option.
[Pipeline] junit
Recording test results
[Checks API] No suitable checks publisher found.
[Pipeline] echo
Skipping Kafka Streams archetype test for Java 20
[Pipeline] }
[Pipeline] // withEnv
[Pipeline] }
[Pipeline] // withEnv
[Pipeline] }
[Pipeline] // withEnv
[Pipeline] }
[Pipeline] // node
[Pipeline] }
[Pipeline] // timestamps
[Pipeline] }
[Pipeline] // timeout
[Pipeline] }
[Pipeline] // stage
[Pipeline] }
[Pipeline] // parallel
[Pipeline] }
[Pipeline] // stage
[Pipeline] stage
[Pipeline] { (Declarative: Post Actions)
[Pipeline] script
[Pipeline] {
[Pipeline] node
Running on builds57 in /home/jenkins/jenkins-agent/workspace/Kafka_kafka_trunk
[Pipeline] {
[Pipeline] step

Jenkins build is unstable: Kafka » Kafka Branch Builder » trunk #2105

Posted by Apache Jenkins Server <je...@builds.apache.org>.
See <https://ci-builds.apache.org/job/Kafka/job/kafka/job/trunk/2105/display/redirect>


Build failed in Jenkins: Kafka » Kafka Branch Builder » trunk #2104

Posted by Apache Jenkins Server <je...@builds.apache.org>.
See <https://ci-builds.apache.org/job/Kafka/job/kafka/job/trunk/2104/display/redirect>

Changes:


------------------------------------------
[...truncated 403991 lines...]

Gradle Test Run :streams:test > Gradle Test Executor 85 > StoreQueryIntegrationTest > shouldQueryOnlyActivePartitionStoresByDefault() PASSED

Gradle Test Run :streams:test > Gradle Test Executor 85 > StoreQueryIntegrationTest > shouldQueryStoresAfterAddingAndRemovingStreamThread() STARTED

Gradle Test Run :streams:test > Gradle Test Executor 85 > StoreQueryIntegrationTest > shouldQueryStoresAfterAddingAndRemovingStreamThread() PASSED

Gradle Test Run :streams:test > Gradle Test Executor 85 > StoreQueryIntegrationTest > shouldQuerySpecificStalePartitionStoresMultiStreamThreadsNamedTopology() STARTED

Gradle Test Run :streams:test > Gradle Test Executor 85 > StoreQueryIntegrationTest > shouldQuerySpecificStalePartitionStoresMultiStreamThreadsNamedTopology() PASSED

Gradle Test Run :streams:test > Gradle Test Executor 85 > ReadOnlyTaskTest > shouldThrowUnsupportedOperationExceptionForForbiddenMethods() STARTED

Gradle Test Run :streams:test > Gradle Test Executor 85 > ReadOnlyTaskTest > shouldThrowUnsupportedOperationExceptionForForbiddenMethods() PASSED

Gradle Test Run :streams:test > Gradle Test Executor 85 > ReadOnlyTaskTest > shouldDelegateChangelogPartitions() STARTED

Gradle Test Run :streams:test > Gradle Test Executor 85 > ReadOnlyTaskTest > shouldDelegateChangelogPartitions() PASSED

Gradle Test Run :streams:test > Gradle Test Executor 85 > ReadOnlyTaskTest > shouldDelegateState() STARTED

Gradle Test Run :streams:test > Gradle Test Executor 85 > ReadOnlyTaskTest > shouldDelegateState() PASSED

Gradle Test Run :streams:test > Gradle Test Executor 85 > ReadOnlyTaskTest > shouldDelegateIsActive() STARTED

Gradle Test Run :streams:test > Gradle Test Executor 85 > ReadOnlyTaskTest > shouldDelegateIsActive() PASSED

Gradle Test Run :streams:test > Gradle Test Executor 85 > ReadOnlyTaskTest > shouldDelegateId() STARTED

Gradle Test Run :streams:test > Gradle Test Executor 85 > ReadOnlyTaskTest > shouldDelegateId() PASSED

Gradle Test Run :streams:test > Gradle Test Executor 85 > ReadOnlyTaskTest > shouldDelegateInputPartitions() STARTED

Gradle Test Run :streams:test > Gradle Test Executor 85 > ReadOnlyTaskTest > shouldDelegateInputPartitions() PASSED

Gradle Test Run :streams:test > Gradle Test Executor 85 > ReadOnlyTaskTest > shouldDelegateCommitRequested() STARTED

Gradle Test Run :streams:test > Gradle Test Executor 85 > ReadOnlyTaskTest > shouldDelegateCommitRequested() PASSED

Gradle Test Run :streams:test > Gradle Test Executor 85 > ReadOnlyTaskTest > shouldDelegateNeedsInitializationOrRestoration() STARTED

Gradle Test Run :streams:test > Gradle Test Executor 85 > ReadOnlyTaskTest > shouldDelegateNeedsInitializationOrRestoration() PASSED

Gradle Test Run :streams:test > Gradle Test Executor 85 > TaskAndActionTest > shouldThrowIfAddTaskActionIsCreatedWithNullTask() STARTED

Gradle Test Run :streams:test > Gradle Test Executor 85 > TaskAndActionTest > shouldThrowIfAddTaskActionIsCreatedWithNullTask() PASSED

Gradle Test Run :streams:test > Gradle Test Executor 85 > TaskAndActionTest > shouldCreateAddTaskAction() STARTED

Gradle Test Run :streams:test > Gradle Test Executor 85 > TaskAndActionTest > shouldCreateAddTaskAction() PASSED

Gradle Test Run :streams:test > Gradle Test Executor 85 > TaskAndActionTest > shouldCreateRemoveTaskAction() STARTED

Gradle Test Run :streams:test > Gradle Test Executor 85 > TaskAndActionTest > shouldCreateRemoveTaskAction() PASSED

Gradle Test Run :streams:test > Gradle Test Executor 85 > TaskAndActionTest > shouldThrowIfRemoveTaskActionIsCreatedWithNullTaskId() STARTED

Gradle Test Run :streams:test > Gradle Test Executor 85 > TaskAndActionTest > shouldThrowIfRemoveTaskActionIsCreatedWithNullTaskId() PASSED

Gradle Test Run :streams:test > Gradle Test Executor 85 > TasksTest > onlyRemovePendingTaskToSuspendShouldRemoveTaskFromPendingUpdateActions() STARTED

Gradle Test Run :streams:test > Gradle Test Executor 85 > TasksTest > onlyRemovePendingTaskToSuspendShouldRemoveTaskFromPendingUpdateActions() PASSED

Gradle Test Run :streams:test > Gradle Test Executor 85 > TasksTest > shouldOnlyKeepLastUpdateAction() STARTED

Gradle Test Run :streams:test > Gradle Test Executor 85 > TasksTest > shouldOnlyKeepLastUpdateAction() PASSED

Gradle Test Run :streams:test > Gradle Test Executor 85 > TasksTest > shouldAddAndRemovePendingTaskToRecycle() STARTED

Gradle Test Run :streams:test > Gradle Test Executor 85 > TasksTest > shouldAddAndRemovePendingTaskToRecycle() PASSED

Gradle Test Run :streams:test > Gradle Test Executor 85 > TasksTest > onlyRemovePendingTaskToUpdateInputPartitionsShouldRemoveTaskFromPendingUpdateActions() STARTED

Gradle Test Run :streams:test > Gradle Test Executor 85 > TasksTest > onlyRemovePendingTaskToUpdateInputPartitionsShouldRemoveTaskFromPendingUpdateActions() PASSED

Gradle Test Run :streams:test > Gradle Test Executor 85 > TasksTest > shouldVerifyIfPendingTaskToRecycleExist() STARTED

Gradle Test Run :streams:test > Gradle Test Executor 85 > TasksTest > shouldVerifyIfPendingTaskToRecycleExist() PASSED

Gradle Test Run :streams:test > Gradle Test Executor 85 > TasksTest > shouldAddAndRemovePendingTaskToUpdateInputPartitions() STARTED

Gradle Test Run :streams:test > Gradle Test Executor 85 > TasksTest > shouldAddAndRemovePendingTaskToUpdateInputPartitions() PASSED

Gradle Test Run :streams:test > Gradle Test Executor 85 > TasksTest > onlyRemovePendingTaskToCloseDirtyShouldRemoveTaskFromPendingUpdateActions() STARTED

Gradle Test Run :streams:test > Gradle Test Executor 85 > TasksTest > onlyRemovePendingTaskToCloseDirtyShouldRemoveTaskFromPendingUpdateActions() PASSED

Gradle Test Run :streams:test > Gradle Test Executor 85 > TasksTest > shouldAddAndRemovePendingTaskToSuspend() STARTED

Gradle Test Run :streams:test > Gradle Test Executor 85 > TasksTest > shouldAddAndRemovePendingTaskToSuspend() PASSED

Gradle Test Run :streams:test > Gradle Test Executor 85 > TasksTest > onlyRemovePendingTaskToCloseCleanShouldRemoveTaskFromPendingUpdateActions() STARTED

Gradle Test Run :streams:test > Gradle Test Executor 85 > TasksTest > onlyRemovePendingTaskToCloseCleanShouldRemoveTaskFromPendingUpdateActions() PASSED

Gradle Test Run :streams:test > Gradle Test Executor 85 > TasksTest > shouldDrainPendingTasksToCreate() STARTED

Gradle Test Run :streams:test > Gradle Test Executor 85 > TasksTest > shouldDrainPendingTasksToCreate() PASSED

Gradle Test Run :streams:test > Gradle Test Executor 85 > TasksTest > onlyRemovePendingTaskToRecycleShouldRemoveTaskFromPendingUpdateActions() STARTED

Gradle Test Run :streams:test > Gradle Test Executor 85 > TasksTest > onlyRemovePendingTaskToRecycleShouldRemoveTaskFromPendingUpdateActions() PASSED

Gradle Test Run :streams:test > Gradle Test Executor 85 > TasksTest > shouldAddAndRemovePendingTaskToCloseClean() STARTED

Gradle Test Run :streams:test > Gradle Test Executor 85 > TasksTest > shouldAddAndRemovePendingTaskToCloseClean() PASSED

Gradle Test Run :streams:test > Gradle Test Executor 85 > TasksTest > shouldAddAndRemovePendingTaskToCloseDirty() STARTED

Gradle Test Run :streams:test > Gradle Test Executor 85 > TasksTest > shouldAddAndRemovePendingTaskToCloseDirty() PASSED

Gradle Test Run :streams:test > Gradle Test Executor 85 > TasksTest > shouldKeepAddedTasks() STARTED

Gradle Test Run :streams:test > Gradle Test Executor 85 > TasksTest > shouldKeepAddedTasks() PASSED

Gradle Test Run :streams:test > Gradle Test Executor 85 > DefaultTaskManagerTest > shouldAssignTasksThatCanBeSystemTimePunctuated() STARTED

Gradle Test Run :streams:test > Gradle Test Executor 85 > DefaultTaskManagerTest > shouldAssignTasksThatCanBeSystemTimePunctuated() PASSED

Gradle Test Run :streams:test > Gradle Test Executor 85 > DefaultTaskManagerTest > shouldNotUnassignNotOwnedTask() STARTED

Gradle Test Run :streams:test > Gradle Test Executor 85 > DefaultTaskManagerTest > shouldNotUnassignNotOwnedTask() PASSED

Gradle Test Run :streams:test > Gradle Test Executor 85 > DefaultTaskManagerTest > shouldNotSetUncaughtExceptionsTwice() STARTED

Gradle Test Run :streams:test > Gradle Test Executor 85 > DefaultTaskManagerTest > shouldNotSetUncaughtExceptionsTwice() PASSED

Gradle Test Run :streams:test > Gradle Test Executor 85 > DefaultTaskManagerTest > shouldNotAssignTasksForPunctuationIfPunctuationDisabled() STARTED

Gradle Test Run :streams:test > Gradle Test Executor 85 > DefaultTaskManagerTest > shouldNotAssignTasksForPunctuationIfPunctuationDisabled() PASSED

Gradle Test Run :streams:test > Gradle Test Executor 85 > DefaultTaskManagerTest > shouldAddTask() STARTED

Gradle Test Run :streams:test > Gradle Test Executor 85 > DefaultTaskManagerTest > shouldAddTask() PASSED

Gradle Test Run :streams:test > Gradle Test Executor 85 > DefaultTaskManagerTest > shouldNotAssignAnyLockedTask() STARTED

Gradle Test Run :streams:test > Gradle Test Executor 85 > DefaultTaskManagerTest > shouldNotAssignAnyLockedTask() PASSED

Gradle Test Run :streams:test > Gradle Test Executor 85 > DefaultTaskManagerTest > shouldRemoveTask() STARTED

Gradle Test Run :streams:test > Gradle Test Executor 85 > DefaultTaskManagerTest > shouldRemoveTask() PASSED

Gradle Test Run :streams:test > Gradle Test Executor 85 > DefaultTaskManagerTest > shouldNotRemoveAssignedTask() STARTED

Gradle Test Run :streams:test > Gradle Test Executor 85 > DefaultTaskManagerTest > shouldNotRemoveAssignedTask() PASSED

Gradle Test Run :streams:test > Gradle Test Executor 85 > DefaultTaskManagerTest > shouldAssignTaskThatCanBeProcessed() STARTED

Gradle Test Run :streams:test > Gradle Test Executor 85 > DefaultTaskManagerTest > shouldAssignTaskThatCanBeProcessed() PASSED

Gradle Test Run :streams:test > Gradle Test Executor 85 > DefaultTaskManagerTest > shouldNotRemoveUnlockedTask() STARTED

Gradle Test Run :streams:test > Gradle Test Executor 85 > DefaultTaskManagerTest > shouldNotRemoveUnlockedTask() PASSED

Gradle Test Run :streams:test > Gradle Test Executor 85 > DefaultTaskManagerTest > shouldReturnAndClearExceptionsOnDrainExceptions() STARTED

Gradle Test Run :streams:test > Gradle Test Executor 85 > DefaultTaskManagerTest > shouldReturnAndClearExceptionsOnDrainExceptions() PASSED

Gradle Test Run :streams:test > Gradle Test Executor 85 > DefaultTaskManagerTest > shouldUnassignTask() STARTED

Gradle Test Run :streams:test > Gradle Test Executor 85 > DefaultTaskManagerTest > shouldUnassignTask() PASSED

Gradle Test Run :streams:test > Gradle Test Executor 85 > DefaultTaskManagerTest > shouldNotAssignTasksForProcessingIfProcessingDisabled() STARTED

Gradle Test Run :streams:test > Gradle Test Executor 85 > DefaultTaskManagerTest > shouldNotAssignTasksForProcessingIfProcessingDisabled() PASSED

Gradle Test Run :streams:test > Gradle Test Executor 85 > DefaultTaskManagerTest > shouldNotSetUncaughtExceptionsForUnassignedTasks() STARTED

Gradle Test Run :streams:test > Gradle Test Executor 85 > DefaultTaskManagerTest > shouldNotSetUncaughtExceptionsForUnassignedTasks() PASSED

Gradle Test Run :streams:test > Gradle Test Executor 85 > DefaultTaskManagerTest > shouldNotAssignLockedTask() STARTED

Gradle Test Run :streams:test > Gradle Test Executor 85 > DefaultTaskManagerTest > shouldNotAssignLockedTask() PASSED

Gradle Test Run :streams:test > Gradle Test Executor 85 > DefaultTaskManagerTest > shouldUnassignLockingTask() STARTED

Gradle Test Run :streams:test > Gradle Test Executor 85 > DefaultTaskManagerTest > shouldUnassignLockingTask() PASSED

Gradle Test Run :streams:test > Gradle Test Executor 85 > DefaultTaskManagerTest > shouldAssignTasksThatCanBeStreamTimePunctuated() STARTED

Gradle Test Run :streams:test > Gradle Test Executor 85 > DefaultTaskManagerTest > shouldAssignTasksThatCanBeStreamTimePunctuated() PASSED
streams-1: SMOKE-TEST-CLIENT-CLOSED
streams-2: SMOKE-TEST-CLIENT-CLOSED
streams-0: SMOKE-TEST-CLIENT-CLOSED
streams-0: SMOKE-TEST-CLIENT-CLOSED
streams-1: SMOKE-TEST-CLIENT-CLOSED
streams-5: SMOKE-TEST-CLIENT-CLOSED
streams-2: SMOKE-TEST-CLIENT-CLOSED
streams-3: SMOKE-TEST-CLIENT-CLOSED
streams-4: SMOKE-TEST-CLIENT-CLOSED
streams-4: SMOKE-TEST-CLIENT-CLOSED
streams-3: SMOKE-TEST-CLIENT-CLOSED

FAILURE: Build failed with an exception.

* What went wrong:
Execution failed for task ':core:test'.
> Process 'Gradle Test Executor 90' finished with non-zero exit value 1
  This problem might be caused by incorrect test process configuration.
  For more on test execution, please refer to https://docs.gradle.org/8.2.1/userguide/java_testing.html#sec:test_execution in the Gradle documentation.

* Try:
> Run with --stacktrace option to get the stack trace.
> Run with --info or --debug option to get more log output.
> Get more help at https://help.gradle.org.

Deprecated Gradle features were used in this build, making it incompatible with Gradle 9.0.

You can use '--warning-mode all' to show the individual deprecation warnings and determine if they come from your own scripts or plugins.

For more on this, please refer to https://docs.gradle.org/8.2.1/userguide/command_line_interface.html#sec:command_line_warnings in the Gradle documentation.

BUILD FAILED in 2h 57m 29s
291 actionable tasks: 107 executed, 184 up-to-date

Publishing build scan...
https://ge.apache.org/s/bjjdvhxqmb35u


See the profiling report at: file:///home/jenkins/jenkins-agent/workspace/Kafka_kafka_trunk/build/reports/profile/profile-2023-08-15-19-27-47.html
A fine-grained performance profile is available: use the --scan option.
[Pipeline] }
[Pipeline] // withEnv
[Pipeline] }
[Pipeline] // withEnv
[Pipeline] }
[Pipeline] // withEnv
[Pipeline] }
[Pipeline] // node
[Pipeline] }
[Pipeline] // timestamps
[Pipeline] }
[Pipeline] // timeout
[Pipeline] }
[Pipeline] // stage
[Pipeline] }
Failed in branch JDK 17 and Scala 2.13
[Pipeline] // parallel
[Pipeline] }
[Pipeline] // stage
[Pipeline] stage
[Pipeline] { (Declarative: Post Actions)
[Pipeline] script
[Pipeline] {
[Pipeline] node
Running on builds57 in /home/jenkins/jenkins-agent/workspace/Kafka_kafka_trunk
[Pipeline] {
[Pipeline] step

Jenkins build is still unstable: Kafka » Kafka Branch Builder » trunk #2103

Posted by Apache Jenkins Server <je...@builds.apache.org>.
See <https://ci-builds.apache.org/job/Kafka/job/kafka/job/trunk/2103/display/redirect>


Jenkins build is still unstable: Kafka » Kafka Branch Builder » trunk #2102

Posted by Apache Jenkins Server <je...@builds.apache.org>.
See <https://ci-builds.apache.org/job/Kafka/job/kafka/job/trunk/2102/display/redirect>


Jenkins build is still unstable: Kafka » Kafka Branch Builder » trunk #2101

Posted by Apache Jenkins Server <je...@builds.apache.org>.
See <https://ci-builds.apache.org/job/Kafka/job/kafka/job/trunk/2101/display/redirect>


Jenkins build is unstable: Kafka » Kafka Branch Builder » trunk #2100

Posted by Apache Jenkins Server <je...@builds.apache.org>.
See <https://ci-builds.apache.org/job/Kafka/job/kafka/job/trunk/2100/display/redirect>


Build failed in Jenkins: Kafka » Kafka Branch Builder » trunk #2099

Posted by Apache Jenkins Server <je...@builds.apache.org>.
See <https://ci-builds.apache.org/job/Kafka/job/kafka/job/trunk/2099/display/redirect>

Changes:


------------------------------------------
[...truncated 409232 lines...]

Gradle Test Run :streams:test > Gradle Test Executor 85 > StoreQueryIntegrationTest > shouldQuerySpecificStalePartitionStoresMultiStreamThreadsNamedTopology() STARTED

Gradle Test Run :streams:test > Gradle Test Executor 85 > StoreQueryIntegrationTest > shouldQuerySpecificStalePartitionStoresMultiStreamThreadsNamedTopology() PASSED

Gradle Test Run :streams:test > Gradle Test Executor 85 > ReadOnlyTaskTest > shouldThrowUnsupportedOperationExceptionForForbiddenMethods() STARTED

Gradle Test Run :streams:test > Gradle Test Executor 85 > ReadOnlyTaskTest > shouldThrowUnsupportedOperationExceptionForForbiddenMethods() PASSED

Gradle Test Run :streams:test > Gradle Test Executor 85 > ReadOnlyTaskTest > shouldDelegateChangelogPartitions() STARTED

Gradle Test Run :streams:test > Gradle Test Executor 85 > ReadOnlyTaskTest > shouldDelegateChangelogPartitions() PASSED

Gradle Test Run :streams:test > Gradle Test Executor 85 > ReadOnlyTaskTest > shouldDelegateState() STARTED

Gradle Test Run :streams:test > Gradle Test Executor 85 > ReadOnlyTaskTest > shouldDelegateState() PASSED

Gradle Test Run :streams:test > Gradle Test Executor 85 > ReadOnlyTaskTest > shouldDelegateIsActive() STARTED

Gradle Test Run :streams:test > Gradle Test Executor 85 > ReadOnlyTaskTest > shouldDelegateIsActive() PASSED

Gradle Test Run :streams:test > Gradle Test Executor 85 > ReadOnlyTaskTest > shouldDelegateId() STARTED

Gradle Test Run :streams:test > Gradle Test Executor 85 > ReadOnlyTaskTest > shouldDelegateId() PASSED

Gradle Test Run :streams:test > Gradle Test Executor 85 > ReadOnlyTaskTest > shouldDelegateInputPartitions() STARTED

Gradle Test Run :streams:test > Gradle Test Executor 85 > ReadOnlyTaskTest > shouldDelegateInputPartitions() PASSED

Gradle Test Run :streams:test > Gradle Test Executor 85 > ReadOnlyTaskTest > shouldDelegateCommitRequested() STARTED

Gradle Test Run :streams:test > Gradle Test Executor 85 > ReadOnlyTaskTest > shouldDelegateCommitRequested() PASSED

Gradle Test Run :streams:test > Gradle Test Executor 85 > ReadOnlyTaskTest > shouldDelegateNeedsInitializationOrRestoration() STARTED

Gradle Test Run :streams:test > Gradle Test Executor 85 > ReadOnlyTaskTest > shouldDelegateNeedsInitializationOrRestoration() PASSED

Gradle Test Run :streams:test > Gradle Test Executor 85 > TaskAndActionTest > shouldThrowIfAddTaskActionIsCreatedWithNullTask() STARTED

Gradle Test Run :streams:test > Gradle Test Executor 85 > TaskAndActionTest > shouldThrowIfAddTaskActionIsCreatedWithNullTask() PASSED

Gradle Test Run :streams:test > Gradle Test Executor 85 > TaskAndActionTest > shouldCreateAddTaskAction() STARTED

Gradle Test Run :streams:test > Gradle Test Executor 85 > TaskAndActionTest > shouldCreateAddTaskAction() PASSED

Gradle Test Run :streams:test > Gradle Test Executor 85 > TaskAndActionTest > shouldCreateRemoveTaskAction() STARTED

Gradle Test Run :streams:test > Gradle Test Executor 85 > TaskAndActionTest > shouldCreateRemoveTaskAction() PASSED

Gradle Test Run :streams:test > Gradle Test Executor 85 > TaskAndActionTest > shouldThrowIfRemoveTaskActionIsCreatedWithNullTaskId() STARTED

Gradle Test Run :streams:test > Gradle Test Executor 85 > TaskAndActionTest > shouldThrowIfRemoveTaskActionIsCreatedWithNullTaskId() PASSED

Gradle Test Run :streams:test > Gradle Test Executor 85 > TasksTest > onlyRemovePendingTaskToSuspendShouldRemoveTaskFromPendingUpdateActions() STARTED

Gradle Test Run :streams:test > Gradle Test Executor 85 > TasksTest > onlyRemovePendingTaskToSuspendShouldRemoveTaskFromPendingUpdateActions() PASSED

Gradle Test Run :streams:test > Gradle Test Executor 85 > TasksTest > shouldOnlyKeepLastUpdateAction() STARTED

Gradle Test Run :streams:test > Gradle Test Executor 85 > TasksTest > shouldOnlyKeepLastUpdateAction() PASSED

Gradle Test Run :streams:test > Gradle Test Executor 85 > TasksTest > shouldAddAndRemovePendingTaskToRecycle() STARTED

Gradle Test Run :streams:test > Gradle Test Executor 85 > TasksTest > shouldAddAndRemovePendingTaskToRecycle() PASSED

Gradle Test Run :streams:test > Gradle Test Executor 85 > TasksTest > onlyRemovePendingTaskToUpdateInputPartitionsShouldRemoveTaskFromPendingUpdateActions() STARTED

Gradle Test Run :streams:test > Gradle Test Executor 85 > TasksTest > onlyRemovePendingTaskToUpdateInputPartitionsShouldRemoveTaskFromPendingUpdateActions() PASSED

Gradle Test Run :streams:test > Gradle Test Executor 85 > TasksTest > shouldVerifyIfPendingTaskToRecycleExist() STARTED

Gradle Test Run :streams:test > Gradle Test Executor 85 > TasksTest > shouldVerifyIfPendingTaskToRecycleExist() PASSED

Gradle Test Run :streams:test > Gradle Test Executor 85 > TasksTest > shouldAddAndRemovePendingTaskToUpdateInputPartitions() STARTED

Gradle Test Run :streams:test > Gradle Test Executor 85 > TasksTest > shouldAddAndRemovePendingTaskToUpdateInputPartitions() PASSED

Gradle Test Run :streams:test > Gradle Test Executor 85 > TasksTest > onlyRemovePendingTaskToCloseDirtyShouldRemoveTaskFromPendingUpdateActions() STARTED

Gradle Test Run :streams:test > Gradle Test Executor 85 > TasksTest > onlyRemovePendingTaskToCloseDirtyShouldRemoveTaskFromPendingUpdateActions() PASSED

Gradle Test Run :streams:test > Gradle Test Executor 85 > TasksTest > shouldAddAndRemovePendingTaskToSuspend() STARTED

Gradle Test Run :streams:test > Gradle Test Executor 85 > TasksTest > shouldAddAndRemovePendingTaskToSuspend() PASSED

Gradle Test Run :streams:test > Gradle Test Executor 85 > TasksTest > onlyRemovePendingTaskToCloseCleanShouldRemoveTaskFromPendingUpdateActions() STARTED

Gradle Test Run :streams:test > Gradle Test Executor 85 > TasksTest > onlyRemovePendingTaskToCloseCleanShouldRemoveTaskFromPendingUpdateActions() PASSED

Gradle Test Run :streams:test > Gradle Test Executor 85 > TasksTest > shouldDrainPendingTasksToCreate() STARTED

Gradle Test Run :streams:test > Gradle Test Executor 85 > TasksTest > shouldDrainPendingTasksToCreate() PASSED

Gradle Test Run :streams:test > Gradle Test Executor 85 > TasksTest > onlyRemovePendingTaskToRecycleShouldRemoveTaskFromPendingUpdateActions() STARTED

Gradle Test Run :streams:test > Gradle Test Executor 85 > TasksTest > onlyRemovePendingTaskToRecycleShouldRemoveTaskFromPendingUpdateActions() PASSED

Gradle Test Run :streams:test > Gradle Test Executor 85 > TasksTest > shouldAddAndRemovePendingTaskToCloseClean() STARTED

Gradle Test Run :streams:test > Gradle Test Executor 85 > TasksTest > shouldAddAndRemovePendingTaskToCloseClean() PASSED

Gradle Test Run :streams:test > Gradle Test Executor 85 > TasksTest > shouldAddAndRemovePendingTaskToCloseDirty() STARTED

Gradle Test Run :streams:test > Gradle Test Executor 85 > TasksTest > shouldAddAndRemovePendingTaskToCloseDirty() PASSED

Gradle Test Run :streams:test > Gradle Test Executor 85 > TasksTest > shouldKeepAddedTasks() STARTED

Gradle Test Run :streams:test > Gradle Test Executor 85 > TasksTest > shouldKeepAddedTasks() PASSED

Gradle Test Run :streams:test > Gradle Test Executor 85 > DefaultTaskManagerTest > shouldAssignTasksThatCanBeSystemTimePunctuated() STARTED

Gradle Test Run :streams:test > Gradle Test Executor 85 > DefaultTaskManagerTest > shouldAssignTasksThatCanBeSystemTimePunctuated() PASSED

Gradle Test Run :streams:test > Gradle Test Executor 85 > DefaultTaskManagerTest > shouldNotUnassignNotOwnedTask() STARTED

Gradle Test Run :streams:test > Gradle Test Executor 85 > DefaultTaskManagerTest > shouldNotUnassignNotOwnedTask() PASSED

Gradle Test Run :streams:test > Gradle Test Executor 85 > DefaultTaskManagerTest > shouldNotSetUncaughtExceptionsTwice() STARTED

Gradle Test Run :streams:test > Gradle Test Executor 85 > DefaultTaskManagerTest > shouldNotSetUncaughtExceptionsTwice() PASSED

Gradle Test Run :streams:test > Gradle Test Executor 85 > DefaultTaskManagerTest > shouldNotAssignTasksForPunctuationIfPunctuationDisabled() STARTED

Gradle Test Run :streams:test > Gradle Test Executor 85 > DefaultTaskManagerTest > shouldNotAssignTasksForPunctuationIfPunctuationDisabled() PASSED

Gradle Test Run :streams:test > Gradle Test Executor 85 > DefaultTaskManagerTest > shouldAddTask() STARTED

Gradle Test Run :streams:test > Gradle Test Executor 85 > DefaultTaskManagerTest > shouldAddTask() PASSED

Gradle Test Run :streams:test > Gradle Test Executor 85 > DefaultTaskManagerTest > shouldNotAssignAnyLockedTask() STARTED

Gradle Test Run :streams:test > Gradle Test Executor 85 > DefaultTaskManagerTest > shouldNotAssignAnyLockedTask() PASSED

Gradle Test Run :streams:test > Gradle Test Executor 85 > DefaultTaskManagerTest > shouldRemoveTask() STARTED

Gradle Test Run :streams:test > Gradle Test Executor 85 > DefaultTaskManagerTest > shouldRemoveTask() PASSED

Gradle Test Run :streams:test > Gradle Test Executor 85 > DefaultTaskManagerTest > shouldNotRemoveAssignedTask() STARTED

Gradle Test Run :streams:test > Gradle Test Executor 85 > DefaultTaskManagerTest > shouldNotRemoveAssignedTask() PASSED

Gradle Test Run :streams:test > Gradle Test Executor 85 > DefaultTaskManagerTest > shouldAssignTaskThatCanBeProcessed() STARTED

Gradle Test Run :streams:test > Gradle Test Executor 85 > DefaultTaskManagerTest > shouldAssignTaskThatCanBeProcessed() PASSED

Gradle Test Run :streams:test > Gradle Test Executor 85 > DefaultTaskManagerTest > shouldNotRemoveUnlockedTask() STARTED

Gradle Test Run :streams:test > Gradle Test Executor 85 > DefaultTaskManagerTest > shouldNotRemoveUnlockedTask() PASSED

Gradle Test Run :streams:test > Gradle Test Executor 85 > DefaultTaskManagerTest > shouldReturnAndClearExceptionsOnDrainExceptions() STARTED

Gradle Test Run :streams:test > Gradle Test Executor 85 > DefaultTaskManagerTest > shouldReturnAndClearExceptionsOnDrainExceptions() PASSED

Gradle Test Run :streams:test > Gradle Test Executor 85 > DefaultTaskManagerTest > shouldUnassignTask() STARTED

Gradle Test Run :streams:test > Gradle Test Executor 85 > DefaultTaskManagerTest > shouldUnassignTask() PASSED

Gradle Test Run :streams:test > Gradle Test Executor 85 > DefaultTaskManagerTest > shouldNotAssignTasksForProcessingIfProcessingDisabled() STARTED

Gradle Test Run :streams:test > Gradle Test Executor 85 > DefaultTaskManagerTest > shouldNotAssignTasksForProcessingIfProcessingDisabled() PASSED

Gradle Test Run :streams:test > Gradle Test Executor 85 > DefaultTaskManagerTest > shouldNotSetUncaughtExceptionsForUnassignedTasks() STARTED

Gradle Test Run :streams:test > Gradle Test Executor 85 > DefaultTaskManagerTest > shouldNotSetUncaughtExceptionsForUnassignedTasks() PASSED

Gradle Test Run :streams:test > Gradle Test Executor 85 > DefaultTaskManagerTest > shouldNotAssignLockedTask() STARTED

Gradle Test Run :streams:test > Gradle Test Executor 85 > DefaultTaskManagerTest > shouldNotAssignLockedTask() PASSED

Gradle Test Run :streams:test > Gradle Test Executor 85 > DefaultTaskManagerTest > shouldUnassignLockingTask() STARTED

Gradle Test Run :streams:test > Gradle Test Executor 85 > DefaultTaskManagerTest > shouldUnassignLockingTask() PASSED

Gradle Test Run :streams:test > Gradle Test Executor 85 > DefaultTaskManagerTest > shouldAssignTasksThatCanBeStreamTimePunctuated() STARTED

Gradle Test Run :streams:test > Gradle Test Executor 85 > DefaultTaskManagerTest > shouldAssignTasksThatCanBeStreamTimePunctuated() PASSED
streams-1: SMOKE-TEST-CLIENT-CLOSED
streams-7: SMOKE-TEST-CLIENT-CLOSED
streams-3: SMOKE-TEST-CLIENT-CLOSED
streams-0: SMOKE-TEST-CLIENT-CLOSED
streams-6: SMOKE-TEST-CLIENT-CLOSED
streams-6: SMOKE-TEST-CLIENT-CLOSED
streams-5: SMOKE-TEST-CLIENT-CLOSED
streams-4: SMOKE-TEST-CLIENT-CLOSED
streams-7: SMOKE-TEST-CLIENT-CLOSED
streams-0: SMOKE-TEST-CLIENT-CLOSED
streams-1: SMOKE-TEST-CLIENT-CLOSED
streams-2: SMOKE-TEST-CLIENT-CLOSED
streams-2: SMOKE-TEST-CLIENT-CLOSED
streams-5: SMOKE-TEST-CLIENT-CLOSED
streams-3: SMOKE-TEST-CLIENT-CLOSED
streams-8: SMOKE-TEST-CLIENT-CLOSED
streams-4: SMOKE-TEST-CLIENT-CLOSED

FAILURE: Build failed with an exception.

* What went wrong:
Execution failed for task ':storage:test'.
> Process 'Gradle Test Executor 72' finished with non-zero exit value 1
  This problem might be caused by incorrect test process configuration.
  For more on test execution, please refer to https://docs.gradle.org/8.2.1/userguide/java_testing.html#sec:test_execution in the Gradle documentation.

* Try:
> Run with --stacktrace option to get the stack trace.
> Run with --info or --debug option to get more log output.
> Get more help at https://help.gradle.org.

Deprecated Gradle features were used in this build, making it incompatible with Gradle 9.0.

You can use '--warning-mode all' to show the individual deprecation warnings and determine if they come from your own scripts or plugins.

For more on this, please refer to https://docs.gradle.org/8.2.1/userguide/command_line_interface.html#sec:command_line_warnings in the Gradle documentation.

BUILD FAILED in 2h 43m 1s
291 actionable tasks: 107 executed, 184 up-to-date

Publishing build scan...
https://ge.apache.org/s/p4sjppd53fydg


See the profiling report at: file:///home/jenkins/workspace/Kafka_kafka_trunk@2/build/reports/profile/profile-2023-08-14-15-33-13.html
A fine-grained performance profile is available: use the --scan option.
[Pipeline] }
[Pipeline] // withEnv
[Pipeline] }
[Pipeline] // withEnv
[Pipeline] }
[Pipeline] // withEnv
[Pipeline] }
[Pipeline] // node
[Pipeline] }
[Pipeline] // timestamps
[Pipeline] }
[Pipeline] // timeout
[Pipeline] }
[Pipeline] // stage
[Pipeline] }
Failed in branch JDK 20 and Scala 2.13
[Pipeline] // parallel
[Pipeline] }
[Pipeline] // stage
[Pipeline] stage
[Pipeline] { (Declarative: Post Actions)
[Pipeline] script
[Pipeline] {
[Pipeline] node
Running on builds57 in /home/jenkins/jenkins-agent/workspace/Kafka_kafka_trunk
[Pipeline] {
[Pipeline] step

Build failed in Jenkins: Kafka » Kafka Branch Builder » trunk #2098

Posted by Apache Jenkins Server <je...@builds.apache.org>.
See <https://ci-builds.apache.org/job/Kafka/job/kafka/job/trunk/2098/display/redirect>

Changes:


------------------------------------------
[...truncated 408705 lines...]

Gradle Test Run :streams:test > Gradle Test Executor 85 > StoreQueryIntegrationTest > shouldQuerySpecificActivePartitionStores() STARTED

Gradle Test Run :streams:test > Gradle Test Executor 85 > StoreQueryIntegrationTest > shouldQuerySpecificActivePartitionStores() PASSED

Gradle Test Run :streams:test > Gradle Test Executor 85 > StoreQueryIntegrationTest > shouldFailWithIllegalArgumentExceptionWhenIQPartitionerReturnsMultiplePartitions() STARTED

Gradle Test Run :streams:test > Gradle Test Executor 85 > StoreQueryIntegrationTest > shouldFailWithIllegalArgumentExceptionWhenIQPartitionerReturnsMultiplePartitions() PASSED

Gradle Test Run :streams:test > Gradle Test Executor 85 > StoreQueryIntegrationTest > shouldQueryAllStalePartitionStores() STARTED

Gradle Test Run :streams:test > Gradle Test Executor 85 > StoreQueryIntegrationTest > shouldQueryAllStalePartitionStores() PASSED

Gradle Test Run :streams:test > Gradle Test Executor 85 > StoreQueryIntegrationTest > shouldQuerySpecificStalePartitionStoresMultiStreamThreads() STARTED

Gradle Test Run :streams:test > Gradle Test Executor 85 > StoreQueryIntegrationTest > shouldQuerySpecificStalePartitionStoresMultiStreamThreads() PASSED

Gradle Test Run :streams:test > Gradle Test Executor 85 > StoreQueryIntegrationTest > shouldQuerySpecificStalePartitionStores() STARTED

Gradle Test Run :streams:test > Gradle Test Executor 85 > StoreQueryIntegrationTest > shouldQuerySpecificStalePartitionStores() PASSED

Gradle Test Run :streams:test > Gradle Test Executor 85 > StoreQueryIntegrationTest > shouldQueryOnlyActivePartitionStoresByDefault() STARTED

Gradle Test Run :streams:test > Gradle Test Executor 85 > StoreQueryIntegrationTest > shouldQueryOnlyActivePartitionStoresByDefault() PASSED

Gradle Test Run :streams:test > Gradle Test Executor 85 > StoreQueryIntegrationTest > shouldQueryStoresAfterAddingAndRemovingStreamThread() STARTED

Gradle Test Run :streams:test > Gradle Test Executor 85 > StoreQueryIntegrationTest > shouldQueryStoresAfterAddingAndRemovingStreamThread() PASSED

Gradle Test Run :streams:test > Gradle Test Executor 85 > StoreQueryIntegrationTest > shouldQuerySpecificStalePartitionStoresMultiStreamThreadsNamedTopology() STARTED

Gradle Test Run :streams:test > Gradle Test Executor 85 > StoreQueryIntegrationTest > shouldQuerySpecificStalePartitionStoresMultiStreamThreadsNamedTopology() PASSED

Gradle Test Run :streams:test > Gradle Test Executor 85 > ReadOnlyTaskTest > shouldThrowUnsupportedOperationExceptionForForbiddenMethods() STARTED

Gradle Test Run :streams:test > Gradle Test Executor 85 > ReadOnlyTaskTest > shouldThrowUnsupportedOperationExceptionForForbiddenMethods() PASSED

Gradle Test Run :streams:test > Gradle Test Executor 85 > ReadOnlyTaskTest > shouldDelegateChangelogPartitions() STARTED

Gradle Test Run :streams:test > Gradle Test Executor 85 > ReadOnlyTaskTest > shouldDelegateChangelogPartitions() PASSED

Gradle Test Run :streams:test > Gradle Test Executor 85 > ReadOnlyTaskTest > shouldDelegateState() STARTED

Gradle Test Run :streams:test > Gradle Test Executor 85 > ReadOnlyTaskTest > shouldDelegateState() PASSED

Gradle Test Run :streams:test > Gradle Test Executor 85 > ReadOnlyTaskTest > shouldDelegateIsActive() STARTED

Gradle Test Run :streams:test > Gradle Test Executor 85 > ReadOnlyTaskTest > shouldDelegateIsActive() PASSED

Gradle Test Run :streams:test > Gradle Test Executor 85 > ReadOnlyTaskTest > shouldDelegateId() STARTED

Gradle Test Run :streams:test > Gradle Test Executor 85 > ReadOnlyTaskTest > shouldDelegateId() PASSED

Gradle Test Run :streams:test > Gradle Test Executor 85 > ReadOnlyTaskTest > shouldDelegateInputPartitions() STARTED

Gradle Test Run :streams:test > Gradle Test Executor 85 > ReadOnlyTaskTest > shouldDelegateInputPartitions() PASSED

Gradle Test Run :streams:test > Gradle Test Executor 85 > ReadOnlyTaskTest > shouldDelegateCommitRequested() STARTED

Gradle Test Run :streams:test > Gradle Test Executor 85 > ReadOnlyTaskTest > shouldDelegateCommitRequested() PASSED

Gradle Test Run :streams:test > Gradle Test Executor 85 > ReadOnlyTaskTest > shouldDelegateNeedsInitializationOrRestoration() STARTED

Gradle Test Run :streams:test > Gradle Test Executor 85 > ReadOnlyTaskTest > shouldDelegateNeedsInitializationOrRestoration() PASSED

Gradle Test Run :streams:test > Gradle Test Executor 85 > TaskAndActionTest > shouldThrowIfAddTaskActionIsCreatedWithNullTask() STARTED

Gradle Test Run :streams:test > Gradle Test Executor 85 > TaskAndActionTest > shouldThrowIfAddTaskActionIsCreatedWithNullTask() PASSED

Gradle Test Run :streams:test > Gradle Test Executor 85 > TaskAndActionTest > shouldCreateAddTaskAction() STARTED

Gradle Test Run :streams:test > Gradle Test Executor 85 > TaskAndActionTest > shouldCreateAddTaskAction() PASSED

Gradle Test Run :streams:test > Gradle Test Executor 85 > TaskAndActionTest > shouldCreateRemoveTaskAction() STARTED

Gradle Test Run :streams:test > Gradle Test Executor 85 > TaskAndActionTest > shouldCreateRemoveTaskAction() PASSED

Gradle Test Run :streams:test > Gradle Test Executor 85 > TaskAndActionTest > shouldThrowIfRemoveTaskActionIsCreatedWithNullTaskId() STARTED

Gradle Test Run :streams:test > Gradle Test Executor 85 > TaskAndActionTest > shouldThrowIfRemoveTaskActionIsCreatedWithNullTaskId() PASSED

Gradle Test Run :streams:test > Gradle Test Executor 85 > TasksTest > onlyRemovePendingTaskToSuspendShouldRemoveTaskFromPendingUpdateActions() STARTED

Gradle Test Run :streams:test > Gradle Test Executor 85 > TasksTest > onlyRemovePendingTaskToSuspendShouldRemoveTaskFromPendingUpdateActions() PASSED

Gradle Test Run :streams:test > Gradle Test Executor 85 > TasksTest > shouldOnlyKeepLastUpdateAction() STARTED

Gradle Test Run :streams:test > Gradle Test Executor 85 > TasksTest > shouldOnlyKeepLastUpdateAction() PASSED

Gradle Test Run :streams:test > Gradle Test Executor 85 > TasksTest > shouldAddAndRemovePendingTaskToRecycle() STARTED

Gradle Test Run :streams:test > Gradle Test Executor 85 > TasksTest > shouldAddAndRemovePendingTaskToRecycle() PASSED

Gradle Test Run :streams:test > Gradle Test Executor 85 > TasksTest > onlyRemovePendingTaskToUpdateInputPartitionsShouldRemoveTaskFromPendingUpdateActions() STARTED

Gradle Test Run :streams:test > Gradle Test Executor 85 > TasksTest > onlyRemovePendingTaskToUpdateInputPartitionsShouldRemoveTaskFromPendingUpdateActions() PASSED

Gradle Test Run :streams:test > Gradle Test Executor 85 > TasksTest > shouldVerifyIfPendingTaskToRecycleExist() STARTED

Gradle Test Run :streams:test > Gradle Test Executor 85 > TasksTest > shouldVerifyIfPendingTaskToRecycleExist() PASSED

Gradle Test Run :streams:test > Gradle Test Executor 85 > TasksTest > shouldAddAndRemovePendingTaskToUpdateInputPartitions() STARTED

Gradle Test Run :streams:test > Gradle Test Executor 85 > TasksTest > shouldAddAndRemovePendingTaskToUpdateInputPartitions() PASSED

Gradle Test Run :streams:test > Gradle Test Executor 85 > TasksTest > onlyRemovePendingTaskToCloseDirtyShouldRemoveTaskFromPendingUpdateActions() STARTED

Gradle Test Run :streams:test > Gradle Test Executor 85 > TasksTest > onlyRemovePendingTaskToCloseDirtyShouldRemoveTaskFromPendingUpdateActions() PASSED

Gradle Test Run :streams:test > Gradle Test Executor 85 > TasksTest > shouldAddAndRemovePendingTaskToSuspend() STARTED

Gradle Test Run :streams:test > Gradle Test Executor 85 > TasksTest > shouldAddAndRemovePendingTaskToSuspend() PASSED

Gradle Test Run :streams:test > Gradle Test Executor 85 > TasksTest > onlyRemovePendingTaskToCloseCleanShouldRemoveTaskFromPendingUpdateActions() STARTED

Gradle Test Run :streams:test > Gradle Test Executor 85 > TasksTest > onlyRemovePendingTaskToCloseCleanShouldRemoveTaskFromPendingUpdateActions() PASSED

Gradle Test Run :streams:test > Gradle Test Executor 85 > TasksTest > shouldDrainPendingTasksToCreate() STARTED

Gradle Test Run :streams:test > Gradle Test Executor 85 > TasksTest > shouldDrainPendingTasksToCreate() PASSED

Gradle Test Run :streams:test > Gradle Test Executor 85 > TasksTest > onlyRemovePendingTaskToRecycleShouldRemoveTaskFromPendingUpdateActions() STARTED

Gradle Test Run :streams:test > Gradle Test Executor 85 > TasksTest > onlyRemovePendingTaskToRecycleShouldRemoveTaskFromPendingUpdateActions() PASSED

Gradle Test Run :streams:test > Gradle Test Executor 85 > TasksTest > shouldAddAndRemovePendingTaskToCloseClean() STARTED

Gradle Test Run :streams:test > Gradle Test Executor 85 > TasksTest > shouldAddAndRemovePendingTaskToCloseClean() PASSED

Gradle Test Run :streams:test > Gradle Test Executor 85 > TasksTest > shouldAddAndRemovePendingTaskToCloseDirty() STARTED

Gradle Test Run :streams:test > Gradle Test Executor 85 > TasksTest > shouldAddAndRemovePendingTaskToCloseDirty() PASSED

Gradle Test Run :streams:test > Gradle Test Executor 85 > TasksTest > shouldKeepAddedTasks() STARTED

Gradle Test Run :streams:test > Gradle Test Executor 85 > TasksTest > shouldKeepAddedTasks() PASSED

Gradle Test Run :streams:test > Gradle Test Executor 85 > DefaultTaskManagerTest > shouldNotUnassignNotOwnedTask() STARTED

Gradle Test Run :streams:test > Gradle Test Executor 85 > DefaultTaskManagerTest > shouldNotUnassignNotOwnedTask() PASSED

Gradle Test Run :streams:test > Gradle Test Executor 85 > DefaultTaskManagerTest > shouldNotSetUncaughtExceptionsTwice() STARTED

Gradle Test Run :streams:test > Gradle Test Executor 85 > DefaultTaskManagerTest > shouldNotSetUncaughtExceptionsTwice() PASSED

Gradle Test Run :streams:test > Gradle Test Executor 85 > DefaultTaskManagerTest > shouldAddTask() STARTED

Gradle Test Run :streams:test > Gradle Test Executor 85 > DefaultTaskManagerTest > shouldAddTask() PASSED

Gradle Test Run :streams:test > Gradle Test Executor 85 > DefaultTaskManagerTest > shouldAssignTask() STARTED

Gradle Test Run :streams:test > Gradle Test Executor 85 > DefaultTaskManagerTest > shouldAssignTask() PASSED

Gradle Test Run :streams:test > Gradle Test Executor 85 > DefaultTaskManagerTest > shouldNotAssignAnyLockedTask() STARTED

Gradle Test Run :streams:test > Gradle Test Executor 85 > DefaultTaskManagerTest > shouldNotAssignAnyLockedTask() PASSED

Gradle Test Run :streams:test > Gradle Test Executor 85 > DefaultTaskManagerTest > shouldRemoveTask() STARTED

Gradle Test Run :streams:test > Gradle Test Executor 85 > DefaultTaskManagerTest > shouldRemoveTask() PASSED

Gradle Test Run :streams:test > Gradle Test Executor 85 > DefaultTaskManagerTest > shouldNotRemoveAssignedTask() STARTED

Gradle Test Run :streams:test > Gradle Test Executor 85 > DefaultTaskManagerTest > shouldNotRemoveAssignedTask() PASSED

Gradle Test Run :streams:test > Gradle Test Executor 85 > DefaultTaskManagerTest > shouldNotRemoveUnlockedTask() STARTED

Gradle Test Run :streams:test > Gradle Test Executor 85 > DefaultTaskManagerTest > shouldNotRemoveUnlockedTask() PASSED

Gradle Test Run :streams:test > Gradle Test Executor 85 > DefaultTaskManagerTest > shouldReturnAndClearExceptionsOnDrainExceptions() STARTED

Gradle Test Run :streams:test > Gradle Test Executor 85 > DefaultTaskManagerTest > shouldReturnAndClearExceptionsOnDrainExceptions() PASSED

Gradle Test Run :streams:test > Gradle Test Executor 85 > DefaultTaskManagerTest > shouldUnassignTask() STARTED

Gradle Test Run :streams:test > Gradle Test Executor 85 > DefaultTaskManagerTest > shouldUnassignTask() PASSED

Gradle Test Run :streams:test > Gradle Test Executor 85 > DefaultTaskManagerTest > shouldNotSetUncaughtExceptionsForUnassignedTasks() STARTED

Gradle Test Run :streams:test > Gradle Test Executor 85 > DefaultTaskManagerTest > shouldNotSetUncaughtExceptionsForUnassignedTasks() PASSED

Gradle Test Run :streams:test > Gradle Test Executor 85 > DefaultTaskManagerTest > shouldNotAssignLockedTask() STARTED

Gradle Test Run :streams:test > Gradle Test Executor 85 > DefaultTaskManagerTest > shouldNotAssignLockedTask() PASSED

Gradle Test Run :streams:test > Gradle Test Executor 85 > DefaultTaskManagerTest > shouldUnassignLockingTask() STARTED

Gradle Test Run :streams:test > Gradle Test Executor 85 > DefaultTaskManagerTest > shouldUnassignLockingTask() PASSED
streams-5: SMOKE-TEST-CLIENT-CLOSED
streams-0: SMOKE-TEST-CLIENT-CLOSED
streams-3: SMOKE-TEST-CLIENT-CLOSED
streams-6: SMOKE-TEST-CLIENT-CLOSED
streams-3: SMOKE-TEST-CLIENT-CLOSED
streams-1: SMOKE-TEST-CLIENT-CLOSED
streams-4: SMOKE-TEST-CLIENT-CLOSED
streams-5: SMOKE-TEST-CLIENT-CLOSED
streams-6: SMOKE-TEST-CLIENT-CLOSED
streams-0: SMOKE-TEST-CLIENT-CLOSED
streams-4: SMOKE-TEST-CLIENT-CLOSED
streams-2: SMOKE-TEST-CLIENT-CLOSED
streams-1: SMOKE-TEST-CLIENT-CLOSED
streams-2: SMOKE-TEST-CLIENT-CLOSED

Deprecated Gradle features were used in this build, making it incompatible with Gradle 9.0.

You can use '--warning-mode all' to show the individual deprecation warnings and determine if they come from your own scripts or plugins.

For more on this, please refer to https://docs.gradle.org/8.2.1/userguide/command_line_interface.html#sec:command_line_warnings in the Gradle documentation.

BUILD SUCCESSFUL in 3h 21m 2s
291 actionable tasks: 107 executed, 184 up-to-date

Publishing build scan...
https://ge.apache.org/s/c5hr5ytxmgn4e


See the profiling report at: file:///home/jenkins/workspace/Kafka_kafka_trunk/build/reports/profile/profile-2023-08-14-09-13-47.html
A fine-grained performance profile is available: use the --scan option.
[Pipeline] junit
Recording test results
[Checks API] No suitable checks publisher found.
[Pipeline] echo
Skipping Kafka Streams archetype test for Java 17
[Pipeline] }
[Pipeline] // withEnv
[Pipeline] }
[Pipeline] // withEnv
[Pipeline] }
[Pipeline] // withEnv
[Pipeline] }
[Pipeline] // node
[Pipeline] }
[Pipeline] // timestamps
[Pipeline] }
[Pipeline] // timeout
[Pipeline] }
[Pipeline] // stage
[Pipeline] }
[Pipeline] // parallel
[Pipeline] }
[Pipeline] // stage
[Pipeline] stage
[Pipeline] { (Declarative: Post Actions)
[Pipeline] script
[Pipeline] {
[Pipeline] node
Running on builds35 in /home/jenkins/workspace/Kafka_kafka_trunk
[Pipeline] {
[Pipeline] step