You are viewing a plain text version of this content. The canonical link for it is here.
Posted to dev@zookeeper.apache.org by Apache Jenkins Server <je...@builds.apache.org> on 2016/05/30 23:26:47 UTC

ZooKeeper-trunk - Build # 2943 - Failure

See https://builds.apache.org/job/ZooKeeper-trunk/2943/

###################################################################################
########################## LAST 60 LINES OF THE CONSOLE ###########################
[...truncated 388084 lines...]
    [junit] 2016-05-30 23:25:51,909 [myid:] - INFO  [main:QuorumUtil@243] - 127.0.0.1:16749 is no longer accepting client connections
    [junit] 2016-05-30 23:25:51,910 [myid:] - INFO  [main:ZKTestCase$1@65] - SUCCEEDED testRemoveOneAsynchronous
    [junit] 2016-05-30 23:25:51,910 [myid:] - INFO  [main:ZKTestCase$1@60] - FINISHED testRemoveOneAsynchronous
    [junit] Tests run: 11, Failures: 0, Errors: 0, Skipped: 0, Time elapsed: 130.106 sec, Thread: 3, Class: org.apache.zookeeper.test.ReconfigTest
    [junit] 2016-05-30 23:26:40,687 [myid:] - INFO  [main:JUnit4ZKTestRunner$LoggedInvokeMethod@82] - Memory used 32764
    [junit] 2016-05-30 23:26:40,687 [myid:] - INFO  [main:JUnit4ZKTestRunner$LoggedInvokeMethod@87] - Number of threads 55
    [junit] 2016-05-30 23:26:40,687 [myid:] - INFO  [main:JUnit4ZKTestRunner$LoggedInvokeMethod@102] - FINISHED TEST METHOD testManyChildWatchersAutoReset
    [junit] 2016-05-30 23:26:40,688 [myid:] - INFO  [main:ClientBase@537] - tearDown starting
    [junit] 2016-05-30 23:26:40,688 [myid:] - INFO  [ProcessThread(sid:0 cport:19304)::PrepRequestProcessor@647] - Processed session termination for sessionid: 0x1005ce1fa3a0000
    [junit] 2016-05-30 23:26:40,695 [myid:] - INFO  [NIOWorkerThread-6:MBeanRegistry@128] - Unregister MBean [org.apache.ZooKeeperService:name0=StandaloneServer_port19304,name1=Connections,name2=127.0.0.1,name3=0x1005ce1fa3a0000]
    [junit] 2016-05-30 23:26:40,696 [myid:] - INFO  [NIOWorkerThread-6:NIOServerCnxn@607] - Closed socket connection for client /127.0.0.1:58734 which had sessionid 0x1005ce1fa3a0000
    [junit] 2016-05-30 23:26:40,696 [myid:] - INFO  [main:ZooKeeper@1313] - Session: 0x1005ce1fa3a0000 closed
    [junit] 2016-05-30 23:26:40,697 [myid:] - INFO  [main-EventThread:ClientCnxn$EventThread@513] - EventThread shut down for session: 0x1005ce1fa3a0000
    [junit] 2016-05-30 23:26:40,697 [myid:] - INFO  [ProcessThread(sid:0 cport:19304)::PrepRequestProcessor@647] - Processed session termination for sessionid: 0x1005ce1fa3a0001
    [junit] 2016-05-30 23:26:40,707 [myid:] - INFO  [main:ZooKeeper@1313] - Session: 0x1005ce1fa3a0001 closed
    [junit] 2016-05-30 23:26:40,707 [myid:] - INFO  [NIOWorkerThread-2:MBeanRegistry@128] - Unregister MBean [org.apache.ZooKeeperService:name0=StandaloneServer_port19304,name1=Connections,name2=127.0.0.1,name3=0x1005ce1fa3a0001]
    [junit] 2016-05-30 23:26:40,707 [myid:] - INFO  [main-EventThread:ClientCnxn$EventThread@513] - EventThread shut down for session: 0x1005ce1fa3a0001
    [junit] 2016-05-30 23:26:40,707 [myid:] - INFO  [main:ClientBase@507] - STOPPING server
    [junit] 2016-05-30 23:26:40,708 [myid:] - INFO  [NIOWorkerThread-2:NIOServerCnxn@607] - Closed socket connection for client /127.0.0.1:58730 which had sessionid 0x1005ce1fa3a0001
    [junit] 2016-05-30 23:26:40,708 [myid:] - INFO  [ConnnectionExpirer:NIOServerCnxnFactory$ConnectionExpirerThread@583] - ConnnectionExpirerThread interrupted
    [junit] 2016-05-30 23:26:40,713 [myid:] - INFO  [NIOServerCxnFactory.AcceptThread:0.0.0.0/0.0.0.0:19304:NIOServerCnxnFactory$AcceptThread@219] - accept thread exitted run method
    [junit] 2016-05-30 23:26:40,714 [myid:] - INFO  [NIOServerCxnFactory.SelectorThread-0:NIOServerCnxnFactory$SelectorThread@420] - selector thread exitted run method
    [junit] 2016-05-30 23:26:40,716 [myid:] - INFO  [NIOServerCxnFactory.SelectorThread-1:NIOServerCnxnFactory$SelectorThread@420] - selector thread exitted run method
    [junit] 2016-05-30 23:26:40,716 [myid:] - INFO  [main:ZooKeeperServer@498] - shutting down
    [junit] 2016-05-30 23:26:40,716 [myid:] - INFO  [main:SessionTrackerImpl@232] - Shutting down
    [junit] 2016-05-30 23:26:40,716 [myid:] - INFO  [main:PrepRequestProcessor@965] - Shutting down
    [junit] 2016-05-30 23:26:40,716 [myid:] - INFO  [main:SyncRequestProcessor@191] - Shutting down
    [junit] 2016-05-30 23:26:40,716 [myid:] - INFO  [ProcessThread(sid:0 cport:19304)::PrepRequestProcessor@154] - PrepRequestProcessor exited loop!
    [junit] 2016-05-30 23:26:40,716 [myid:] - INFO  [SyncThread:0:SyncRequestProcessor@169] - SyncRequestProcessor exited!
    [junit] 2016-05-30 23:26:40,717 [myid:] - INFO  [main:FinalRequestProcessor@479] - shutdown of request processor complete
    [junit] 2016-05-30 23:26:40,717 [myid:] - INFO  [main:MBeanRegistry@128] - Unregister MBean [org.apache.ZooKeeperService:name0=StandaloneServer_port19304,name1=InMemoryDataTree]
    [junit] 2016-05-30 23:26:40,718 [myid:] - INFO  [main:MBeanRegistry@128] - Unregister MBean [org.apache.ZooKeeperService:name0=StandaloneServer_port19304]
    [junit] 2016-05-30 23:26:40,718 [myid:] - INFO  [main:FourLetterWordMain@85] - connecting to 127.0.0.1 19304
    [junit] 2016-05-30 23:26:40,719 [myid:] - INFO  [main:JMXEnv@146] - ensureOnly:[]
    [junit] 2016-05-30 23:26:40,725 [myid:] - INFO  [main:ClientBase@562] - fdcount after test is: 51 at start it was 51
    [junit] 2016-05-30 23:26:40,725 [myid:] - INFO  [main:ZKTestCase$1@65] - SUCCEEDED testManyChildWatchersAutoReset
    [junit] 2016-05-30 23:26:40,726 [myid:] - INFO  [main:ZKTestCase$1@60] - FINISHED testManyChildWatchersAutoReset
    [junit] Tests run: 4, Failures: 0, Errors: 0, Skipped: 0, Time elapsed: 392.148 sec, Thread: 4, Class: org.apache.zookeeper.test.DisconnectedWatcherTest

BUILD FAILED
/home/jenkins/jenkins-slave/workspace/ZooKeeper-trunk/trunk/build.xml:1322: The following error occurred while executing this line:
/home/jenkins/jenkins-slave/workspace/ZooKeeper-trunk/trunk/build.xml:1207: Tests failed!

Total time: 9 minutes 31 seconds
Build step 'Execute shell' marked build as failure
[FINDBUGS] Skipping publisher since build result is FAILURE
[WARNINGS] Skipping publisher since build result is FAILURE
Archiving artifacts
Setting LATEST1_7_HOME=/home/jenkins/jenkins-slave/tools/hudson.model.JDK/latest1.7
Recording fingerprints
Setting LATEST1_7_HOME=/home/jenkins/jenkins-slave/tools/hudson.model.JDK/latest1.7
Recording test results
Setting LATEST1_7_HOME=/home/jenkins/jenkins-slave/tools/hudson.model.JDK/latest1.7
Publishing Javadoc
Setting LATEST1_7_HOME=/home/jenkins/jenkins-slave/tools/hudson.model.JDK/latest1.7
Email was triggered for: Failure - Any
Sending email for trigger: Failure - Any
Setting LATEST1_7_HOME=/home/jenkins/jenkins-slave/tools/hudson.model.JDK/latest1.7
Setting LATEST1_7_HOME=/home/jenkins/jenkins-slave/tools/hudson.model.JDK/latest1.7



###################################################################################
############################## FAILED TESTS (if any) ##############################
1 tests failed.
FAILED:  org.apache.zookeeper.server.quorum.ReconfigRecoveryTest.testCurrentServersAreObserversInNextConfig

Error Message:
waiting for server 4 being up

Stack Trace:
junit.framework.AssertionFailedError: waiting for server 4 being up
	at org.apache.zookeeper.server.quorum.ReconfigRecoveryTest.testCurrentServersAreObserversInNextConfig(ReconfigRecoveryTest.java:217)
	at org.apache.zookeeper.JUnit4ZKTestRunner$LoggedInvokeMethod.evaluate(JUnit4ZKTestRunner.java:79)



ZooKeeper-trunk - Build # 2944 - Still Failing

Posted by Apache Jenkins Server <je...@builds.apache.org>.
See https://builds.apache.org/job/ZooKeeper-trunk/2944/

###################################################################################
########################## LAST 60 LINES OF THE CONSOLE ###########################
[...truncated 386474 lines...]
    [junit] 2016-05-31 23:26:01,442 [myid:] - INFO  [main:ClientBase@562] - fdcount after test is: 47 at start it was 47
    [junit] 2016-05-31 23:26:01,442 [myid:] - INFO  [main:ZKTestCase$1@65] - SUCCEEDED testWatcherAutoResetWithLocal
    [junit] 2016-05-31 23:26:01,442 [myid:] - INFO  [main:ZKTestCase$1@60] - FINISHED testWatcherAutoResetWithLocal
    [junit] Tests run: 7, Failures: 0, Errors: 0, Skipped: 0, Time elapsed: 30.822 sec, Thread: 5, Class: org.apache.zookeeper.test.WatcherTest
    [junit] 2016-05-31 23:26:57,947 [myid:] - INFO  [main:JUnit4ZKTestRunner$LoggedInvokeMethod@82] - Memory used 29210
    [junit] 2016-05-31 23:26:57,947 [myid:] - INFO  [main:JUnit4ZKTestRunner$LoggedInvokeMethod@87] - Number of threads 55
    [junit] 2016-05-31 23:26:57,948 [myid:] - INFO  [main:JUnit4ZKTestRunner$LoggedInvokeMethod@102] - FINISHED TEST METHOD testManyChildWatchersAutoReset
    [junit] 2016-05-31 23:26:57,948 [myid:] - INFO  [main:ClientBase@537] - tearDown starting
    [junit] 2016-05-31 23:26:57,948 [myid:] - INFO  [ProcessThread(sid:0 cport:27383)::PrepRequestProcessor@647] - Processed session termination for sessionid: 0x10062087a9b0000
    [junit] 2016-05-31 23:26:57,955 [myid:] - INFO  [main:ZooKeeper@1313] - Session: 0x10062087a9b0000 closed
    [junit] 2016-05-31 23:26:57,956 [myid:] - INFO  [main-EventThread:ClientCnxn$EventThread@513] - EventThread shut down for session: 0x10062087a9b0000
    [junit] 2016-05-31 23:26:57,957 [myid:] - INFO  [NIOWorkerThread-23:MBeanRegistry@128] - Unregister MBean [org.apache.ZooKeeperService:name0=StandaloneServer_port27383,name1=Connections,name2=127.0.0.1,name3=0x10062087a9b0000]
    [junit] 2016-05-31 23:26:57,957 [myid:] - INFO  [ProcessThread(sid:0 cport:27383)::PrepRequestProcessor@647] - Processed session termination for sessionid: 0x10062087a9b0001
    [junit] 2016-05-31 23:26:57,957 [myid:] - INFO  [NIOWorkerThread-23:NIOServerCnxn@607] - Closed socket connection for client /127.0.0.1:56406 which had sessionid 0x10062087a9b0000
    [junit] 2016-05-31 23:26:57,964 [myid:] - INFO  [main:ZooKeeper@1313] - Session: 0x10062087a9b0001 closed
    [junit] 2016-05-31 23:26:57,964 [myid:] - INFO  [NIOWorkerThread-9:MBeanRegistry@128] - Unregister MBean [org.apache.ZooKeeperService:name0=StandaloneServer_port27383,name1=Connections,name2=127.0.0.1,name3=0x10062087a9b0001]
    [junit] 2016-05-31 23:26:57,964 [myid:] - INFO  [NIOWorkerThread-9:NIOServerCnxn@607] - Closed socket connection for client /127.0.0.1:56407 which had sessionid 0x10062087a9b0001
    [junit] 2016-05-31 23:26:57,964 [myid:] - INFO  [main-EventThread:ClientCnxn$EventThread@513] - EventThread shut down for session: 0x10062087a9b0001
    [junit] 2016-05-31 23:26:57,964 [myid:] - INFO  [main:ClientBase@507] - STOPPING server
    [junit] 2016-05-31 23:26:57,966 [myid:] - INFO  [ConnnectionExpirer:NIOServerCnxnFactory$ConnectionExpirerThread@583] - ConnnectionExpirerThread interrupted
    [junit] 2016-05-31 23:26:57,966 [myid:] - INFO  [NIOServerCxnFactory.AcceptThread:0.0.0.0/0.0.0.0:27383:NIOServerCnxnFactory$AcceptThread@219] - accept thread exitted run method
    [junit] 2016-05-31 23:26:57,969 [myid:] - INFO  [NIOServerCxnFactory.SelectorThread-0:NIOServerCnxnFactory$SelectorThread@420] - selector thread exitted run method
    [junit] 2016-05-31 23:26:57,970 [myid:] - INFO  [NIOServerCxnFactory.SelectorThread-1:NIOServerCnxnFactory$SelectorThread@420] - selector thread exitted run method
    [junit] 2016-05-31 23:26:57,971 [myid:] - INFO  [main:ZooKeeperServer@498] - shutting down
    [junit] 2016-05-31 23:26:57,972 [myid:] - INFO  [main:SessionTrackerImpl@232] - Shutting down
    [junit] 2016-05-31 23:26:57,972 [myid:] - INFO  [main:PrepRequestProcessor@965] - Shutting down
    [junit] 2016-05-31 23:26:57,972 [myid:] - INFO  [main:SyncRequestProcessor@191] - Shutting down
    [junit] 2016-05-31 23:26:57,972 [myid:] - INFO  [ProcessThread(sid:0 cport:27383)::PrepRequestProcessor@154] - PrepRequestProcessor exited loop!
    [junit] 2016-05-31 23:26:57,972 [myid:] - INFO  [SyncThread:0:SyncRequestProcessor@169] - SyncRequestProcessor exited!
    [junit] 2016-05-31 23:26:57,973 [myid:] - INFO  [main:FinalRequestProcessor@479] - shutdown of request processor complete
    [junit] 2016-05-31 23:26:57,973 [myid:] - INFO  [main:MBeanRegistry@128] - Unregister MBean [org.apache.ZooKeeperService:name0=StandaloneServer_port27383,name1=InMemoryDataTree]
    [junit] 2016-05-31 23:26:57,973 [myid:] - INFO  [main:MBeanRegistry@128] - Unregister MBean [org.apache.ZooKeeperService:name0=StandaloneServer_port27383]
    [junit] 2016-05-31 23:26:57,974 [myid:] - INFO  [main:FourLetterWordMain@85] - connecting to 127.0.0.1 27383
    [junit] 2016-05-31 23:26:57,974 [myid:] - INFO  [main:JMXEnv@146] - ensureOnly:[]
    [junit] 2016-05-31 23:26:57,979 [myid:] - INFO  [main:ClientBase@562] - fdcount after test is: 51 at start it was 51
    [junit] 2016-05-31 23:26:57,979 [myid:] - INFO  [main:ZKTestCase$1@65] - SUCCEEDED testManyChildWatchersAutoReset
    [junit] 2016-05-31 23:26:57,979 [myid:] - INFO  [main:ZKTestCase$1@60] - FINISHED testManyChildWatchersAutoReset
    [junit] Tests run: 4, Failures: 0, Errors: 0, Skipped: 0, Time elapsed: 398.383 sec, Thread: 7, Class: org.apache.zookeeper.test.DisconnectedWatcherTest

BUILD FAILED
/home/jenkins/jenkins-slave/workspace/ZooKeeper-trunk/trunk/build.xml:1322: The following error occurred while executing this line:
/home/jenkins/jenkins-slave/workspace/ZooKeeper-trunk/trunk/build.xml:1207: Tests failed!

Total time: 9 minutes 33 seconds
Build step 'Execute shell' marked build as failure
[FINDBUGS] Skipping publisher since build result is FAILURE
[WARNINGS] Skipping publisher since build result is FAILURE
Archiving artifacts
Setting LATEST1_7_HOME=/home/jenkins/jenkins-slave/tools/hudson.model.JDK/latest1.7
Recording fingerprints
Setting LATEST1_7_HOME=/home/jenkins/jenkins-slave/tools/hudson.model.JDK/latest1.7
Recording test results
Setting LATEST1_7_HOME=/home/jenkins/jenkins-slave/tools/hudson.model.JDK/latest1.7
Publishing Javadoc
Setting LATEST1_7_HOME=/home/jenkins/jenkins-slave/tools/hudson.model.JDK/latest1.7
Email was triggered for: Failure - Any
Sending email for trigger: Failure - Any
Setting LATEST1_7_HOME=/home/jenkins/jenkins-slave/tools/hudson.model.JDK/latest1.7
Setting LATEST1_7_HOME=/home/jenkins/jenkins-slave/tools/hudson.model.JDK/latest1.7



###################################################################################
############################## FAILED TESTS (if any) ##############################
1 tests failed.
FAILED:  org.apache.zookeeper.test.ReconfigTest.testPortChange

Error Message:
expected:<test[1]> but was:<test[0]>

Stack Trace:
junit.framework.AssertionFailedError: expected:<test[1]> but was:<test[0]>
	at org.apache.zookeeper.test.ReconfigTest.testNormalOperation(ReconfigTest.java:150)
	at org.apache.zookeeper.test.ReconfigTest.testPortChange(ReconfigTest.java:598)
	at org.apache.zookeeper.JUnit4ZKTestRunner$LoggedInvokeMethod.evaluate(JUnit4ZKTestRunner.java:79)