You are viewing a plain text version of this content. The canonical link for it is here.
Posted to commits@karaf.apache.org by Apache Jenkins Server <je...@builds.apache.org> on 2016/04/19 17:50:34 UTC
Build failed in Jenkins: karaf-decanter-master #61
See <https://builds.apache.org/job/karaf-decanter-master/61/changes>
Changes:
[jbonofre] [KARAF-4495] Add custom fields support in all collectors
[jbonofre] [KARAF-4443] Update doc regarding Kibana 4
[jbonofre] Update RELEASE-NOTES in preparation for 1.1.0 release
[jbonofre] [maven-release-plugin] prepare release decanter-1.1.0
[jbonofre] [maven-release-plugin] prepare for next development iteration
------------------------------------------
[...truncated 230 lines...]
[INFO] Downloaded: https://repo.maven.apache.org/maven2/org/slf4j/slf4j-api/1.7.7/slf4j-api-1.7.7.pom (3 KB at 119.4 KB/sec)
[INFO] Downloading: https://repo.maven.apache.org/maven2/org/slf4j/slf4j-parent/1.7.7/slf4j-parent-1.7.7.pom
[INFO] Downloaded: https://repo.maven.apache.org/maven2/org/slf4j/slf4j-parent/1.7.7/slf4j-parent-1.7.7.pom (12 KB at 505.6 KB/sec)
[INFO] Downloading: https://repo.maven.apache.org/maven2/org/slf4j/slf4j-simple/1.7.7/slf4j-simple-1.7.7.pom
[INFO] Downloaded: https://repo.maven.apache.org/maven2/org/slf4j/slf4j-simple/1.7.7/slf4j-simple-1.7.7.pom (2 KB at 65.3 KB/sec)
[INFO] Downloading: https://repo.maven.apache.org/maven2/junit/junit/4.12/junit-4.12.pom
[INFO] Downloaded: https://repo.maven.apache.org/maven2/junit/junit/4.12/junit-4.12.pom (24 KB at 889.3 KB/sec)
[INFO] Downloading: https://repo.maven.apache.org/maven2/org/osgi/org.osgi.compendium/4.3.1/org.osgi.compendium-4.3.1.jar
[INFO] Downloading: https://repo.maven.apache.org/maven2/org/slf4j/slf4j-api/1.7.7/slf4j-api-1.7.7.jar
[INFO] Downloading: https://repo.maven.apache.org/maven2/org/slf4j/slf4j-simple/1.7.7/slf4j-simple-1.7.7.jar
[INFO] Downloading: https://repo.maven.apache.org/maven2/junit/junit/4.12/junit-4.12.jar
[INFO] Downloaded: https://repo.maven.apache.org/maven2/org/slf4j/slf4j-simple/1.7.7/slf4j-simple-1.7.7.jar (11 KB at 401.3 KB/sec)
[INFO] Downloaded: https://repo.maven.apache.org/maven2/org/slf4j/slf4j-api/1.7.7/slf4j-api-1.7.7.jar (29 KB at 1098.9 KB/sec)
[INFO] Downloaded: https://repo.maven.apache.org/maven2/junit/junit/4.12/junit-4.12.jar (308 KB at 7885.9 KB/sec)
[INFO] Downloaded: https://repo.maven.apache.org/maven2/org/osgi/org.osgi.compendium/4.3.1/org.osgi.compendium-4.3.1.jar (750 KB at 14135.1 KB/sec)
[INFO]
[INFO] --- maven-clean-plugin:2.5:clean (default-clean) @ decanter ---
[INFO] Downloading: https://repo.maven.apache.org/maven2/org/codehaus/plexus/plexus-utils/3.0/plexus-utils-3.0.jar
[INFO] Downloaded: https://repo.maven.apache.org/maven2/org/codehaus/plexus/plexus-utils/3.0/plexus-utils-3.0.jar (221 KB at 7884.8 KB/sec)
[INFO]
[INFO] --- maven-antrun-plugin:1.7:run (copy-notice) @ decanter ---
[INFO] Downloading: https://repo.maven.apache.org/maven2/org/apache/maven/maven-plugin-api/2.0.11/maven-plugin-api-2.0.11.pom
[INFO] Downloaded: https://repo.maven.apache.org/maven2/org/apache/maven/maven-plugin-api/2.0.11/maven-plugin-api-2.0.11.pom (2 KB at 71.4 KB/sec)
[INFO] Downloading: https://repo.maven.apache.org/maven2/org/apache/maven/maven/2.0.11/maven-2.0.11.pom
[INFO] Downloaded: https://repo.maven.apache.org/maven2/org/apache/maven/maven/2.0.11/maven-2.0.11.pom (22 KB at 969.3 KB/sec)
[INFO] Downloading: https://repo.maven.apache.org/maven2/org/apache/maven/maven-parent/12/maven-parent-12.pom
[INFO] Downloaded: https://repo.maven.apache.org/maven2/org/apache/maven/maven-parent/12/maven-parent-12.pom (22 KB at 884.6 KB/sec)
[INFO] Downloading: https://repo.maven.apache.org/maven2/org/apache/maven/maven-project/2.0.11/maven-project-2.0.11.pom
[INFO] Downloaded: https://repo.maven.apache.org/maven2/org/apache/maven/maven-project/2.0.11/maven-project-2.0.11.pom (3 KB at 129.1 KB/sec)
[INFO] Downloading: https://repo.maven.apache.org/maven2/org/apache/maven/maven-settings/2.0.11/maven-settings-2.0.11.pom
[INFO] Downloaded: https://repo.maven.apache.org/maven2/org/apache/maven/maven-settings/2.0.11/maven-settings-2.0.11.pom (3 KB at 106.6 KB/sec)
[INFO] Downloading: https://repo.maven.apache.org/maven2/org/apache/maven/maven-model/2.0.11/maven-model-2.0.11.pom
[INFO] Downloaded: https://repo.maven.apache.org/maven2/org/apache/maven/maven-model/2.0.11/maven-model-2.0.11.pom (4 KB at 158.4 KB/sec)
[INFO] Downloading: https://repo.maven.apache.org/maven2/org/codehaus/plexus/plexus-interpolation/1.1/plexus-interpolation-1.1.pom
[INFO] Downloaded: https://repo.maven.apache.org/maven2/org/codehaus/plexus/plexus-interpolation/1.1/plexus-interpolation-1.1.pom (2 KB at 42.5 KB/sec)
[INFO] Downloading: https://repo.maven.apache.org/maven2/org/apache/maven/maven-profile/2.0.11/maven-profile-2.0.11.pom
[INFO] Downloaded: https://repo.maven.apache.org/maven2/org/apache/maven/maven-profile/2.0.11/maven-profile-2.0.11.pom (2 KB at 99.8 KB/sec)
[INFO] Downloading: https://repo.maven.apache.org/maven2/org/apache/maven/maven-artifact-manager/2.0.11/maven-artifact-manager-2.0.11.pom
[INFO] Downloaded: https://repo.maven.apache.org/maven2/org/apache/maven/maven-artifact-manager/2.0.11/maven-artifact-manager-2.0.11.pom (3 KB at 128.5 KB/sec)
[INFO] Downloading: https://repo.maven.apache.org/maven2/org/apache/maven/maven-repository-metadata/2.0.11/maven-repository-metadata-2.0.11.pom
[INFO] Downloaded: https://repo.maven.apache.org/maven2/org/apache/maven/maven-repository-metadata/2.0.11/maven-repository-metadata-2.0.11.pom (3 KB at 110.3 KB/sec)
[INFO] Downloading: https://repo.maven.apache.org/maven2/org/apache/maven/maven-artifact/2.0.11/maven-artifact-2.0.11.pom
[INFO] Downloaded: https://repo.maven.apache.org/maven2/org/apache/maven/maven-artifact/2.0.11/maven-artifact-2.0.11.pom (2 KB at 77.4 KB/sec)
[INFO] Downloading: https://repo.maven.apache.org/maven2/org/apache/maven/maven-plugin-registry/2.0.11/maven-plugin-registry-2.0.11.pom
[INFO] Downloaded: https://repo.maven.apache.org/maven2/org/apache/maven/maven-plugin-registry/2.0.11/maven-plugin-registry-2.0.11.pom (2 KB at 89.8 KB/sec)
[INFO] Downloading: https://repo.maven.apache.org/maven2/org/apache/maven/maven-plugin-api/2.0.11/maven-plugin-api-2.0.11.jar
[INFO] Downloading: https://repo.maven.apache.org/maven2/org/apache/maven/maven-project/2.0.11/maven-project-2.0.11.jar
[INFO] Downloading: https://repo.maven.apache.org/maven2/org/apache/maven/maven-settings/2.0.11/maven-settings-2.0.11.jar
[INFO] Downloading: https://repo.maven.apache.org/maven2/org/apache/maven/maven-profile/2.0.11/maven-profile-2.0.11.jar
[INFO] Downloading: https://repo.maven.apache.org/maven2/org/apache/maven/maven-model/2.0.11/maven-model-2.0.11.jar
[INFO] Downloaded: https://repo.maven.apache.org/maven2/org/apache/maven/maven-plugin-api/2.0.11/maven-plugin-api-2.0.11.jar (13 KB at 425.7 KB/sec)
[INFO] Downloading: https://repo.maven.apache.org/maven2/org/apache/maven/maven-artifact-manager/2.0.11/maven-artifact-manager-2.0.11.jar
[INFO] Downloaded: https://repo.maven.apache.org/maven2/org/apache/maven/maven-settings/2.0.11/maven-settings-2.0.11.jar (51 KB at 1730.7 KB/sec)
[INFO] Downloading: https://repo.maven.apache.org/maven2/org/apache/maven/maven-repository-metadata/2.0.11/maven-repository-metadata-2.0.11.jar
[INFO] Downloaded: https://repo.maven.apache.org/maven2/org/apache/maven/maven-project/2.0.11/maven-project-2.0.11.jar (121 KB at 3889.5 KB/sec)
[INFO] Downloading: https://repo.maven.apache.org/maven2/org/apache/maven/maven-plugin-registry/2.0.11/maven-plugin-registry-2.0.11.jar
[INFO] Downloaded: https://repo.maven.apache.org/maven2/org/apache/maven/maven-profile/2.0.11/maven-profile-2.0.11.jar (37 KB at 1067.6 KB/sec)
[INFO] Downloading: https://repo.maven.apache.org/maven2/org/codehaus/plexus/plexus-interpolation/1.1/plexus-interpolation-1.1.jar
[INFO] Downloaded: https://repo.maven.apache.org/maven2/org/apache/maven/maven-model/2.0.11/maven-model-2.0.11.jar (95 KB at 2698.6 KB/sec)
[INFO] Downloading: https://repo.maven.apache.org/maven2/org/apache/maven/maven-artifact/2.0.11/maven-artifact-2.0.11.jar
[INFO] Downloaded: https://repo.maven.apache.org/maven2/org/apache/maven/maven-repository-metadata/2.0.11/maven-repository-metadata-2.0.11.jar (26 KB at 596.4 KB/sec)
[INFO] Downloaded: https://repo.maven.apache.org/maven2/org/apache/maven/maven-plugin-registry/2.0.11/maven-plugin-registry-2.0.11.jar (30 KB at 680.1 KB/sec)
[INFO] Downloaded: https://repo.maven.apache.org/maven2/org/apache/maven/maven-artifact-manager/2.0.11/maven-artifact-manager-2.0.11.jar (58 KB at 1241.9 KB/sec)
[INFO] Downloaded: https://repo.maven.apache.org/maven2/org/codehaus/plexus/plexus-interpolation/1.1/plexus-interpolation-1.1.jar (35 KB at 721.9 KB/sec)
[INFO] Downloaded: https://repo.maven.apache.org/maven2/org/apache/maven/maven-artifact/2.0.11/maven-artifact-2.0.11.jar (88 KB at 1534.0 KB/sec)
[INFO] Executing tasks
main:
[copy] Copying 1 file to <https://builds.apache.org/job/karaf-decanter-master/ws/target/maven-shared-archive-resources/META-INF>
[INFO] Executed tasks
[INFO]
[INFO] --- maven-remote-resources-plugin:1.5:process (default) @ decanter ---
[INFO]
[INFO] --- maven-site-plugin:3.4:attach-descriptor (attach-descriptor) @ decanter ---
[INFO]
[INFO] --- maven-bundle-plugin:3.0.0:baseline (baseline) @ decanter ---
[INFO] Skipping Baseline execution
[INFO]
[INFO] --- maven-install-plugin:2.5.1:install (default-install) @ decanter ---
[INFO] Installing <https://builds.apache.org/job/karaf-decanter-master/ws/pom.xml> to /home/jenkins/jenkins-slave/maven-repositories/0/org/apache/karaf/decanter/1.1.1-SNAPSHOT/decanter-1.1.1-SNAPSHOT.pom
[INFO]
[INFO] --- maven-deploy-plugin:2.8.1:deploy (default-deploy) @ decanter ---
[INFO] Downloading: https://repository.apache.org/content/repositories/snapshots/org/apache/karaf/decanter/1.1.1-SNAPSHOT/maven-metadata.xml
[INFO] Uploading: https://repository.apache.org/content/repositories/snapshots/org/apache/karaf/decanter/1.1.1-SNAPSHOT/decanter-1.1.1-20160419.154954-1.pom
[INFO] ------------------------------------------------------------------------
[INFO] Reactor Summary:
[INFO]
[INFO] Apache Karaf :: Decanter ........................... FAILURE [ 6.599 s]
[INFO] Apache Karaf :: Decanter :: API .................... SKIPPED
[INFO] Apache Karaf :: Decanter :: Scheduler .............. SKIPPED
[INFO] Apache Karaf :: Decanter :: Scheduler :: Simple .... SKIPPED
[INFO] Apache Karaf :: Decanter :: Collector .............. SKIPPED
[INFO] Apache Karaf :: Decanter :: Collector :: JMX ....... SKIPPED
[INFO] Apache Karaf :: Decanter :: Collector :: Log ....... SKIPPED
[INFO] Apache Karaf :: Decanter :: Collector :: File ...... SKIPPED
[INFO] Apache Karaf :: Decanter :: Collector :: Camel Tracer SKIPPED
[INFO] Apache Karaf :: Decanter :: Collector :: System .... SKIPPED
[INFO] Apache Karaf :: Decanter :: Collector :: Log Socket SKIPPED
[INFO] Apache Karaf :: Decanter :: Collector :: REST ...... SKIPPED
[INFO] Apache Karaf :: Decanter :: Collector :: EventAdmin SKIPPED
[INFO] Apache Karaf :: Decanter :: Appender ............... SKIPPED
[INFO] Apache Karaf :: Decanter :: Appender :: Log ........ SKIPPED
[INFO] Apache Karaf :: Decanter :: Marshaller ............. SKIPPED
[INFO] Apache Karaf :: Decanter :: Marshaller :: Json ..... SKIPPED
[INFO] Apache Karaf :: Decanter :: Appender :: Elasticsearch Native 1.x SKIPPED
[INFO] Apache Karaf :: Decanter :: Appender :: Elasticsearch Native 2.x SKIPPED
[INFO] Apache Karaf :: Decanter :: Appender :: Elasticsearch REST SKIPPED
[INFO] Apache Karaf :: Decanter :: Appender :: JDBC ....... SKIPPED
[INFO] Apache Karaf :: Decanter :: Appender :: JMS ........ SKIPPED
[INFO] Apache Karaf :: Decanter :: Appender :: Camel ...... SKIPPED
[INFO] Apache Karaf :: Decanter :: Appender :: Kafka ...... SKIPPED
[INFO] Apache Karaf :: Decanter :: Appender :: MQTT ....... SKIPPED
[INFO] Apache Karaf :: Decanter :: Appender :: Cassandra .. SKIPPED
[INFO] Apache Karaf :: Decanter :: Appender :: Redis ...... SKIPPED
[INFO] Apache Karaf :: Decanter :: SLA .................... SKIPPED
[INFO] Apache Karaf :: Decanter :: SLA :: Checker ......... SKIPPED
[INFO] Apache Karaf :: Decanter :: SLA :: Log ............. SKIPPED
[INFO] Apache Karaf :: Decanter :: SLA :: e-mail .......... SKIPPED
[INFO] Apache Karaf :: Decanter :: SLA :: Camel ........... SKIPPED
[INFO] Apache Karaf :: Decanter :: Elasticsearch 1.x ...... SKIPPED
[INFO] Apache Karaf :: Decanter :: Elasticsearch 2.x ...... SKIPPED
[INFO] Apache Karaf :: Decanter :: Elasticsearch Head 1.x . SKIPPED
[INFO] Apache Karaf :: Decanter :: Elasticsearch Head 2.x . SKIPPED
[INFO] Apache Karaf :: Decanter :: Kibana ................. SKIPPED
[INFO] Apache Karaf :: Decanter :: Kibana 4.x ............. SKIPPED
[INFO] Apache Karaf :: Decanter :: Assembly ............... SKIPPED
[INFO] ------------------------------------------------------------------------
[INFO] BUILD FAILURE
[INFO] ------------------------------------------------------------------------
[INFO] Total time: 26.543 s
[INFO] Finished at: 2016-04-19T15:50:11+00:00
[INFO] Final Memory: 36M/453M
[INFO] ------------------------------------------------------------------------
Waiting for Jenkins to finish collecting data
[ERROR] Failed to execute goal org.apache.maven.plugins:maven-deploy-plugin:2.8.1:deploy (default-deploy) on project decanter: Failed to deploy artifacts: Could not transfer artifact org.apache.karaf:decanter:pom:1.1.1-20160419.154954-1 from/to apache.snapshots.https (https://repository.apache.org/content/repositories/snapshots): Failed to transfer file: https://repository.apache.org/content/repositories/snapshots/org/apache/karaf/decanter/1.1.1-SNAPSHOT/decanter-1.1.1-20160419.154954-1.pom. Return code is: 401, ReasonPhrase: Unauthorized. -> [Help 1]
org.apache.maven.lifecycle.LifecycleExecutionException: Failed to execute goal org.apache.maven.plugins:maven-deploy-plugin:2.8.1:deploy (default-deploy) on project decanter: Failed to deploy artifacts: Could not transfer artifact org.apache.karaf:decanter:pom:1.1.1-20160419.154954-1 from/to apache.snapshots.https (https://repository.apache.org/content/repositories/snapshots): Failed to transfer file: https://repository.apache.org/content/repositories/snapshots/org/apache/karaf/decanter/1.1.1-SNAPSHOT/decanter-1.1.1-20160419.154954-1.pom. Return code is: 401, ReasonPhrase: Unauthorized.
at org.apache.maven.lifecycle.internal.MojoExecutor.execute(MojoExecutor.java:216)
at org.apache.maven.lifecycle.internal.MojoExecutor.execute(MojoExecutor.java:153)
at org.apache.maven.lifecycle.internal.MojoExecutor.execute(MojoExecutor.java:145)
at org.apache.maven.lifecycle.internal.LifecycleModuleBuilder.buildProject(LifecycleModuleBuilder.java:116)
at org.apache.maven.lifecycle.internal.LifecycleModuleBuilder.buildProject(LifecycleModuleBuilder.java:80)
at org.apache.maven.lifecycle.internal.builder.singlethreaded.SingleThreadedBuilder.build(SingleThreadedBuilder.java:51)
at org.apache.maven.lifecycle.internal.LifecycleStarter.execute(LifecycleStarter.java:128)
at org.apache.maven.DefaultMaven.doExecute(DefaultMaven.java:307)
at org.apache.maven.DefaultMaven.doExecute(DefaultMaven.java:193)
at org.apache.maven.DefaultMaven.execute(DefaultMaven.java:106)
at org.jvnet.hudson.maven3.launcher.Maven32Launcher.main(Maven32Launcher.java:132)
at sun.reflect.NativeMethodAccessorImpl.invoke0(Native Method)
at sun.reflect.NativeMethodAccessorImpl.invoke(NativeMethodAccessorImpl.java:57)
at sun.reflect.DelegatingMethodAccessorImpl.invoke(DelegatingMethodAccessorImpl.java:43)
at java.lang.reflect.Method.invoke(Method.java:606)
at org.codehaus.plexus.classworlds.launcher.Launcher.launchStandard(Launcher.java:330)
at org.codehaus.plexus.classworlds.launcher.Launcher.launch(Launcher.java:238)
at jenkins.maven3.agent.Maven32Main.launch(Maven32Main.java:186)
at sun.reflect.NativeMethodAccessorImpl.invoke0(Native Method)
at sun.reflect.NativeMethodAccessorImpl.invoke(NativeMethodAccessorImpl.java:57)
at sun.reflect.DelegatingMethodAccessorImpl.invoke(DelegatingMethodAccessorImpl.java:43)
at java.lang.reflect.Method.invoke(Method.java:606)
at hudson.maven.Maven3Builder.call(Maven3Builder.java:136)
at hudson.maven.Maven3Builder.call(Maven3Builder.java:71)
at hudson.remoting.UserRequest.perform(UserRequest.java:120)
at hudson.remoting.UserRequest.perform(UserRequest.java:48)
at hudson.remoting.Request$2.run(Request.java:326)
at hudson.remoting.InterceptingExecutorService$1.call(InterceptingExecutorService.java:68)
at java.util.concurrent.FutureTask.run(FutureTask.java:262)
at java.util.concurrent.ThreadPoolExecutor.runWorker(ThreadPoolExecutor.java:1145)
at java.util.concurrent.ThreadPoolExecutor$Worker.run(ThreadPoolExecutor.java:615)
at java.lang.Thread.run(Thread.java:744)
Caused by: org.apache.maven.plugin.MojoExecutionException: Failed to deploy artifacts: Could not transfer artifact org.apache.karaf:decanter:pom:1.1.1-20160419.154954-1 from/to apache.snapshots.https (https://repository.apache.org/content/repositories/snapshots): Failed to transfer file: https://repository.apache.org/content/repositories/snapshots/org/apache/karaf/decanter/1.1.1-SNAPSHOT/decanter-1.1.1-20160419.154954-1.pom. Return code is: 401, ReasonPhrase: Unauthorized.
at org.apache.maven.plugin.deploy.DeployMojo.deployProject(DeployMojo.java:282)
at org.apache.maven.plugin.deploy.DeployMojo.execute(DeployMojo.java:169)
at org.apache.maven.plugin.DefaultBuildPluginManager.executeMojo(DefaultBuildPluginManager.java:134)
at org.apache.maven.lifecycle.internal.MojoExecutor.execute(MojoExecutor.java:208)
... 31 more
Caused by: org.apache.maven.artifact.deployer.ArtifactDeploymentException: Failed to deploy artifacts: Could not transfer artifact org.apache.karaf:decanter:pom:1.1.1-20160419.154954-1 from/to apache.snapshots.https (https://repository.apache.org/content/repositories/snapshots): Failed to transfer file: https://repository.apache.org/content/repositories/snapshots/org/apache/karaf/decanter/1.1.1-SNAPSHOT/decanter-1.1.1-20160419.154954-1.pom. Return code is: 401, ReasonPhrase: Unauthorized.
at org.apache.maven.artifact.deployer.DefaultArtifactDeployer.deploy(DefaultArtifactDeployer.java:143)
at org.apache.maven.plugin.deploy.AbstractDeployMojo.deploy(AbstractDeployMojo.java:171)
at org.apache.maven.plugin.deploy.DeployMojo.deployProject(DeployMojo.java:240)
... 34 more
Caused by: org.eclipse.aether.deployment.DeploymentException: Failed to deploy artifacts: Could not transfer artifact org.apache.karaf:decanter:pom:1.1.1-20160419.154954-1 from/to apache.snapshots.https (https://repository.apache.org/content/repositories/snapshots): Failed to transfer file: https://repository.apache.org/content/repositories/snapshots/org/apache/karaf/decanter/1.1.1-SNAPSHOT/decanter-1.1.1-20160419.154954-1.pom. Return code is: 401, ReasonPhrase: Unauthorized.
at org.eclipse.aether.internal.impl.DefaultDeployer.deploy(DefaultDeployer.java:317)
at org.eclipse.aether.internal.impl.DefaultDeployer.deploy(DefaultDeployer.java:245)
at org.eclipse.aether.internal.impl.DefaultRepositorySystem.deploy(DefaultRepositorySystem.java:413)
at org.apache.maven.artifact.deployer.DefaultArtifactDeployer.deploy(DefaultArtifactDeployer.java:139)
... 36 more
Caused by: org.eclipse.aether.transfer.ArtifactTransferException: Could not transfer artifact org.apache.karaf:decanter:pom:1.1.1-20160419.154954-1 from/to apache.snapshots.https (https://repository.apache.org/content/repositories/snapshots): Failed to transfer file: https://repository.apache.org/content/repositories/snapshots/org/apache/karaf/decanter/1.1.1-SNAPSHOT/decanter-1.1.1-20160419.154954-1.pom. Return code is: 401, ReasonPhrase: Unauthorized.
at org.eclipse.aether.connector.basic.ArtifactTransportListener.transferFailed(ArtifactTransportListener.java:43)
at org.eclipse.aether.connector.basic.BasicRepositoryConnector$TaskRunner.run(BasicRepositoryConnector.java:355)
at org.eclipse.aether.connector.basic.BasicRepositoryConnector.put(BasicRepositoryConnector.java:274)
at org.eclipse.aether.internal.impl.DefaultDeployer.deploy(DefaultDeployer.java:311)
... 39 more
Caused by: org.apache.maven.wagon.TransferFailedException: Failed to transfer file: https://repository.apache.org/content/repositories/snapshots/org/apache/karaf/decanter/1.1.1-SNAPSHOT/decanter-1.1.1-20160419.154954-1.pom. Return code is: 401, ReasonPhrase: Unauthorized.
at org.apache.maven.wagon.providers.http.AbstractHttpClientWagon.put(AbstractHttpClientWagon.java:627)
at org.apache.maven.wagon.providers.http.AbstractHttpClientWagon.put(AbstractHttpClientWagon.java:541)
at org.apache.maven.wagon.providers.http.AbstractHttpClientWagon.put(AbstractHttpClientWagon.java:523)
at org.apache.maven.wagon.providers.http.AbstractHttpClientWagon.put(AbstractHttpClientWagon.java:517)
at org.apache.maven.wagon.providers.http.AbstractHttpClientWagon.put(AbstractHttpClientWagon.java:497)
at org.eclipse.aether.transport.wagon.WagonTransporter$PutTaskRunner.run(WagonTransporter.java:644)
at org.eclipse.aether.transport.wagon.WagonTransporter.execute(WagonTransporter.java:427)
at org.eclipse.aether.transport.wagon.WagonTransporter.put(WagonTransporter.java:410)
at org.eclipse.aether.connector.basic.BasicRepositoryConnector$PutTaskRunner.runTask(BasicRepositoryConnector.java:510)
at org.eclipse.aether.connector.basic.BasicRepositoryConnector$TaskRunner.run(BasicRepositoryConnector.java:350)
... 41 more
[ERROR]
[ERROR] Re-run Maven using the -X switch to enable full debug logging.
[ERROR]
[ERROR] For more information about the errors and possible solutions, please read the following articles:
[ERROR] [Help 1] http://cwiki.apache.org/confluence/display/MAVEN/MojoExecutionException
[JENKINS] Archiving <https://builds.apache.org/job/karaf-decanter-master/ws/elasticsearch-head-2.x/pom.xml> to org.apache.karaf.decanter/org.apache.karaf.decanter.elasticsearch-head-2.x/1.1.1-SNAPSHOT/org.apache.karaf.decanter.elasticsearch-head-2.x-1.1.1-SNAPSHOT.pom
[JENKINS] Archiving <https://builds.apache.org/job/karaf-decanter-master/ws/collector/jmx/pom.xml> to org.apache.karaf.decanter.collector/org.apache.karaf.decanter.collector.jmx/1.1.1-SNAPSHOT/org.apache.karaf.decanter.collector.jmx-1.1.1-SNAPSHOT.pom
[JENKINS] Archiving <https://builds.apache.org/job/karaf-decanter-master/ws/appender/elasticsearch-native-2.x/pom.xml> to org.apache.karaf.decanter.appender/org.apache.karaf.decanter.appender.elasticsearch-native-2.x/1.1.1-SNAPSHOT/org.apache.karaf.decanter.appender.elasticsearch-native-2.x-1.1.1-SNAPSHOT.pom
[JENKINS] Archiving <https://builds.apache.org/job/karaf-decanter-master/ws/collector/pom.xml> to org.apache.karaf.decanter/collector/1.1.1-SNAPSHOT/collector-1.1.1-SNAPSHOT.pom
[JENKINS] Archiving <https://builds.apache.org/job/karaf-decanter-master/ws/marshaller/json/pom.xml> to org.apache.karaf.decanter.marshaller/org.apache.karaf.decanter.marshaller.json/1.1.1-SNAPSHOT/org.apache.karaf.decanter.marshaller.json-1.1.1-SNAPSHOT.pom
[JENKINS] Archiving <https://builds.apache.org/job/karaf-decanter-master/ws/collector/camel-tracer/pom.xml> to org.apache.karaf.decanter.collector/org.apache.karaf.decanter.collector.camel-tracer/1.1.1-SNAPSHOT/org.apache.karaf.decanter.collector.camel-tracer-1.1.1-SNAPSHOT.pom
[JENKINS] Archiving <https://builds.apache.org/job/karaf-decanter-master/ws/appender/jdbc/pom.xml> to org.apache.karaf.decanter.appender/org.apache.karaf.decanter.appender.jdbc/1.1.1-SNAPSHOT/org.apache.karaf.decanter.appender.jdbc-1.1.1-SNAPSHOT.pom
[JENKINS] Archiving <https://builds.apache.org/job/karaf-decanter-master/ws/appender/redis/pom.xml> to org.apache.karaf.decanter.appender/org.apache.karaf.decanter.appender.redis/1.1.1-SNAPSHOT/org.apache.karaf.decanter.appender.redis-1.1.1-SNAPSHOT.pom
[JENKINS] Archiving <https://builds.apache.org/job/karaf-decanter-master/ws/collector/file/pom.xml> to org.apache.karaf.decanter.collector/org.apache.karaf.decanter.collector.file/1.1.1-SNAPSHOT/org.apache.karaf.decanter.collector.file-1.1.1-SNAPSHOT.pom
[JENKINS] Archiving <https://builds.apache.org/job/karaf-decanter-master/ws/api/pom.xml> to org.apache.karaf.decanter/org.apache.karaf.decanter.api/1.1.1-SNAPSHOT/org.apache.karaf.decanter.api-1.1.1-SNAPSHOT.pom
[JENKINS] Archiving <https://builds.apache.org/job/karaf-decanter-master/ws/appender/pom.xml> to org.apache.karaf.decanter/appender/1.1.1-SNAPSHOT/appender-1.1.1-SNAPSHOT.pom
[JENKINS] Archiving <https://builds.apache.org/job/karaf-decanter-master/ws/elasticsearch-1.x/pom.xml> to org.apache.karaf.decanter/org.apache.karaf.decanter.elasticsearch-1.x/1.1.1-SNAPSHOT/org.apache.karaf.decanter.elasticsearch-1.x-1.1.1-SNAPSHOT.pom
[JENKINS] Archiving <https://builds.apache.org/job/karaf-decanter-master/ws/elasticsearch-head-1.x/pom.xml> to org.apache.karaf.decanter/org.apache.karaf.decanter.elasticsearch-head-1.x/1.1.1-SNAPSHOT/org.apache.karaf.decanter.elasticsearch-head-1.x-1.1.1-SNAPSHOT.pom
[JENKINS] Archiving <https://builds.apache.org/job/karaf-decanter-master/ws/kibana-3.x/pom.xml> to org.apache.karaf.decanter/org.apache.karaf.decanter.kibana-3.x/1.1.1-SNAPSHOT/org.apache.karaf.decanter.kibana-3.x-1.1.1-SNAPSHOT.pom
[JENKINS] Archiving <https://builds.apache.org/job/karaf-decanter-master/ws/appender/kafka/pom.xml> to org.apache.karaf.decanter.appender/org.apache.karaf.decanter.appender.kafka/1.1.1-SNAPSHOT/org.apache.karaf.decanter.appender.kafka-1.1.1-SNAPSHOT.pom
[JENKINS] Archiving <https://builds.apache.org/job/karaf-decanter-master/ws/appender/jms/pom.xml> to org.apache.karaf.decanter.appender/org.apache.karaf.decanter.appender.jms/1.1.1-SNAPSHOT/org.apache.karaf.decanter.appender.jms-1.1.1-SNAPSHOT.pom
[JENKINS] Archiving <https://builds.apache.org/job/karaf-decanter-master/ws/appender/elasticsearch-native-1.x/pom.xml> to org.apache.karaf.decanter.appender/org.apache.karaf.decanter.appender.elasticsearch-native-1.x/1.1.1-SNAPSHOT/org.apache.karaf.decanter.appender.elasticsearch-native-1.x-1.1.1-SNAPSHOT.pom
[JENKINS] Archiving <https://builds.apache.org/job/karaf-decanter-master/ws/appender/log/pom.xml> to org.apache.karaf.decanter.appender/org.apache.karaf.decanter.appender.log/1.1.1-SNAPSHOT/org.apache.karaf.decanter.appender.log-1.1.1-SNAPSHOT.pom
[JENKINS] Archiving <https://builds.apache.org/job/karaf-decanter-master/ws/collector/log4j-socket/pom.xml> to org.apache.karaf.decanter.collector/org.apache.karaf.decanter.collector.log.socket/1.1.1-SNAPSHOT/org.apache.karaf.decanter.collector.log.socket-1.1.1-SNAPSHOT.pom
[JENKINS] Archiving <https://builds.apache.org/job/karaf-decanter-master/ws/scheduler/simple/pom.xml> to org.apache.karaf.decanter.scheduler/org.apache.karaf.decanter.scheduler.simple/1.1.1-SNAPSHOT/org.apache.karaf.decanter.scheduler.simple-1.1.1-SNAPSHOT.pom
[JENKINS] Archiving <https://builds.apache.org/job/karaf-decanter-master/ws/sla/log/pom.xml> to org.apache.karaf.decanter.sla/org.apache.karaf.decanter.sla.log/1.1.1-SNAPSHOT/org.apache.karaf.decanter.sla.log-1.1.1-SNAPSHOT.pom
[JENKINS] Archiving <https://builds.apache.org/job/karaf-decanter-master/ws/sla/camel/pom.xml> to org.apache.karaf.decanter.sla/org.apache.karaf.decanter.sla.camel/1.1.1-SNAPSHOT/org.apache.karaf.decanter.sla.camel-1.1.1-SNAPSHOT.pom
[JENKINS] Archiving <https://builds.apache.org/job/karaf-decanter-master/ws/sla/email/pom.xml> to org.apache.karaf.decanter.sla/org.apache.karaf.decanter.sla.email/1.1.1-SNAPSHOT/org.apache.karaf.decanter.sla.email-1.1.1-SNAPSHOT.pom
[JENKINS] Archiving <https://builds.apache.org/job/karaf-decanter-master/ws/collector/rest/pom.xml> to org.apache.karaf.decanter.collector/org.apache.karaf.decanter.collector.rest/1.1.1-SNAPSHOT/org.apache.karaf.decanter.collector.rest-1.1.1-SNAPSHOT.pom
[JENKINS] Archiving <https://builds.apache.org/job/karaf-decanter-master/ws/appender/elasticsearch-rest/pom.xml> to org.apache.karaf.decanter.appender/org.apache.karaf.decanter.appender.elasticsearch.rest/1.1.1-SNAPSHOT/org.apache.karaf.decanter.appender.elasticsearch.rest-1.1.1-SNAPSHOT.pom
[JENKINS] Archiving <https://builds.apache.org/job/karaf-decanter-master/ws/appender/cassandra/pom.xml> to org.apache.karaf.decanter.appender/org.apache.karaf.decanter.appender.cassandra/1.1.1-SNAPSHOT/org.apache.karaf.decanter.appender.cassandra-1.1.1-SNAPSHOT.pom
[JENKINS] Archiving <https://builds.apache.org/job/karaf-decanter-master/ws/scheduler/pom.xml> to org.apache.karaf.decanter/scheduler/1.1.1-SNAPSHOT/scheduler-1.1.1-SNAPSHOT.pom
[JENKINS] Archiving <https://builds.apache.org/job/karaf-decanter-master/ws/marshaller/pom.xml> to org.apache.karaf.decanter/marshaller/1.1.1-SNAPSHOT/marshaller-1.1.1-SNAPSHOT.pom
[JENKINS] Archiving <https://builds.apache.org/job/karaf-decanter-master/ws/assembly/pom.xml> to org.apache.karaf.decanter/apache-karaf-decanter/1.1.1-SNAPSHOT/apache-karaf-decanter-1.1.1-SNAPSHOT.pom
[JENKINS] Archiving <https://builds.apache.org/job/karaf-decanter-master/ws/appender/camel/pom.xml> to org.apache.karaf.decanter.appender/org.apache.karaf.decanter.appender.camel/1.1.1-SNAPSHOT/org.apache.karaf.decanter.appender.camel-1.1.1-SNAPSHOT.pom
[JENKINS] Archiving <https://builds.apache.org/job/karaf-decanter-master/ws/elasticsearch-2.x/pom.xml> to org.apache.karaf.decanter/org.apache.karaf.decanter.elasticsearch-2.x/1.1.1-SNAPSHOT/org.apache.karaf.decanter.elasticsearch-2.x-1.1.1-SNAPSHOT.pom
[JENKINS] Archiving <https://builds.apache.org/job/karaf-decanter-master/ws/sla/pom.xml> to org.apache.karaf.decanter/sla/1.1.1-SNAPSHOT/sla-1.1.1-SNAPSHOT.pom
[JENKINS] Archiving <https://builds.apache.org/job/karaf-decanter-master/ws/sla/checker/pom.xml> to org.apache.karaf.decanter.sla/org.apache.karaf.decanter.sla.checker/1.1.1-SNAPSHOT/org.apache.karaf.decanter.sla.checker-1.1.1-SNAPSHOT.pom
[JENKINS] Archiving <https://builds.apache.org/job/karaf-decanter-master/ws/pom.xml> to org.apache.karaf/decanter/1.1.1-SNAPSHOT/decanter-1.1.1-SNAPSHOT.pom
[JENKINS] Archiving <https://builds.apache.org/job/karaf-decanter-master/ws/collector/eventadmin/pom.xml> to org.apache.karaf.decanter.collector/org.apache.karaf.decanter.collector.eventadmin/1.1.1-SNAPSHOT/org.apache.karaf.decanter.collector.eventadmin-1.1.1-SNAPSHOT.pom
[JENKINS] Archiving <https://builds.apache.org/job/karaf-decanter-master/ws/appender/mqtt/pom.xml> to org.apache.karaf.decanter.appender/org.apache.karaf.decanter.appender.mqtt/1.1.1-SNAPSHOT/org.apache.karaf.decanter.appender.mqtt-1.1.1-SNAPSHOT.pom
[JENKINS] Archiving <https://builds.apache.org/job/karaf-decanter-master/ws/collector/system/pom.xml> to org.apache.karaf.decanter.collector/org.apache.karaf.decanter.collector.system/1.1.1-SNAPSHOT/org.apache.karaf.decanter.collector.system-1.1.1-SNAPSHOT.pom
[JENKINS] Archiving <https://builds.apache.org/job/karaf-decanter-master/ws/kibana-4.x/pom.xml> to org.apache.karaf.decanter/org.apache.karaf.decanter.kibana-4.x/1.1.1-SNAPSHOT/org.apache.karaf.decanter.kibana-4.x-1.1.1-SNAPSHOT.pom
[JENKINS] Archiving <https://builds.apache.org/job/karaf-decanter-master/ws/collector/log/pom.xml> to org.apache.karaf.decanter.collector/org.apache.karaf.decanter.collector.log/1.1.1-SNAPSHOT/org.apache.karaf.decanter.collector.log-1.1.1-SNAPSHOT.pom
Sending e-mails to: commits@karaf.apache.org jbonofre@apache.org
channel stopped
Jenkins build is back to normal : karaf-decanter-master #62
Posted by Apache Jenkins Server <je...@builds.apache.org>.
See <https://builds.apache.org/job/karaf-decanter-master/62/changes>