You are viewing a plain text version of this content. The canonical link for it is here.
Posted to notifications@maven.apache.org by Apache Jenkins Server <je...@builds.apache.org> on 2014/12/12 18:58:40 UTC
Build failed in Jenkins: maven-plugins #2482
See <https://builds.apache.org/job/maven-plugins/2482/changes>
Changes:
[krosenvold] Fixed IT on 2.2.1
------------------------------------------
[...truncated 19091 lines...]
AU maven-site-plugin/src/test/projects/site-plugin-test11/framework/src/main/java/org/apache/maven/plugin/site/test11/App.java
AU maven-site-plugin/src/test/projects/site-plugin-test11/framework/pom.xml
A maven-site-plugin/src/test/projects/site-plugin-test11/framework/source
A maven-site-plugin/src/test/projects/site-plugin-test11/framework/source/mysite
AU maven-site-plugin/src/test/projects/site-plugin-test11/framework/source/mysite/site.xml
A maven-site-plugin/src/test/projects/site-plugin-test11/framework/source/mysite/apt
AU maven-site-plugin/src/test/projects/site-plugin-test11/framework/source/mysite/apt/test1.apt
AU maven-site-plugin/src/test/projects/site-plugin-test11/framework/source/mysite/apt/index.apt
A maven-site-plugin/src/test/projects/site-plugin-test11/framework2
A maven-site-plugin/src/test/projects/site-plugin-test11/framework2/src
A maven-site-plugin/src/test/projects/site-plugin-test11/framework2/src/test
A maven-site-plugin/src/test/projects/site-plugin-test11/framework2/src/test/java
A maven-site-plugin/src/test/projects/site-plugin-test11/framework2/src/test/java/org
A maven-site-plugin/src/test/projects/site-plugin-test11/framework2/src/test/java/org/apache
A maven-site-plugin/src/test/projects/site-plugin-test11/framework2/src/test/java/org/apache/maven
A maven-site-plugin/src/test/projects/site-plugin-test11/framework2/src/test/java/org/apache/maven/plugin
A maven-site-plugin/src/test/projects/site-plugin-test11/framework2/src/test/java/org/apache/maven/plugin/site
A maven-site-plugin/src/test/projects/site-plugin-test11/framework2/src/test/java/org/apache/maven/plugin/site/test11
AU maven-site-plugin/src/test/projects/site-plugin-test11/framework2/src/test/java/org/apache/maven/plugin/site/test11/AppTest.java
A maven-site-plugin/src/test/projects/site-plugin-test11/framework2/src/main
A maven-site-plugin/src/test/projects/site-plugin-test11/framework2/src/main/java
A maven-site-plugin/src/test/projects/site-plugin-test11/framework2/src/main/java/org
A maven-site-plugin/src/test/projects/site-plugin-test11/framework2/src/main/java/org/apache
A maven-site-plugin/src/test/projects/site-plugin-test11/framework2/src/main/java/org/apache/maven
A maven-site-plugin/src/test/projects/site-plugin-test11/framework2/src/main/java/org/apache/maven/plugin
A maven-site-plugin/src/test/projects/site-plugin-test11/framework2/src/main/java/org/apache/maven/plugin/site
A maven-site-plugin/src/test/projects/site-plugin-test11/framework2/src/main/java/org/apache/maven/plugin/site/test11
AU maven-site-plugin/src/test/projects/site-plugin-test11/framework2/src/main/java/org/apache/maven/plugin/site/test11/App.java
AU maven-site-plugin/src/test/projects/site-plugin-test11/framework2/pom.xml
A maven-site-plugin/src/test/projects/site-plugin-test11/framework2/source
A maven-site-plugin/src/test/projects/site-plugin-test11/framework2/source/mysite
AU maven-site-plugin/src/test/projects/site-plugin-test11/framework2/source/mysite/site.xml
A maven-site-plugin/src/test/projects/site-plugin-test11/framework2/source/mysite/apt
AU maven-site-plugin/src/test/projects/site-plugin-test11/framework2/source/mysite/apt/test2.apt
AU maven-site-plugin/src/test/projects/site-plugin-test11/framework2/source/mysite/apt/index.apt
A maven-site-plugin/src/test/projects/site-plugin-test11/source
A maven-site-plugin/src/test/projects/site-plugin-test11/source/mysite
AU maven-site-plugin/src/test/projects/site-plugin-test11/source/mysite/site.xml
A maven-site-plugin/src/test/projects/site-plugin-test11/source/mysite/apt
AU maven-site-plugin/src/test/projects/site-plugin-test11/source/mysite/apt/test.apt
A maven-site-plugin/src/test/projects/site-plugin-test2
A maven-site-plugin/src/test/projects/site-plugin-test2/src
A maven-site-plugin/src/test/projects/site-plugin-test2/src/test
A maven-site-plugin/src/test/projects/site-plugin-test2/src/test/java
A maven-site-plugin/src/test/projects/site-plugin-test2/src/test/java/org
A maven-site-plugin/src/test/projects/site-plugin-test2/src/test/java/org/apache
A maven-site-plugin/src/test/projects/site-plugin-test2/src/test/java/org/apache/maven
A maven-site-plugin/src/test/projects/site-plugin-test2/src/test/java/org/apache/maven/plugin
A maven-site-plugin/src/test/projects/site-plugin-test2/src/test/java/org/apache/maven/plugin/site
A maven-site-plugin/src/test/projects/site-plugin-test2/src/test/java/org/apache/maven/plugin/site/test2
AU maven-site-plugin/src/test/projects/site-plugin-test2/src/test/java/org/apache/maven/plugin/site/test2/AppTest.java
A maven-site-plugin/src/test/projects/site-plugin-test2/src/main
A maven-site-plugin/src/test/projects/site-plugin-test2/src/main/java
A maven-site-plugin/src/test/projects/site-plugin-test2/src/main/java/org
A maven-site-plugin/src/test/projects/site-plugin-test2/src/main/java/org/apache
A maven-site-plugin/src/test/projects/site-plugin-test2/src/main/java/org/apache/maven
A maven-site-plugin/src/test/projects/site-plugin-test2/src/main/java/org/apache/maven/plugin
A maven-site-plugin/src/test/projects/site-plugin-test2/src/main/java/org/apache/maven/plugin/site
A maven-site-plugin/src/test/projects/site-plugin-test2/src/main/java/org/apache/maven/plugin/site/test2
AU maven-site-plugin/src/test/projects/site-plugin-test2/src/main/java/org/apache/maven/plugin/site/test2/App.java
A maven-site-plugin/src/test/projects/site-plugin-test2/src/site
AU maven-site-plugin/src/test/projects/site-plugin-test2/src/site/site.xml
A maven-site-plugin/src/test/projects/site-plugin-test2/src/site/apt
AU maven-site-plugin/src/test/projects/site-plugin-test2/src/site/apt/test.apt
AU maven-site-plugin/src/test/projects/site-plugin-test2/pom.xml
A maven-site-plugin/src/test/resources
A maven-site-plugin/src/test/resources/unit
A maven-site-plugin/src/test/resources/unit/deploy-dav
A maven-site-plugin/src/test/resources/unit/deploy-dav/target
A maven-site-plugin/src/test/resources/unit/deploy-dav/target/site
A maven-site-plugin/src/test/resources/unit/deploy-dav/target/site/css
AU maven-site-plugin/src/test/resources/unit/deploy-dav/target/site/css/maven-base.css
AU maven-site-plugin/src/test/resources/unit/deploy-dav/target/site/index.html
AU maven-site-plugin/src/test/resources/unit/deploy-dav/pom.xml
A maven-site-plugin/src/test/resources/unit/interpolated-site
A maven-site-plugin/src/test/resources/unit/interpolated-site/src
A maven-site-plugin/src/test/resources/unit/interpolated-site/src/site
AU maven-site-plugin/src/test/resources/unit/interpolated-site/src/site/site.xml
A maven-site-plugin/src/test/resources/unit/interpolated-site/src/site/apt
AU maven-site-plugin/src/test/resources/unit/interpolated-site/src/site/apt/test.apt
AU maven-site-plugin/src/test/resources/unit/interpolated-site/pom.xml
A maven-site-plugin/src/test/java
A maven-site-plugin/src/test/java/org
A maven-site-plugin/src/test/java/org/apache
A maven-site-plugin/src/test/java/org/apache/maven
A maven-site-plugin/src/test/java/org/apache/maven/plugins
A maven-site-plugin/src/test/java/org/apache/maven/plugins/site
A maven-site-plugin/src/test/java/org/apache/maven/plugins/site/deploy
AU maven-site-plugin/src/test/java/org/apache/maven/plugins/site/deploy/AbstractSiteDeployWebDavTest.java
AU maven-site-plugin/src/test/java/org/apache/maven/plugins/site/deploy/AuthAsyncProxyServlet.java
AU maven-site-plugin/src/test/java/org/apache/maven/plugins/site/deploy/SiteDeployMojoTest.java
AU maven-site-plugin/src/test/java/org/apache/maven/plugins/site/deploy/SimpleDavServerHandler.java
AU maven-site-plugin/src/test/java/org/apache/maven/plugins/site/deploy/SiteDeployWebDavTest.java
A maven-site-plugin/src/test/java/org/apache/maven/plugins/site/render
AU maven-site-plugin/src/test/java/org/apache/maven/plugins/site/render/SiteMojoTest.java
A maven-site-plugin/src/test/java/org/apache/maven/plugins/site/stubs
AU maven-site-plugin/src/test/java/org/apache/maven/plugins/site/stubs/SiteMavenProjectStub.java
A maven-site-plugin/src/test/java/org/apache/maven/plugins/site/run
A maven-site-plugin/src/test/java/org/apache/maven/plugins/site/run/WebXmlTest.java
AU maven-site-plugin/pom.xml
A maven-acr-plugin
AU maven-acr-plugin/deploySite.sh
AU maven-acr-plugin/pom.xml
A maven-acr-plugin/src
A maven-acr-plugin/src/main
A maven-acr-plugin/src/main/resources
A maven-acr-plugin/src/main/resources/META-INF
A maven-acr-plugin/src/main/resources/META-INF/plexus
AU maven-acr-plugin/src/main/resources/META-INF/plexus/components.xml
A maven-acr-plugin/src/main/java
A maven-acr-plugin/src/main/java/org
A maven-acr-plugin/src/main/java/org/apache
A maven-acr-plugin/src/main/java/org/apache/maven
A maven-acr-plugin/src/main/java/org/apache/maven/plugin
A maven-acr-plugin/src/main/java/org/apache/maven/plugin/acr
AU maven-acr-plugin/src/main/java/org/apache/maven/plugin/acr/AcrMojo.java
A maven-acr-plugin/src/site
AU maven-acr-plugin/src/site/site.xml
A maven-acr-plugin/src/site/apt
AU maven-acr-plugin/src/site/apt/usage.apt.vm
AU maven-acr-plugin/src/site/apt/index.apt.vm
A maven-acr-plugin/src/site/apt/examples
AU maven-acr-plugin/src/site/apt/examples/filter-deployment-descriptor.apt.vm
AU maven-acr-plugin/src/site/apt/examples/app-client-dependency.apt.vm
A maven-acr-plugin/src/site/resources
A maven-acr-plugin/src/site/resources/download.cgi
A maven-acr-plugin/src/site/xdoc
A maven-acr-plugin/src/site/xdoc/download.xml.vm
A maven-acr-plugin/src/site/fml
AU maven-acr-plugin/src/site/fml/faq.fml
A maven-acr-plugin/src/it
A maven-acr-plugin/src/it/it-01
A maven-acr-plugin/src/it/it-01/src
A maven-acr-plugin/src/it/it-01/src/main
A maven-acr-plugin/src/it/it-01/src/main/resources
A maven-acr-plugin/src/it/it-01/src/main/resources/META-INF
AU maven-acr-plugin/src/it/it-01/src/main/resources/META-INF/application-client.xml
A maven-acr-plugin/src/it/it-01/src/main/java
A maven-acr-plugin/src/it/it-01/src/main/java/org
A maven-acr-plugin/src/it/it-01/src/main/java/org/apache
A maven-acr-plugin/src/it/it-01/src/main/java/org/apache/maven
A maven-acr-plugin/src/it/it-01/src/main/java/org/apache/maven/plugin
A maven-acr-plugin/src/it/it-01/src/main/java/org/apache/maven/plugin/acr
A maven-acr-plugin/src/it/it-01/src/main/java/org/apache/maven/plugin/acr/it
A maven-acr-plugin/src/it/it-01/src/main/java/org/apache/maven/plugin/acr/it/it01
AU maven-acr-plugin/src/it/it-01/src/main/java/org/apache/maven/plugin/acr/it/it01/SampleApp.java
AU maven-acr-plugin/src/it/it-01/pom.xml
AU maven-acr-plugin/src/it/it-01/verify.bsh
A maven-acr-plugin/src/it/it-02
AU maven-acr-plugin/src/it/it-02/verify.bsh
A maven-acr-plugin/src/it/it-02/bundle
A maven-acr-plugin/src/it/it-02/bundle/src
A maven-acr-plugin/src/it/it-02/bundle/src/main
A maven-acr-plugin/src/it/it-02/bundle/src/main/java
A maven-acr-plugin/src/it/it-02/bundle/src/main/java/org
A maven-acr-plugin/src/it/it-02/bundle/src/main/java/org/apache
A maven-acr-plugin/src/it/it-02/bundle/src/main/java/org/apache/maven
A maven-acr-plugin/src/it/it-02/bundle/src/main/java/org/apache/maven/plugin
A maven-acr-plugin/src/it/it-02/bundle/src/main/java/org/apache/maven/plugin/acr
A maven-acr-plugin/src/it/it-02/bundle/src/main/java/org/apache/maven/plugin/acr/it
A maven-acr-plugin/src/it/it-02/bundle/src/main/java/org/apache/maven/plugin/acr/it/it02
AU maven-acr-plugin/src/it/it-02/bundle/src/main/java/org/apache/maven/plugin/acr/it/it02/DependencyTest.java
AU maven-acr-plugin/src/it/it-02/bundle/pom.xml
AU maven-acr-plugin/src/it/it-02/pom.xml
A maven-acr-plugin/src/it/it-02/app-client
A maven-acr-plugin/src/it/it-02/app-client/src
A maven-acr-plugin/src/it/it-02/app-client/src/main
A maven-acr-plugin/src/it/it-02/app-client/src/main/resources
A maven-acr-plugin/src/it/it-02/app-client/src/main/resources/META-INF
AU maven-acr-plugin/src/it/it-02/app-client/src/main/resources/META-INF/application-client.xml
A maven-acr-plugin/src/it/it-02/app-client/src/main/java
A maven-acr-plugin/src/it/it-02/app-client/src/main/java/org
A maven-acr-plugin/src/it/it-02/app-client/src/main/java/org/apache
A maven-acr-plugin/src/it/it-02/app-client/src/main/java/org/apache/maven
A maven-acr-plugin/src/it/it-02/app-client/src/main/java/org/apache/maven/plugin
A maven-acr-plugin/src/it/it-02/app-client/src/main/java/org/apache/maven/plugin/acr
A maven-acr-plugin/src/it/it-02/app-client/src/main/java/org/apache/maven/plugin/acr/it
A maven-acr-plugin/src/it/it-02/app-client/src/main/java/org/apache/maven/plugin/acr/it/it02
AU maven-acr-plugin/src/it/it-02/app-client/src/main/java/org/apache/maven/plugin/acr/it/it02/SampleApp.java
AU maven-acr-plugin/src/it/it-02/app-client/pom.xml
A maven-acr-plugin/src/it/it-03
A maven-acr-plugin/src/it/it-03/src
A maven-acr-plugin/src/it/it-03/src/main
A maven-acr-plugin/src/it/it-03/src/main/resources
A maven-acr-plugin/src/it/it-03/src/main/resources/META-INF
AU maven-acr-plugin/src/it/it-03/src/main/resources/META-INF/application-client.xml
AU maven-acr-plugin/src/it/it-03/pom.xml
AU maven-acr-plugin/src/it/it-03/verify.bsh
A maven-acr-plugin/src/it/it-04
A maven-acr-plugin/src/it/it-04/src
A maven-acr-plugin/src/it/it-04/src/main
A maven-acr-plugin/src/it/it-04/src/main/resources
A maven-acr-plugin/src/it/it-04/src/main/resources/META-INF
AU maven-acr-plugin/src/it/it-04/src/main/resources/META-INF/application-client.xml
AU maven-acr-plugin/src/it/it-04/pom.xml
AU maven-acr-plugin/src/it/it-04/verify.bsh
AU maven-acr-plugin/src/it/settings.xml
AU .gitignore
U .
At revision 1645001
Parsing POMs
ERROR: Failed to parse POMs
java.io.IOException: remote file operation failed: <https://builds.apache.org/job/maven-plugins/ws/> at hudson.remoting.Channel@75ee55fa:jenkins-ubuntu-1404-4gb-505
at hudson.FilePath.act(FilePath.java:916)
at hudson.FilePath.act(FilePath.java:893)
at hudson.maven.MavenModuleSetBuild$MavenModuleSetBuildExecution.parsePoms(MavenModuleSetBuild.java:950)
at hudson.maven.MavenModuleSetBuild$MavenModuleSetBuildExecution.doRun(MavenModuleSetBuild.java:677)
at hudson.model.AbstractBuild$AbstractBuildExecution.run(AbstractBuild.java:529)
at hudson.model.Run.execute(Run.java:1706)
at hudson.maven.MavenModuleSetBuild.run(MavenModuleSetBuild.java:529)
at hudson.model.ResourceController.execute(ResourceController.java:88)
at hudson.model.Executor.run(Executor.java:232)
Caused by: hudson.remoting.ProxyException: hudson.maven.MavenModuleSetBuild$MavenExecutionException: hudson.maven.MavenEmbedderException: 1 problem was encountered while building the effective settings
[FATAL] Non-readable settings /home/jenkins/.m2/settings.xml: input contained no data @ /home/jenkins/.m2/settings.xml
at hudson.maven.MavenModuleSetBuild$PomParser.invoke(MavenModuleSetBuild.java:1352)
at hudson.maven.MavenModuleSetBuild$PomParser.invoke(MavenModuleSetBuild.java:1088)
at hudson.FilePath$FileCallableWrapper.call(FilePath.java:2474)
at hudson.remoting.UserRequest.perform(UserRequest.java:118)
at hudson.remoting.UserRequest.perform(UserRequest.java:48)
at hudson.remoting.Request$2.run(Request.java:328)
at hudson.remoting.InterceptingExecutorService$1.call(InterceptingExecutorService.java:72)
at java.util.concurrent.FutureTask.run(FutureTask.java:262)
at java.util.concurrent.ThreadPoolExecutor.runWorker(ThreadPoolExecutor.java:1145)
at java.util.concurrent.ThreadPoolExecutor$Worker.run(ThreadPoolExecutor.java:615)
at java.lang.Thread.run(Thread.java:745)
Caused by: hudson.remoting.ProxyException: hudson.maven.MavenEmbedderException: 1 problem was encountered while building the effective settings
[FATAL] Non-readable settings /home/jenkins/.m2/settings.xml: input contained no data @ /home/jenkins/.m2/settings.xml
at hudson.maven.MavenEmbedder.<init>(MavenEmbedder.java:128)
at hudson.maven.MavenEmbedder.<init>(MavenEmbedder.java:109)
at hudson.maven.MavenEmbedder.<init>(MavenEmbedder.java:136)
at hudson.maven.MavenUtil.createEmbedder(MavenUtil.java:212)
at hudson.maven.MavenModuleSetBuild$PomParser.invoke(MavenModuleSetBuild.java:1285)
... 10 more
Caused by: hudson.remoting.ProxyException: hudson.maven.MavenEmbedderException: 1 problem was encountered while building the effective settings
[FATAL] Non-readable settings /home/jenkins/.m2/settings.xml: input contained no data @ /home/jenkins/.m2/settings.xml
at hudson.maven.MavenEmbedder.getSettings(MavenEmbedder.java:261)
at hudson.maven.MavenEmbedder.buildMavenExecutionRequest(MavenEmbedder.java:157)
at hudson.maven.MavenEmbedder.<init>(MavenEmbedder.java:120)
... 14 more
Caused by: hudson.remoting.ProxyException: org.apache.maven.settings.building.SettingsBuildingException: 1 problem was encountered while building the effective settings
[FATAL] Non-readable settings /home/jenkins/.m2/settings.xml: input contained no data @ /home/jenkins/.m2/settings.xml
at org.apache.maven.settings.building.DefaultSettingsBuilder.build(DefaultSettingsBuilder.java:116)
at hudson.maven.MavenEmbedder.getSettings(MavenEmbedder.java:259)
... 16 more
[WARNINGS] Skipping publisher since build result is FAILURE
Jenkins build is back to normal : maven-plugins #2485
Posted by Apache Jenkins Server <je...@builds.apache.org>.
See <https://builds.apache.org/job/maven-plugins/2485/changes>
Build failed in Jenkins: maven-plugins #2484
Posted by Apache Jenkins Server <je...@builds.apache.org>.
See <https://builds.apache.org/job/maven-plugins/2484/changes>
Changes:
[khmarbaise] [MEAR-176] Upgrading maven-filtering breaks IT
------------------------------------------
Started by an SCM change
Building remotely on jenkins-ubuntu-1404-4gb-505 (jenkins-cloud-4GB Ubuntu ubuntu) in workspace <https://builds.apache.org/job/maven-plugins/ws/>
Updating http://svn.apache.org/repos/asf/maven/plugins/trunk at revision '2014-12-12T19:16:16.845 +0000'
U maven-ear-plugin/src/main/java/org/apache/maven/plugin/ear/EarMojo.java
U maven-ear-plugin/pom.xml
At revision 1645040
Parsing POMs
ERROR: Failed to parse POMs
java.io.IOException: remote file operation failed: <https://builds.apache.org/job/maven-plugins/ws/> at hudson.remoting.Channel@75ee55fa:jenkins-ubuntu-1404-4gb-505
at hudson.FilePath.act(FilePath.java:916)
at hudson.FilePath.act(FilePath.java:893)
at hudson.maven.MavenModuleSetBuild$MavenModuleSetBuildExecution.parsePoms(MavenModuleSetBuild.java:950)
at hudson.maven.MavenModuleSetBuild$MavenModuleSetBuildExecution.doRun(MavenModuleSetBuild.java:677)
at hudson.model.AbstractBuild$AbstractBuildExecution.run(AbstractBuild.java:529)
at hudson.model.Run.execute(Run.java:1706)
at hudson.maven.MavenModuleSetBuild.run(MavenModuleSetBuild.java:529)
at hudson.model.ResourceController.execute(ResourceController.java:88)
at hudson.model.Executor.run(Executor.java:232)
Caused by: hudson.remoting.ProxyException: hudson.maven.MavenModuleSetBuild$MavenExecutionException: hudson.maven.MavenEmbedderException: 1 problem was encountered while building the effective settings
[FATAL] Non-readable settings /home/jenkins/.m2/settings.xml: input contained no data @ /home/jenkins/.m2/settings.xml
at hudson.maven.MavenModuleSetBuild$PomParser.invoke(MavenModuleSetBuild.java:1352)
at hudson.maven.MavenModuleSetBuild$PomParser.invoke(MavenModuleSetBuild.java:1088)
at hudson.FilePath$FileCallableWrapper.call(FilePath.java:2474)
at hudson.remoting.UserRequest.perform(UserRequest.java:118)
at hudson.remoting.UserRequest.perform(UserRequest.java:48)
at hudson.remoting.Request$2.run(Request.java:328)
at hudson.remoting.InterceptingExecutorService$1.call(InterceptingExecutorService.java:72)
at java.util.concurrent.FutureTask.run(FutureTask.java:262)
at java.util.concurrent.ThreadPoolExecutor.runWorker(ThreadPoolExecutor.java:1145)
at java.util.concurrent.ThreadPoolExecutor$Worker.run(ThreadPoolExecutor.java:615)
at java.lang.Thread.run(Thread.java:745)
Caused by: hudson.remoting.ProxyException: hudson.maven.MavenEmbedderException: 1 problem was encountered while building the effective settings
[FATAL] Non-readable settings /home/jenkins/.m2/settings.xml: input contained no data @ /home/jenkins/.m2/settings.xml
at hudson.maven.MavenEmbedder.<init>(MavenEmbedder.java:128)
at hudson.maven.MavenEmbedder.<init>(MavenEmbedder.java:109)
at hudson.maven.MavenEmbedder.<init>(MavenEmbedder.java:136)
at hudson.maven.MavenUtil.createEmbedder(MavenUtil.java:212)
at hudson.maven.MavenModuleSetBuild$PomParser.invoke(MavenModuleSetBuild.java:1285)
... 10 more
Caused by: hudson.remoting.ProxyException: hudson.maven.MavenEmbedderException: 1 problem was encountered while building the effective settings
[FATAL] Non-readable settings /home/jenkins/.m2/settings.xml: input contained no data @ /home/jenkins/.m2/settings.xml
at hudson.maven.MavenEmbedder.getSettings(MavenEmbedder.java:261)
at hudson.maven.MavenEmbedder.buildMavenExecutionRequest(MavenEmbedder.java:157)
at hudson.maven.MavenEmbedder.<init>(MavenEmbedder.java:120)
... 14 more
Caused by: hudson.remoting.ProxyException: org.apache.maven.settings.building.SettingsBuildingException: 1 problem was encountered while building the effective settings
[FATAL] Non-readable settings /home/jenkins/.m2/settings.xml: input contained no data @ /home/jenkins/.m2/settings.xml
at org.apache.maven.settings.building.DefaultSettingsBuilder.build(DefaultSettingsBuilder.java:116)
at hudson.maven.MavenEmbedder.getSettings(MavenEmbedder.java:259)
... 16 more
[WARNINGS] Skipping publisher since build result is FAILURE
Build failed in Jenkins: maven-plugins #2483
Posted by Apache Jenkins Server <je...@builds.apache.org>.
See <https://builds.apache.org/job/maven-plugins/2483/changes>
Changes:
[krosenvold] Fixed test on windows
------------------------------------------
Started by an SCM change
Building remotely on jenkins-ubuntu-1404-4gb-505 (jenkins-cloud-4GB Ubuntu ubuntu) in workspace <https://builds.apache.org/job/maven-plugins/ws/>
Updating http://svn.apache.org/repos/asf/maven/plugins/trunk at revision '2014-12-12T18:06:19.908 +0000'
U maven-assembly-plugin/src/test/java/org/apache/maven/plugin/assembly/archive/phase/FileSetAssemblyPhaseTest.java
At revision 1645008
Parsing POMs
ERROR: Failed to parse POMs
java.io.IOException: remote file operation failed: <https://builds.apache.org/job/maven-plugins/ws/> at hudson.remoting.Channel@75ee55fa:jenkins-ubuntu-1404-4gb-505
at hudson.FilePath.act(FilePath.java:916)
at hudson.FilePath.act(FilePath.java:893)
at hudson.maven.MavenModuleSetBuild$MavenModuleSetBuildExecution.parsePoms(MavenModuleSetBuild.java:950)
at hudson.maven.MavenModuleSetBuild$MavenModuleSetBuildExecution.doRun(MavenModuleSetBuild.java:677)
at hudson.model.AbstractBuild$AbstractBuildExecution.run(AbstractBuild.java:529)
at hudson.model.Run.execute(Run.java:1706)
at hudson.maven.MavenModuleSetBuild.run(MavenModuleSetBuild.java:529)
at hudson.model.ResourceController.execute(ResourceController.java:88)
at hudson.model.Executor.run(Executor.java:232)
Caused by: hudson.remoting.ProxyException: hudson.maven.MavenModuleSetBuild$MavenExecutionException: hudson.maven.MavenEmbedderException: 1 problem was encountered while building the effective settings
[FATAL] Non-readable settings /home/jenkins/.m2/settings.xml: input contained no data @ /home/jenkins/.m2/settings.xml
at hudson.maven.MavenModuleSetBuild$PomParser.invoke(MavenModuleSetBuild.java:1352)
at hudson.maven.MavenModuleSetBuild$PomParser.invoke(MavenModuleSetBuild.java:1088)
at hudson.FilePath$FileCallableWrapper.call(FilePath.java:2474)
at hudson.remoting.UserRequest.perform(UserRequest.java:118)
at hudson.remoting.UserRequest.perform(UserRequest.java:48)
at hudson.remoting.Request$2.run(Request.java:328)
at hudson.remoting.InterceptingExecutorService$1.call(InterceptingExecutorService.java:72)
at java.util.concurrent.FutureTask.run(FutureTask.java:262)
at java.util.concurrent.ThreadPoolExecutor.runWorker(ThreadPoolExecutor.java:1145)
at java.util.concurrent.ThreadPoolExecutor$Worker.run(ThreadPoolExecutor.java:615)
at java.lang.Thread.run(Thread.java:745)
Caused by: hudson.remoting.ProxyException: hudson.maven.MavenEmbedderException: 1 problem was encountered while building the effective settings
[FATAL] Non-readable settings /home/jenkins/.m2/settings.xml: input contained no data @ /home/jenkins/.m2/settings.xml
at hudson.maven.MavenEmbedder.<init>(MavenEmbedder.java:128)
at hudson.maven.MavenEmbedder.<init>(MavenEmbedder.java:109)
at hudson.maven.MavenEmbedder.<init>(MavenEmbedder.java:136)
at hudson.maven.MavenUtil.createEmbedder(MavenUtil.java:212)
at hudson.maven.MavenModuleSetBuild$PomParser.invoke(MavenModuleSetBuild.java:1285)
... 10 more
Caused by: hudson.remoting.ProxyException: hudson.maven.MavenEmbedderException: 1 problem was encountered while building the effective settings
[FATAL] Non-readable settings /home/jenkins/.m2/settings.xml: input contained no data @ /home/jenkins/.m2/settings.xml
at hudson.maven.MavenEmbedder.getSettings(MavenEmbedder.java:261)
at hudson.maven.MavenEmbedder.buildMavenExecutionRequest(MavenEmbedder.java:157)
at hudson.maven.MavenEmbedder.<init>(MavenEmbedder.java:120)
... 14 more
Caused by: hudson.remoting.ProxyException: org.apache.maven.settings.building.SettingsBuildingException: 1 problem was encountered while building the effective settings
[FATAL] Non-readable settings /home/jenkins/.m2/settings.xml: input contained no data @ /home/jenkins/.m2/settings.xml
at org.apache.maven.settings.building.DefaultSettingsBuilder.build(DefaultSettingsBuilder.java:116)
at hudson.maven.MavenEmbedder.getSettings(MavenEmbedder.java:259)
... 16 more
[WARNINGS] Skipping publisher since build result is FAILURE