You are viewing a plain text version of this content. The canonical link for it is here.
Posted to dev@lucene.apache.org by Policeman Jenkins Server <je...@thetaphi.de> on 2016/01/17 13:22:24 UTC

[JENKINS] Lucene-Solr-5.4-Linux (32bit/jdk1.7.0_80) - Build # 397 - Failure!

Build: http://jenkins.thetaphi.de/job/Lucene-Solr-5.4-Linux/397/
Java: 32bit/jdk1.7.0_80 -client -XX:+UseG1GC

1 tests failed.
FAILED:  org.apache.solr.cloud.BasicDistributedZkTest.test

Error Message:
Error from server at http://127.0.0.1:54555/_vgl/collection1: Bad Request    request: http://127.0.0.1:34323/_vgl/collection1/update?update.chain=distrib-dup-test-chain-explicit&update.distrib=TOLEADER&distrib.from=http%3A%2F%2F127.0.0.1%3A54555%2F_vgl%2Fcollection1%2F&wt=javabin&version=2

Stack Trace:
org.apache.solr.client.solrj.impl.HttpSolrClient$RemoteSolrException: Error from server at http://127.0.0.1:54555/_vgl/collection1: Bad Request



request: http://127.0.0.1:34323/_vgl/collection1/update?update.chain=distrib-dup-test-chain-explicit&update.distrib=TOLEADER&distrib.from=http%3A%2F%2F127.0.0.1%3A54555%2F_vgl%2Fcollection1%2F&wt=javabin&version=2
	at __randomizedtesting.SeedInfo.seed([639B3709D4E0FCE:8E6D8CAA33B26236]:0)
	at org.apache.solr.client.solrj.impl.HttpSolrClient.executeMethod(HttpSolrClient.java:575)
	at org.apache.solr.client.solrj.impl.HttpSolrClient.request(HttpSolrClient.java:241)
	at org.apache.solr.client.solrj.impl.HttpSolrClient.request(HttpSolrClient.java:230)
	at org.apache.solr.client.solrj.SolrRequest.process(SolrRequest.java:150)
	at org.apache.solr.client.solrj.SolrRequest.process(SolrRequest.java:167)
	at org.apache.solr.BaseDistributedSearchTestCase.add(BaseDistributedSearchTestCase.java:512)
	at org.apache.solr.cloud.BasicDistributedZkTest.testUpdateProcessorsRunOnlyOnce(BasicDistributedZkTest.java:645)
	at org.apache.solr.cloud.BasicDistributedZkTest.test(BasicDistributedZkTest.java:356)
	at sun.reflect.NativeMethodAccessorImpl.invoke0(Native Method)
	at sun.reflect.NativeMethodAccessorImpl.invoke(NativeMethodAccessorImpl.java:57)
	at sun.reflect.DelegatingMethodAccessorImpl.invoke(DelegatingMethodAccessorImpl.java:43)
	at java.lang.reflect.Method.invoke(Method.java:606)
	at com.carrotsearch.randomizedtesting.RandomizedRunner.invoke(RandomizedRunner.java:1764)
	at com.carrotsearch.randomizedtesting.RandomizedRunner$8.evaluate(RandomizedRunner.java:871)
	at com.carrotsearch.randomizedtesting.RandomizedRunner$9.evaluate(RandomizedRunner.java:907)
	at com.carrotsearch.randomizedtesting.RandomizedRunner$10.evaluate(RandomizedRunner.java:921)
	at org.apache.solr.BaseDistributedSearchTestCase$ShardsRepeatRule$ShardsFixedStatement.callStatement(BaseDistributedSearchTestCase.java:964)
	at org.apache.solr.BaseDistributedSearchTestCase$ShardsRepeatRule$ShardsStatement.evaluate(BaseDistributedSearchTestCase.java:939)
	at com.carrotsearch.randomizedtesting.rules.SystemPropertiesRestoreRule$1.evaluate(SystemPropertiesRestoreRule.java:57)
	at org.apache.lucene.util.TestRuleSetupTeardownChained$1.evaluate(TestRuleSetupTeardownChained.java:50)
	at org.apache.lucene.util.AbstractBeforeAfterRule$1.evaluate(AbstractBeforeAfterRule.java:46)
	at org.apache.lucene.util.TestRuleThreadAndTestName$1.evaluate(TestRuleThreadAndTestName.java:49)
	at org.apache.lucene.util.TestRuleIgnoreAfterMaxFailures$1.evaluate(TestRuleIgnoreAfterMaxFailures.java:65)
	at org.apache.lucene.util.TestRuleMarkFailure$1.evaluate(TestRuleMarkFailure.java:48)
	at com.carrotsearch.randomizedtesting.rules.StatementAdapter.evaluate(StatementAdapter.java:36)
	at com.carrotsearch.randomizedtesting.ThreadLeakControl$StatementRunner.run(ThreadLeakControl.java:367)
	at com.carrotsearch.randomizedtesting.ThreadLeakControl.forkTimeoutingTask(ThreadLeakControl.java:809)
	at com.carrotsearch.randomizedtesting.ThreadLeakControl$3.evaluate(ThreadLeakControl.java:460)
	at com.carrotsearch.randomizedtesting.RandomizedRunner.runSingleTest(RandomizedRunner.java:880)
	at com.carrotsearch.randomizedtesting.RandomizedRunner$5.evaluate(RandomizedRunner.java:781)
	at com.carrotsearch.randomizedtesting.RandomizedRunner$6.evaluate(RandomizedRunner.java:816)
	at com.carrotsearch.randomizedtesting.RandomizedRunner$7.evaluate(RandomizedRunner.java:827)
	at com.carrotsearch.randomizedtesting.rules.StatementAdapter.evaluate(StatementAdapter.java:36)
	at com.carrotsearch.randomizedtesting.rules.SystemPropertiesRestoreRule$1.evaluate(SystemPropertiesRestoreRule.java:57)
	at org.apache.lucene.util.AbstractBeforeAfterRule$1.evaluate(AbstractBeforeAfterRule.java:46)
	at com.carrotsearch.randomizedtesting.rules.StatementAdapter.evaluate(StatementAdapter.java:36)
	at org.apache.lucene.util.TestRuleStoreClassName$1.evaluate(TestRuleStoreClassName.java:42)
	at com.carrotsearch.randomizedtesting.rules.NoShadowingOrOverridesOnMethodsRule$1.evaluate(NoShadowingOrOverridesOnMethodsRule.java:40)
	at com.carrotsearch.randomizedtesting.rules.NoShadowingOrOverridesOnMethodsRule$1.evaluate(NoShadowingOrOverridesOnMethodsRule.java:40)
	at com.carrotsearch.randomizedtesting.rules.StatementAdapter.evaluate(StatementAdapter.java:36)
	at com.carrotsearch.randomizedtesting.rules.StatementAdapter.evaluate(StatementAdapter.java:36)
	at com.carrotsearch.randomizedtesting.rules.StatementAdapter.evaluate(StatementAdapter.java:36)
	at org.apache.lucene.util.TestRuleAssertionsRequired$1.evaluate(TestRuleAssertionsRequired.java:54)
	at org.apache.lucene.util.TestRuleMarkFailure$1.evaluate(TestRuleMarkFailure.java:48)
	at org.apache.lucene.util.TestRuleIgnoreAfterMaxFailures$1.evaluate(TestRuleIgnoreAfterMaxFailures.java:65)
	at org.apache.lucene.util.TestRuleIgnoreTestSuites$1.evaluate(TestRuleIgnoreTestSuites.java:55)
	at com.carrotsearch.randomizedtesting.rules.StatementAdapter.evaluate(StatementAdapter.java:36)
	at com.carrotsearch.randomizedtesting.ThreadLeakControl$StatementRunner.run(ThreadLeakControl.java:367)
	at java.lang.Thread.run(Thread.java:745)




Build Log:
[...truncated 9822 lines...]
   [junit4] Suite: org.apache.solr.cloud.BasicDistributedZkTest
   [junit4]   2> Creating dataDir: /home/jenkins/workspace/Lucene-Solr-5.4-Linux/solr/build/solr-core/test/J0/temp/solr.cloud.BasicDistributedZkTest_639B3709D4E0FCE-001/init-core-data-001
   [junit4]   2> 32893 INFO  (SUITE-BasicDistributedZkTest-seed#[639B3709D4E0FCE]-worker) [    ] o.a.s.BaseDistributedSearchTestCase Setting hostContext system property: /_vgl/
   [junit4]   2> 32895 INFO  (TEST-BasicDistributedZkTest.test-seed#[639B3709D4E0FCE]) [    ] o.a.s.c.ZkTestServer STARTING ZK TEST SERVER
   [junit4]   2> 32895 INFO  (Thread-87) [    ] o.a.s.c.ZkTestServer client port:0.0.0.0/0.0.0.0:0
   [junit4]   2> 32896 INFO  (Thread-87) [    ] o.a.s.c.ZkTestServer Starting server
   [junit4]   2> 32996 INFO  (TEST-BasicDistributedZkTest.test-seed#[639B3709D4E0FCE]) [    ] o.a.s.c.ZkTestServer start zk server on port:59331
   [junit4]   2> 32996 INFO  (TEST-BasicDistributedZkTest.test-seed#[639B3709D4E0FCE]) [    ] o.a.s.c.c.SolrZkClient Using default ZkCredentialsProvider
   [junit4]   2> 32996 INFO  (TEST-BasicDistributedZkTest.test-seed#[639B3709D4E0FCE]) [    ] o.a.s.c.c.ConnectionManager Waiting for client to connect to ZooKeeper
   [junit4]   2> 32998 INFO  (zkCallback-32-thread-1) [    ] o.a.s.c.c.ConnectionManager Watcher org.apache.solr.common.cloud.ConnectionManager@1b51976 name:ZooKeeperConnection Watcher:127.0.0.1:59331 got event WatchedEvent state:SyncConnected type:None path:null path:null type:None
   [junit4]   2> 32998 INFO  (TEST-BasicDistributedZkTest.test-seed#[639B3709D4E0FCE]) [    ] o.a.s.c.c.ConnectionManager Client is connected to ZooKeeper
   [junit4]   2> 32998 INFO  (TEST-BasicDistributedZkTest.test-seed#[639B3709D4E0FCE]) [    ] o.a.s.c.c.SolrZkClient Using default ZkACLProvider
   [junit4]   2> 32998 INFO  (TEST-BasicDistributedZkTest.test-seed#[639B3709D4E0FCE]) [    ] o.a.s.c.c.SolrZkClient makePath: /solr
   [junit4]   2> 33000 INFO  (TEST-BasicDistributedZkTest.test-seed#[639B3709D4E0FCE]) [    ] o.a.s.c.c.SolrZkClient Using default ZkCredentialsProvider
   [junit4]   2> 33000 INFO  (TEST-BasicDistributedZkTest.test-seed#[639B3709D4E0FCE]) [    ] o.a.s.c.c.ConnectionManager Waiting for client to connect to ZooKeeper
   [junit4]   2> 33001 INFO  (zkCallback-33-thread-1) [    ] o.a.s.c.c.ConnectionManager Watcher org.apache.solr.common.cloud.ConnectionManager@11c6dba name:ZooKeeperConnection Watcher:127.0.0.1:59331/solr got event WatchedEvent state:SyncConnected type:None path:null path:null type:None
   [junit4]   2> 33001 INFO  (TEST-BasicDistributedZkTest.test-seed#[639B3709D4E0FCE]) [    ] o.a.s.c.c.ConnectionManager Client is connected to ZooKeeper
   [junit4]   2> 33001 INFO  (TEST-BasicDistributedZkTest.test-seed#[639B3709D4E0FCE]) [    ] o.a.s.c.c.SolrZkClient Using default ZkACLProvider
   [junit4]   2> 33001 INFO  (TEST-BasicDistributedZkTest.test-seed#[639B3709D4E0FCE]) [    ] o.a.s.c.c.SolrZkClient makePath: /collections/collection1
   [junit4]   2> 33002 INFO  (TEST-BasicDistributedZkTest.test-seed#[639B3709D4E0FCE]) [    ] o.a.s.c.c.SolrZkClient makePath: /collections/collection1/shards
   [junit4]   2> 33003 INFO  (TEST-BasicDistributedZkTest.test-seed#[639B3709D4E0FCE]) [    ] o.a.s.c.c.SolrZkClient makePath: /collections/control_collection
   [junit4]   2> 33004 INFO  (TEST-BasicDistributedZkTest.test-seed#[639B3709D4E0FCE]) [    ] o.a.s.c.c.SolrZkClient makePath: /collections/control_collection/shards
   [junit4]   2> 33004 INFO  (TEST-BasicDistributedZkTest.test-seed#[639B3709D4E0FCE]) [    ] o.a.s.c.AbstractZkTestCase put /home/jenkins/workspace/Lucene-Solr-5.4-Linux/solr/core/src/test-files/solr/collection1/conf/solrconfig-tlog.xml to /configs/conf1/solrconfig.xml
   [junit4]   2> 33004 INFO  (TEST-BasicDistributedZkTest.test-seed#[639B3709D4E0FCE]) [    ] o.a.s.c.c.SolrZkClient makePath: /configs/conf1/solrconfig.xml
   [junit4]   2> 33006 INFO  (TEST-BasicDistributedZkTest.test-seed#[639B3709D4E0FCE]) [    ] o.a.s.c.AbstractZkTestCase put /home/jenkins/workspace/Lucene-Solr-5.4-Linux/solr/core/src/test-files/solr/collection1/conf/schema.xml to /configs/conf1/schema.xml
   [junit4]   2> 33006 INFO  (TEST-BasicDistributedZkTest.test-seed#[639B3709D4E0FCE]) [    ] o.a.s.c.c.SolrZkClient makePath: /configs/conf1/schema.xml
   [junit4]   2> 33007 INFO  (TEST-BasicDistributedZkTest.test-seed#[639B3709D4E0FCE]) [    ] o.a.s.c.AbstractZkTestCase put /home/jenkins/workspace/Lucene-Solr-5.4-Linux/solr/core/src/test-files/solr/collection1/conf/solrconfig.snippet.randomindexconfig.xml to /configs/conf1/solrconfig.snippet.randomindexconfig.xml
   [junit4]   2> 33007 INFO  (TEST-BasicDistributedZkTest.test-seed#[639B3709D4E0FCE]) [    ] o.a.s.c.c.SolrZkClient makePath: /configs/conf1/solrconfig.snippet.randomindexconfig.xml
   [junit4]   2> 33008 INFO  (TEST-BasicDistributedZkTest.test-seed#[639B3709D4E0FCE]) [    ] o.a.s.c.AbstractZkTestCase put /home/jenkins/workspace/Lucene-Solr-5.4-Linux/solr/core/src/test-files/solr/collection1/conf/stopwords.txt to /configs/conf1/stopwords.txt
   [junit4]   2> 33008 INFO  (TEST-BasicDistributedZkTest.test-seed#[639B3709D4E0FCE]) [    ] o.a.s.c.c.SolrZkClient makePath: /configs/conf1/stopwords.txt
   [junit4]   2> 33009 INFO  (TEST-BasicDistributedZkTest.test-seed#[639B3709D4E0FCE]) [    ] o.a.s.c.AbstractZkTestCase put /home/jenkins/workspace/Lucene-Solr-5.4-Linux/solr/core/src/test-files/solr/collection1/conf/protwords.txt to /configs/conf1/protwords.txt
   [junit4]   2> 33009 INFO  (TEST-BasicDistributedZkTest.test-seed#[639B3709D4E0FCE]) [    ] o.a.s.c.c.SolrZkClient makePath: /configs/conf1/protwords.txt
   [junit4]   2> 33010 INFO  (TEST-BasicDistributedZkTest.test-seed#[639B3709D4E0FCE]) [    ] o.a.s.c.AbstractZkTestCase put /home/jenkins/workspace/Lucene-Solr-5.4-Linux/solr/core/src/test-files/solr/collection1/conf/currency.xml to /configs/conf1/currency.xml
   [junit4]   2> 33010 INFO  (TEST-BasicDistributedZkTest.test-seed#[639B3709D4E0FCE]) [    ] o.a.s.c.c.SolrZkClient makePath: /configs/conf1/currency.xml
   [junit4]   2> 33011 INFO  (TEST-BasicDistributedZkTest.test-seed#[639B3709D4E0FCE]) [    ] o.a.s.c.AbstractZkTestCase put /home/jenkins/workspace/Lucene-Solr-5.4-Linux/solr/core/src/test-files/solr/collection1/conf/enumsConfig.xml to /configs/conf1/enumsConfig.xml
   [junit4]   2> 33011 INFO  (TEST-BasicDistributedZkTest.test-seed#[639B3709D4E0FCE]) [    ] o.a.s.c.c.SolrZkClient makePath: /configs/conf1/enumsConfig.xml
   [junit4]   2> 33012 INFO  (TEST-BasicDistributedZkTest.test-seed#[639B3709D4E0FCE]) [    ] o.a.s.c.AbstractZkTestCase put /home/jenkins/workspace/Lucene-Solr-5.4-Linux/solr/core/src/test-files/solr/collection1/conf/open-exchange-rates.json to /configs/conf1/open-exchange-rates.json
   [junit4]   2> 33012 INFO  (TEST-BasicDistributedZkTest.test-seed#[639B3709D4E0FCE]) [    ] o.a.s.c.c.SolrZkClient makePath: /configs/conf1/open-exchange-rates.json
   [junit4]   2> 33012 INFO  (TEST-BasicDistributedZkTest.test-seed#[639B3709D4E0FCE]) [    ] o.a.s.c.AbstractZkTestCase put /home/jenkins/workspace/Lucene-Solr-5.4-Linux/solr/core/src/test-files/solr/collection1/conf/mapping-ISOLatin1Accent.txt to /configs/conf1/mapping-ISOLatin1Accent.txt
   [junit4]   2> 33013 INFO  (TEST-BasicDistributedZkTest.test-seed#[639B3709D4E0FCE]) [    ] o.a.s.c.c.SolrZkClient makePath: /configs/conf1/mapping-ISOLatin1Accent.txt
   [junit4]   2> 33013 INFO  (TEST-BasicDistributedZkTest.test-seed#[639B3709D4E0FCE]) [    ] o.a.s.c.AbstractZkTestCase put /home/jenkins/workspace/Lucene-Solr-5.4-Linux/solr/core/src/test-files/solr/collection1/conf/old_synonyms.txt to /configs/conf1/old_synonyms.txt
   [junit4]   2> 33013 INFO  (TEST-BasicDistributedZkTest.test-seed#[639B3709D4E0FCE]) [    ] o.a.s.c.c.SolrZkClient makePath: /configs/conf1/old_synonyms.txt
   [junit4]   2> 33014 INFO  (TEST-BasicDistributedZkTest.test-seed#[639B3709D4E0FCE]) [    ] o.a.s.c.AbstractZkTestCase put /home/jenkins/workspace/Lucene-Solr-5.4-Linux/solr/core/src/test-files/solr/collection1/conf/synonyms.txt to /configs/conf1/synonyms.txt
   [junit4]   2> 33014 INFO  (TEST-BasicDistributedZkTest.test-seed#[639B3709D4E0FCE]) [    ] o.a.s.c.c.SolrZkClient makePath: /configs/conf1/synonyms.txt
   [junit4]   2> 33076 INFO  (TEST-BasicDistributedZkTest.test-seed#[639B3709D4E0FCE]) [    ] o.a.s.SolrTestCaseJ4 Writing core.properties file to /home/jenkins/workspace/Lucene-Solr-5.4-Linux/solr/build/solr-core/test/J0/temp/solr.cloud.BasicDistributedZkTest_639B3709D4E0FCE-001/control-001/cores/collection1
   [junit4]   2> 33078 INFO  (TEST-BasicDistributedZkTest.test-seed#[639B3709D4E0FCE]) [    ] o.e.j.s.Server jetty-9.2.13.v20150730
   [junit4]   2> 33079 INFO  (TEST-BasicDistributedZkTest.test-seed#[639B3709D4E0FCE]) [    ] o.e.j.s.h.ContextHandler Started o.e.j.s.ServletContextHandler@12b0459{/_vgl,null,AVAILABLE}
   [junit4]   2> 33083 INFO  (TEST-BasicDistributedZkTest.test-seed#[639B3709D4E0FCE]) [    ] o.e.j.s.ServerConnector Started ServerConnector@3dbf04{HTTP/1.1}{127.0.0.1:33848}
   [junit4]   2> 33083 INFO  (TEST-BasicDistributedZkTest.test-seed#[639B3709D4E0FCE]) [    ] o.e.j.s.Server Started @34380ms
   [junit4]   2> 33083 INFO  (TEST-BasicDistributedZkTest.test-seed#[639B3709D4E0FCE]) [    ] o.a.s.c.s.e.JettySolrRunner Jetty properties: {coreRootDirectory=/home/jenkins/workspace/Lucene-Solr-5.4-Linux/solr/build/solr-core/test/J0/temp/solr.cloud.BasicDistributedZkTest_639B3709D4E0FCE-001/control-001/cores, hostContext=/_vgl, solr.data.dir=/home/jenkins/workspace/Lucene-Solr-5.4-Linux/solr/build/solr-core/test/J0/temp/solr.cloud.BasicDistributedZkTest_639B3709D4E0FCE-001/tempDir-001/control/data, hostPort=33848}
   [junit4]   2> 33083 INFO  (TEST-BasicDistributedZkTest.test-seed#[639B3709D4E0FCE]) [    ] o.a.s.s.SolrDispatchFilter SolrDispatchFilter.init(): sun.misc.Launcher$AppClassLoader@26c088
   [junit4]   2> 33083 INFO  (TEST-BasicDistributedZkTest.test-seed#[639B3709D4E0FCE]) [    ] o.a.s.c.SolrResourceLoader new SolrResourceLoader for directory: '/home/jenkins/workspace/Lucene-Solr-5.4-Linux/solr/build/solr-core/test/J0/temp/solr.cloud.BasicDistributedZkTest_639B3709D4E0FCE-001/control-001'
   [junit4]   2> 33083 INFO  (TEST-BasicDistributedZkTest.test-seed#[639B3709D4E0FCE]) [    ] o.a.s.c.SolrResourceLoader JNDI not configured for solr (NoInitialContextEx)
   [junit4]   2> 33083 INFO  (TEST-BasicDistributedZkTest.test-seed#[639B3709D4E0FCE]) [    ] o.a.s.c.SolrResourceLoader solr home defaulted to 'solr/' (could not find system property or JNDI)
   [junit4]   2> 33084 INFO  (TEST-BasicDistributedZkTest.test-seed#[639B3709D4E0FCE]) [    ] o.a.s.c.c.SolrZkClient Using default ZkCredentialsProvider
   [junit4]   2> 33084 INFO  (TEST-BasicDistributedZkTest.test-seed#[639B3709D4E0FCE]) [    ] o.a.s.c.c.ConnectionManager Waiting for client to connect to ZooKeeper
   [junit4]   2> 33085 INFO  (zkCallback-34-thread-1) [    ] o.a.s.c.c.ConnectionManager Watcher org.apache.solr.common.cloud.ConnectionManager@1b140e8 name:ZooKeeperConnection Watcher:127.0.0.1:59331/solr got event WatchedEvent state:SyncConnected type:None path:null path:null type:None
   [junit4]   2> 33085 INFO  (TEST-BasicDistributedZkTest.test-seed#[639B3709D4E0FCE]) [    ] o.a.s.c.c.ConnectionManager Client is connected to ZooKeeper
   [junit4]   2> 33085 INFO  (TEST-BasicDistributedZkTest.test-seed#[639B3709D4E0FCE]) [    ] o.a.s.c.c.SolrZkClient Using default ZkACLProvider
   [junit4]   2> 33086 INFO  (TEST-BasicDistributedZkTest.test-seed#[639B3709D4E0FCE]) [    ] o.a.s.s.SolrDispatchFilter Loading solr.xml from SolrHome (not found in ZooKeeper)
   [junit4]   2> 33086 INFO  (TEST-BasicDistributedZkTest.test-seed#[639B3709D4E0FCE]) [    ] o.a.s.c.SolrXmlConfig Loading container configuration from /home/jenkins/workspace/Lucene-Solr-5.4-Linux/solr/build/solr-core/test/J0/temp/solr.cloud.BasicDistributedZkTest_639B3709D4E0FCE-001/control-001/solr.xml
   [junit4]   2> 33097 INFO  (TEST-BasicDistributedZkTest.test-seed#[639B3709D4E0FCE]) [    ] o.a.s.c.CorePropertiesLocator Config-defined core root directory: /home/jenkins/workspace/Lucene-Solr-5.4-Linux/solr/build/solr-core/test/J0/temp/solr.cloud.BasicDistributedZkTest_639B3709D4E0FCE-001/control-001/cores
   [junit4]   2> 33097 INFO  (TEST-BasicDistributedZkTest.test-seed#[639B3709D4E0FCE]) [    ] o.a.s.c.CoreContainer New CoreContainer 13948801
   [junit4]   2> 33097 INFO  (TEST-BasicDistributedZkTest.test-seed#[639B3709D4E0FCE]) [    ] o.a.s.c.CoreContainer Loading cores into CoreContainer [instanceDir=/home/jenkins/workspace/Lucene-Solr-5.4-Linux/solr/build/solr-core/test/J0/temp/solr.cloud.BasicDistributedZkTest_639B3709D4E0FCE-001/control-001]
   [junit4]   2> 33097 WARN  (TEST-BasicDistributedZkTest.test-seed#[639B3709D4E0FCE]) [    ] o.a.s.c.CoreContainer Couldn't add files from /home/jenkins/workspace/Lucene-Solr-5.4-Linux/solr/build/solr-core/test/J0/temp/solr.cloud.BasicDistributedZkTest_639B3709D4E0FCE-001/control-001/lib to classpath: /home/jenkins/workspace/Lucene-Solr-5.4-Linux/solr/build/solr-core/test/J0/temp/solr.cloud.BasicDistributedZkTest_639B3709D4E0FCE-001/control-001/lib
   [junit4]   2> 33098 INFO  (TEST-BasicDistributedZkTest.test-seed#[639B3709D4E0FCE]) [    ] o.a.s.h.c.HttpShardHandlerFactory created with socketTimeout : 90000,urlScheme : ,connTimeout : 15000,maxConnectionsPerHost : 20,maxConnections : 10000,corePoolSize : 0,maximumPoolSize : 2147483647,maxThreadIdleTime : 5,sizeOfQueue : -1,fairnessPolicy : false,useRetries : false,
   [junit4]   2> 33099 INFO  (TEST-BasicDistributedZkTest.test-seed#[639B3709D4E0FCE]) [    ] o.a.s.u.UpdateShardHandler Creating UpdateShardHandler HTTP client with params: socketTimeout=340000&connTimeout=45000&retry=true
   [junit4]   2> 33099 INFO  (TEST-BasicDistributedZkTest.test-seed#[639B3709D4E0FCE]) [    ] o.a.s.l.LogWatcher SLF4J impl is org.slf4j.impl.Log4jLoggerFactory
   [junit4]   2> 33099 INFO  (TEST-BasicDistributedZkTest.test-seed#[639B3709D4E0FCE]) [    ] o.a.s.l.LogWatcher Registering Log Listener [Log4j (org.slf4j.impl.Log4jLoggerFactory)]
   [junit4]   2> 33099 INFO  (TEST-BasicDistributedZkTest.test-seed#[639B3709D4E0FCE]) [    ] o.a.s.c.ZkContainer Zookeeper client=127.0.0.1:59331/solr
   [junit4]   2> 33099 INFO  (TEST-BasicDistributedZkTest.test-seed#[639B3709D4E0FCE]) [    ] o.a.s.c.ZkController zkHost includes chroot
   [junit4]   2> 33099 INFO  (TEST-BasicDistributedZkTest.test-seed#[639B3709D4E0FCE]) [    ] o.a.s.c.c.SolrZkClient Using default ZkCredentialsProvider
   [junit4]   2> 33100 INFO  (TEST-BasicDistributedZkTest.test-seed#[639B3709D4E0FCE]) [    ] o.a.s.c.c.ConnectionManager Waiting for client to connect to ZooKeeper
   [junit4]   2> 33101 INFO  (zkCallback-36-thread-1) [    ] o.a.s.c.c.ConnectionManager Watcher org.apache.solr.common.cloud.ConnectionManager@1fef4b5 name:ZooKeeperConnection Watcher:127.0.0.1:59331 got event WatchedEvent state:SyncConnected type:None path:null path:null type:None
   [junit4]   2> 33101 INFO  (TEST-BasicDistributedZkTest.test-seed#[639B3709D4E0FCE]) [    ] o.a.s.c.c.ConnectionManager Client is connected to ZooKeeper
   [junit4]   2> 33101 INFO  (TEST-BasicDistributedZkTest.test-seed#[639B3709D4E0FCE]) [    ] o.a.s.c.c.SolrZkClient Using default ZkACLProvider
   [junit4]   2> 33102 INFO  (TEST-BasicDistributedZkTest.test-seed#[639B3709D4E0FCE]) [n:127.0.0.1:33848__vgl    ] o.a.s.c.c.ConnectionManager Waiting for client to connect to ZooKeeper
   [junit4]   2> 33103 INFO  (zkCallback-37-thread-1-processing-n:127.0.0.1:33848__vgl) [n:127.0.0.1:33848__vgl    ] o.a.s.c.c.ConnectionManager Watcher org.apache.solr.common.cloud.ConnectionManager@194e5ec name:ZooKeeperConnection Watcher:127.0.0.1:59331/solr got event WatchedEvent state:SyncConnected type:None path:null path:null type:None
   [junit4]   2> 33103 INFO  (TEST-BasicDistributedZkTest.test-seed#[639B3709D4E0FCE]) [n:127.0.0.1:33848__vgl    ] o.a.s.c.c.ConnectionManager Client is connected to ZooKeeper
   [junit4]   2> 33104 INFO  (TEST-BasicDistributedZkTest.test-seed#[639B3709D4E0FCE]) [n:127.0.0.1:33848__vgl    ] o.a.s.c.c.SolrZkClient makePath: /overseer/queue
   [junit4]   2> 33105 INFO  (TEST-BasicDistributedZkTest.test-seed#[639B3709D4E0FCE]) [n:127.0.0.1:33848__vgl    ] o.a.s.c.c.SolrZkClient makePath: /overseer/collection-queue-work
   [junit4]   2> 33107 INFO  (TEST-BasicDistributedZkTest.test-seed#[639B3709D4E0FCE]) [n:127.0.0.1:33848__vgl    ] o.a.s.c.c.SolrZkClient makePath: /overseer/collection-map-running
   [junit4]   2> 33108 INFO  (TEST-BasicDistributedZkTest.test-seed#[639B3709D4E0FCE]) [n:127.0.0.1:33848__vgl    ] o.a.s.c.c.SolrZkClient makePath: /overseer/collection-map-completed
   [junit4]   2> 33109 INFO  (TEST-BasicDistributedZkTest.test-seed#[639B3709D4E0FCE]) [n:127.0.0.1:33848__vgl    ] o.a.s.c.c.SolrZkClient makePath: /overseer/collection-map-failure
   [junit4]   2> 33111 INFO  (TEST-BasicDistributedZkTest.test-seed#[639B3709D4E0FCE]) [n:127.0.0.1:33848__vgl    ] o.a.s.c.c.SolrZkClient makePath: /live_nodes
   [junit4]   2> 33111 INFO  (TEST-BasicDistributedZkTest.test-seed#[639B3709D4E0FCE]) [n:127.0.0.1:33848__vgl    ] o.a.s.c.c.SolrZkClient makePath: /aliases.json
   [junit4]   2> 33112 INFO  (TEST-BasicDistributedZkTest.test-seed#[639B3709D4E0FCE]) [n:127.0.0.1:33848__vgl    ] o.a.s.c.c.SolrZkClient makePath: /clusterstate.json
   [junit4]   2> 33113 INFO  (TEST-BasicDistributedZkTest.test-seed#[639B3709D4E0FCE]) [n:127.0.0.1:33848__vgl    ] o.a.s.c.c.SolrZkClient makePath: /security.json
   [junit4]   2> 33113 INFO  (TEST-BasicDistributedZkTest.test-seed#[639B3709D4E0FCE]) [n:127.0.0.1:33848__vgl    ] o.a.s.c.ZkController Register node as live in ZooKeeper:/live_nodes/127.0.0.1:33848__vgl
   [junit4]   2> 33113 INFO  (TEST-BasicDistributedZkTest.test-seed#[639B3709D4E0FCE]) [n:127.0.0.1:33848__vgl    ] o.a.s.c.c.SolrZkClient makePath: /live_nodes/127.0.0.1:33848__vgl
   [junit4]   2> 33114 INFO  (TEST-BasicDistributedZkTest.test-seed#[639B3709D4E0FCE]) [n:127.0.0.1:33848__vgl    ] o.a.s.c.c.SolrZkClient makePath: /overseer_elect
   [junit4]   2> 33115 INFO  (TEST-BasicDistributedZkTest.test-seed#[639B3709D4E0FCE]) [n:127.0.0.1:33848__vgl    ] o.a.s.c.c.SolrZkClient makePath: /overseer_elect/election
   [junit4]   2> 33116 INFO  (TEST-BasicDistributedZkTest.test-seed#[639B3709D4E0FCE]) [n:127.0.0.1:33848__vgl    ] o.a.s.c.Overseer Overseer (id=null) closing
   [junit4]   2> 33116 INFO  (TEST-BasicDistributedZkTest.test-seed#[639B3709D4E0FCE]) [n:127.0.0.1:33848__vgl    ] o.a.s.c.LeaderElector Joined leadership election with path: /overseer_elect/election/95225870153744388-127.0.0.1:33848__vgl-n_0000000000
   [junit4]   2> 33116 INFO  (TEST-BasicDistributedZkTest.test-seed#[639B3709D4E0FCE]) [n:127.0.0.1:33848__vgl    ] o.a.s.c.OverseerElectionContext I am going to be the leader 127.0.0.1:33848__vgl
   [junit4]   2> 33116 INFO  (TEST-BasicDistributedZkTest.test-seed#[639B3709D4E0FCE]) [n:127.0.0.1:33848__vgl    ] o.a.s.c.c.SolrZkClient makePath: /overseer_elect/leader
   [junit4]   2> 33117 INFO  (TEST-BasicDistributedZkTest.test-seed#[639B3709D4E0FCE]) [n:127.0.0.1:33848__vgl    ] o.a.s.c.Overseer Overseer (id=95225870153744388-127.0.0.1:33848__vgl-n_0000000000) starting
   [junit4]   2> 33118 INFO  (TEST-BasicDistributedZkTest.test-seed#[639B3709D4E0FCE]) [n:127.0.0.1:33848__vgl    ] o.a.s.c.c.SolrZkClient makePath: /overseer/queue-work
   [junit4]   2> 33121 INFO  (TEST-BasicDistributedZkTest.test-seed#[639B3709D4E0FCE]) [n:127.0.0.1:33848__vgl    ] o.a.s.c.OverseerAutoReplicaFailoverThread Starting OverseerAutoReplicaFailoverThread autoReplicaFailoverWorkLoopDelay=10000 autoReplicaFailoverWaitAfterExpiration=30000 autoReplicaFailoverBadNodeExpiration=60000
   [junit4]   2> 33121 INFO  (OverseerStateUpdate-95225870153744388-127.0.0.1:33848__vgl-n_0000000000) [n:127.0.0.1:33848__vgl    ] o.a.s.c.Overseer Starting to work on the main queue
   [junit4]   2> 33122 INFO  (OverseerStateUpdate-95225870153744388-127.0.0.1:33848__vgl-n_0000000000) [n:127.0.0.1:33848__vgl    ] o.a.s.c.c.ZkStateReader Updating cluster state from ZooKeeper... 
   [junit4]   2> 33125 INFO  (OverseerCollectionConfigSetProcessor-95225870153744388-127.0.0.1:33848__vgl-n_0000000000) [n:127.0.0.1:33848__vgl    ] o.a.s.c.OverseerTaskProcessor Process current queue of overseer operations
   [junit4]   2> 33128 INFO  (TEST-BasicDistributedZkTest.test-seed#[639B3709D4E0FCE]) [n:127.0.0.1:33848__vgl    ] o.a.s.c.c.ZkStateReader Updating cluster state from ZooKeeper... 
   [junit4]   2> 33172 INFO  (TEST-BasicDistributedZkTest.test-seed#[639B3709D4E0FCE]) [n:127.0.0.1:33848__vgl    ] o.a.s.c.CoreContainer Security conf doesn't exist. Skipping setup for authorization module.
   [junit4]   2> 33173 INFO  (TEST-BasicDistributedZkTest.test-seed#[639B3709D4E0FCE]) [n:127.0.0.1:33848__vgl    ] o.a.s.c.CoreContainer No authentication plugin used.
   [junit4]   2> 33173 INFO  (TEST-BasicDistributedZkTest.test-seed#[639B3709D4E0FCE]) [n:127.0.0.1:33848__vgl    ] o.a.s.c.CorePropertiesLocator Looking for core definitions underneath /home/jenkins/workspace/Lucene-Solr-5.4-Linux/solr/build/solr-core/test/J0/temp/solr.cloud.BasicDistributedZkTest_639B3709D4E0FCE-001/control-001/cores
   [junit4]   2> 33174 INFO  (TEST-BasicDistributedZkTest.test-seed#[639B3709D4E0FCE]) [n:127.0.0.1:33848__vgl    ] o.a.s.c.CoreDescriptor Created CoreDescriptor: {coreNodeName=, shard=, config=solrconfig.xml, name=collection1, configSetProperties=configsetprops.json, dataDir=data/, collection=control_collection, instanceDir=/home/jenkins/workspace/Lucene-Solr-5.4-Linux/solr/build/solr-core/test/J0/temp/solr.cloud.BasicDistributedZkTest_639B3709D4E0FCE-001/control-001/cores/collection1, absoluteInstDir=/home/jenkins/workspace/Lucene-Solr-5.4-Linux/solr/build/solr-core/test/J0/temp/solr.cloud.BasicDistributedZkTest_639B3709D4E0FCE-001/control-001/cores/collection1/, transient=false, loadOnStartup=true, schema=schema.xml}
   [junit4]   2> 33174 INFO  (TEST-BasicDistributedZkTest.test-seed#[639B3709D4E0FCE]) [n:127.0.0.1:33848__vgl    ] o.a.s.c.CorePropertiesLocator Found core collection1 in /home/jenkins/workspace/Lucene-Solr-5.4-Linux/solr/build/solr-core/test/J0/temp/solr.cloud.BasicDistributedZkTest_639B3709D4E0FCE-001/control-001/cores/collection1/
   [junit4]   2> 33174 INFO  (TEST-BasicDistributedZkTest.test-seed#[639B3709D4E0FCE]) [n:127.0.0.1:33848__vgl    ] o.a.s.c.CorePropertiesLocator Found 1 core definitions
   [junit4]   2> 33175 INFO  (TEST-BasicDistributedZkTest.test-seed#[639B3709D4E0FCE]) [n:127.0.0.1:33848__vgl    ] o.a.s.s.SolrDispatchFilter user.dir=/home/jenkins/workspace/Lucene-Solr-5.4-Linux/solr/build/solr-core/test/J0
   [junit4]   2> 33175 INFO  (TEST-BasicDistributedZkTest.test-seed#[639B3709D4E0FCE]) [n:127.0.0.1:33848__vgl    ] o.a.s.s.SolrDispatchFilter SolrDispatchFilter.init() done
   [junit4]   2> 33175 INFO  (coreLoadExecutor-115-thread-1-processing-n:127.0.0.1:33848__vgl) [n:127.0.0.1:33848__vgl c:control_collection   x:collection1] o.a.s.c.ZkController publishing state=down
   [junit4]   2> 33175 INFO  (coreLoadExecutor-115-thread-1-processing-n:127.0.0.1:33848__vgl) [n:127.0.0.1:33848__vgl c:control_collection   x:collection1] o.a.s.c.ZkController numShards not found on descriptor - reading it from system property
   [junit4]   2> 33176 INFO  (coreLoadExecutor-115-thread-1-processing-n:127.0.0.1:33848__vgl) [n:127.0.0.1:33848__vgl c:control_collection   x:collection1] o.a.s.c.ZkController look for our core node name
   [junit4]   2> 33176 INFO  (OverseerStateUpdate-95225870153744388-127.0.0.1:33848__vgl-n_0000000000) [n:127.0.0.1:33848__vgl    ] o.a.s.c.Overseer processMessage: queueSize: 1, message = {
   [junit4]   2>   "shard":null,
   [junit4]   2>   "state":"down",
   [junit4]   2>   "roles":null,
   [junit4]   2>   "numShards":"1",
   [junit4]   2>   "base_url":"http://127.0.0.1:33848/_vgl",
   [junit4]   2>   "node_name":"127.0.0.1:33848__vgl",
   [junit4]   2>   "core":"collection1",
   [junit4]   2>   "operation":"state",
   [junit4]   2>   "collection":"control_collection"} current state version: 0
   [junit4]   2> 33176 INFO  (OverseerStateUpdate-95225870153744388-127.0.0.1:33848__vgl-n_0000000000) [n:127.0.0.1:33848__vgl    ] o.a.s.c.o.ReplicaMutator Update state numShards=1 message={
   [junit4]   2>   "shard":null,
   [junit4]   2>   "state":"down",
   [junit4]   2>   "roles":null,
   [junit4]   2>   "numShards":"1",
   [junit4]   2>   "base_url":"http://127.0.0.1:33848/_vgl",
   [junit4]   2>   "node_name":"127.0.0.1:33848__vgl",
   [junit4]   2>   "core":"collection1",
   [junit4]   2>   "operation":"state",
   [junit4]   2>   "collection":"control_collection"}
   [junit4]   2> 33177 INFO  (OverseerStateUpdate-95225870153744388-127.0.0.1:33848__vgl-n_0000000000) [n:127.0.0.1:33848__vgl    ] o.a.s.c.o.ClusterStateMutator building a new cName: control_collection
   [junit4]   2> 33177 INFO  (OverseerStateUpdate-95225870153744388-127.0.0.1:33848__vgl-n_0000000000) [n:127.0.0.1:33848__vgl    ] o.a.s.c.o.ReplicaMutator Assigning new node to shard shard=shard1
   [junit4]   2> 33178 INFO  (zkCallback-37-thread-1-processing-n:127.0.0.1:33848__vgl) [n:127.0.0.1:33848__vgl    ] o.a.s.c.c.ZkStateReader A cluster state change: WatchedEvent state:SyncConnected type:NodeDataChanged path:/clusterstate.json, has occurred - updating... (live nodes size: 1)
   [junit4]   2> 33179 INFO  (zkCallback-37-thread-2-processing-n:127.0.0.1:33848__vgl) [n:127.0.0.1:33848__vgl    ] o.a.s.c.c.ZkStateReader A cluster state change: WatchedEvent state:SyncConnected type:NodeDataChanged path:/clusterstate.json, has occurred - updating... (live nodes size: 1)
   [junit4]   2> 34176 INFO  (coreLoadExecutor-115-thread-1-processing-n:127.0.0.1:33848__vgl) [n:127.0.0.1:33848__vgl c:control_collection   x:collection1] o.a.s.c.ZkController waiting to find shard id in clusterstate for collection1
   [junit4]   2> 34177 INFO  (coreLoadExecutor-115-thread-1-processing-n:127.0.0.1:33848__vgl) [n:127.0.0.1:33848__vgl c:control_collection   x:collection1] o.a.s.c.ZkController Check for collection zkNode:control_collection
   [junit4]   2> 34177 INFO  (coreLoadExecutor-115-thread-1-processing-n:127.0.0.1:33848__vgl) [n:127.0.0.1:33848__vgl c:control_collection   x:collection1] o.a.s.c.ZkController Collection zkNode exists
   [junit4]   2> 34177 INFO  (coreLoadExecutor-115-thread-1-processing-n:127.0.0.1:33848__vgl) [n:127.0.0.1:33848__vgl c:control_collection   x:collection1] o.a.s.c.c.ZkStateReader Load collection config from:/collections/control_collection
   [junit4]   2> 34177 INFO  (coreLoadExecutor-115-thread-1-processing-n:127.0.0.1:33848__vgl) [n:127.0.0.1:33848__vgl c:control_collection   x:collection1] o.a.s.c.c.ZkStateReader path=/collections/control_collection configName=conf1 specified config exists in ZooKeeper
   [junit4]   2> 34177 INFO  (coreLoadExecutor-115-thread-1-processing-n:127.0.0.1:33848__vgl) [n:127.0.0.1:33848__vgl c:control_collection   x:collection1] o.a.s.c.SolrResourceLoader new SolrResourceLoader for directory: '/home/jenkins/workspace/Lucene-Solr-5.4-Linux/solr/build/solr-core/test/J0/temp/solr.cloud.BasicDistributedZkTest_639B3709D4E0FCE-001/control-001/cores/collection1'
   [junit4]   2> 34178 INFO  (coreLoadExecutor-115-thread-1-processing-n:127.0.0.1:33848__vgl) [n:127.0.0.1:33848__vgl c:control_collection   x:collection1] o.a.s.c.SolrResourceLoader JNDI not configured for solr (NoInitialContextEx)
   [junit4]   2> 34178 INFO  (coreLoadExecutor-115-thread-1-processing-n:127.0.0.1:33848__vgl) [n:127.0.0.1:33848__vgl c:control_collection   x:collection1] o.a.s.c.SolrResourceLoader solr home defaulted to 'solr/' (could not find system property or JNDI)
   [junit4]   2> 34179 INFO  (coreLoadExecutor-115-thread-1-processing-n:127.0.0.1:33848__vgl) [n:127.0.0.1:33848__vgl c:control_collection   x:collection1] o.a.s.c.Config loaded config solrconfig.xml with version 0 
   [junit4]   2> 34185 INFO  (coreLoadExecutor-115-thread-1-processing-n:127.0.0.1:33848__vgl) [n:127.0.0.1:33848__vgl c:control_collection   x:collection1] o.a.s.c.SolrConfig current version of requestparams : -1
   [junit4]   2> 34200 INFO  (coreLoadExecutor-115-thread-1-processing-n:127.0.0.1:33848__vgl) [n:127.0.0.1:33848__vgl c:control_collection   x:collection1] o.a.s.c.SolrConfig Using Lucene MatchVersion: 5.4.1
   [junit4]   2> 34224 INFO  (coreLoadExecutor-115-thread-1-processing-n:127.0.0.1:33848__vgl) [n:127.0.0.1:33848__vgl c:control_collection   x:collection1] o.a.s.c.SolrConfig Loaded SolrConfig: solrconfig.xml
   [junit4]   2> 34233 INFO  (coreLoadExecutor-115-thread-1-processing-n:127.0.0.1:33848__vgl) [n:127.0.0.1:33848__vgl c:control_collection   x:collection1] o.a.s.s.IndexSchema [collection1] Schema name=test
   [junit4]   2> 34440 INFO  (coreLoadExecutor-115-thread-1-processing-n:127.0.0.1:33848__vgl) [n:127.0.0.1:33848__vgl c:control_collection   x:collection1] o.a.s.s.OpenExchangeRatesOrgProvider Initialized with rates=open-exchange-rates.json, refreshInterval=1440.
   [junit4]   2> 34448 INFO  (coreLoadExecutor-115-thread-1-processing-n:127.0.0.1:33848__vgl) [n:127.0.0.1:33848__vgl c:control_collection   x:collection1] o.a.s.s.IndexSchema default search field in schema is text
   [junit4]   2> 34449 INFO  (coreLoadExecutor-115-thread-1-processing-n:127.0.0.1:33848__vgl) [n:127.0.0.1:33848__vgl c:control_collection   x:collection1] o.a.s.s.IndexSchema unique key field: id
   [junit4]   2> 34459 INFO  (coreLoadExecutor-115-thread-1-processing-n:127.0.0.1:33848__vgl) [n:127.0.0.1:33848__vgl c:control_collection   x:collection1] o.a.s.s.FileExchangeRateProvider Reloading exchange rates from file currency.xml
   [junit4]   2> 34463 INFO  (coreLoadExecutor-115-thread-1-processing-n:127.0.0.1:33848__vgl) [n:127.0.0.1:33848__vgl c:control_collection   x:collection1] o.a.s.s.FileExchangeRateProvider Reloading exchange rates from file currency.xml
   [junit4]   2> 34466 INFO  (coreLoadExecutor-115-thread-1-processing-n:127.0.0.1:33848__vgl) [n:127.0.0.1:33848__vgl c:control_collection   x:collection1] o.a.s.s.OpenExchangeRatesOrgProvider Reloading exchange rates from open-exchange-rates.json
   [junit4]   2> 34467 WARN  (coreLoadExecutor-115-thread-1-processing-n:127.0.0.1:33848__vgl) [n:127.0.0.1:33848__vgl c:control_collection   x:collection1] o.a.s.s.OpenExchangeRatesOrgProvider Unknown key IMPORTANT NOTE
   [junit4]   2> 34467 WARN  (coreLoadExecutor-115-thread-1-processing-n:127.0.0.1:33848__vgl) [n:127.0.0.1:33848__vgl c:control_collection   x:collection1] o.a.s.s.OpenExchangeRatesOrgProvider Expected key, got STRING
   [junit4]   2> 34467 INFO  (coreLoadExecutor-115-thread-1-processing-n:127.0.0.1:33848__vgl) [n:127.0.0.1:33848__vgl c:control_collection   x:collection1] o.a.s.s.OpenExchangeRatesOrgProvider Reloading exchange rates from open-exchange-rates.json
   [junit4]   2> 34467 WARN  (coreLoadExecutor-115-thread-1-processing-n:127.0.0.1:33848__vgl) [n:127.0.0.1:33848__vgl c:control_collection   x:collection1] o.a.s.s.OpenExchangeRatesOrgProvider Unknown key IMPORTANT NOTE
   [junit4]   2> 34467 WARN  (coreLoadExecutor-115-thread-1-processing-n:127.0.0.1:33848__vgl) [n:127.0.0.1:33848__vgl c:control_collection   x:collection1] o.a.s.s.OpenExchangeRatesOrgProvider Expected key, got STRING
   [junit4]   2> 34468 INFO  (coreLoadExecutor-115-thread-1-processing-n:127.0.0.1:33848__vgl) [n:127.0.0.1:33848__vgl c:control_collection   x:collection1] o.a.s.c.ConfigSetProperties Did not find ConfigSet properties, assuming default properties: Can't find resource 'configsetprops.json' in classpath or '/configs/conf1', cwd=/home/jenkins/workspace/Lucene-Solr-5.4-Linux/solr/build/solr-core/test/J0
   [junit4]   2> 34468 INFO  (coreLoadExecutor-115-thread-1-processing-n:127.0.0.1:33848__vgl) [n:127.0.0.1:33848__vgl c:control_collection   x:collection1] o.a.s.c.CoreContainer Creating SolrCore 'collection1' using configuration from collection control_collection
   [junit4]   2> 34468 INFO  (coreLoadExecutor-115-thread-1-processing-n:127.0.0.1:33848__vgl) [n:127.0.0.1:33848__vgl c:control_collection s:shard1 r:core_node1 x:collection1] o.a.s.c.SolrCore org.apache.solr.core.MockDirectoryFactory
   [junit4]   2> 34469 INFO  (coreLoadExecutor-115-thread-1-processing-n:127.0.0.1:33848__vgl) [n:127.0.0.1:33848__vgl c:control_collection s:shard1 r:core_node1 x:collection1] o.a.s.c.SolrCore [[collection1] ] Opening new SolrCore at [/home/jenkins/workspace/Lucene-Solr-5.4-Linux/solr/build/solr-core/test/J0/temp/solr.cloud.BasicDistributedZkTest_639B3709D4E0FCE-001/control-001/cores/collection1], dataDir=[null]
   [junit4]   2> 34469 INFO  (coreLoadExecutor-115-thread-1-processing-n:127.0.0.1:33848__vgl) [n:127.0.0.1:33848__vgl c:control_collection s:shard1 r:core_node1 x:collection1] o.a.s.c.JmxMonitoredMap JMX monitoring is enabled. Adding Solr mbeans to JMX Server: com.sun.jmx.mbeanserver.JmxMBeanServer@139f05e
   [junit4]   2> 34469 INFO  (coreLoadExecutor-115-thread-1-processing-n:127.0.0.1:33848__vgl) [n:127.0.0.1:33848__vgl c:control_collection s:shard1 r:core_node1 x:collection1] o.a.s.c.CachingDirectoryFactory return new directory for /home/jenkins/workspace/Lucene-Solr-5.4-Linux/solr/build/solr-core/test/J0/temp/solr.cloud.BasicDistributedZkTest_639B3709D4E0FCE-001/control-001/cores/collection1/data
   [junit4]   2> 34470 INFO  (coreLoadExecutor-115-thread-1-processing-n:127.0.0.1:33848__vgl) [n:127.0.0.1:33848__vgl c:control_collection s:shard1 r:core_node1 x:collection1] o.a.s.c.SolrCore New index directory detected: old=null new=/home/jenkins/workspace/Lucene-Solr-5.4-Linux/solr/build/solr-core/test/J0/temp/solr.cloud.BasicDistributedZkTest_639B3709D4E0FCE-001/control-001/cores/collection1/data/index/
   [junit4]   2> 34470 WARN  (coreLoadExecutor-115-thread-1-processing-n:127.0.0.1:33848__vgl) [n:127.0.0.1:33848__vgl c:control_collection s:shard1 r:core_node1 x:collection1] o.a.s.c.SolrCore [collection1] Solr index directory '/home/jenkins/workspace/Lucene-Solr-5.4-Linux/solr/build/solr-core/test/J0/temp/solr.cloud.BasicDistributedZkTest_639B3709D4E0FCE-001/control-001/cores/collection1/data/index' doesn't exist. Creating new index...
   [junit4]   2> 34472 INFO  (coreLoadExecutor-115-thread-1-processing-n:127.0.0.1:33848__vgl) [n:127.0.0.1:33848__vgl c:control_collection s:shard1 r:core_node1 x:collection1] o.a.s.c.CachingDirectoryFactory return new directory for /home/jenkins/workspace/Lucene-Solr-5.4-Linux/solr/build/solr-core/test/J0/temp/solr.cloud.BasicDistributedZkTest_639B3709D4E0FCE-001/control-001/cores/collection1/data/index
   [junit4]   2> 34472 INFO  (coreLoadExecutor-115-thread-1-processing-n:127.0.0.1:33848__vgl) [n:127.0.0.1:33848__vgl c:control_collection s:shard1 r:core_node1 x:collection1] o.a.s.u.RandomMergePolicy RandomMergePolicy wrapping class org.apache.lucene.index.LogDocMergePolicy: [LogDocMergePolicy: minMergeSize=1000, mergeFactor=35, maxMergeSize=9223372036854775807, maxMergeSizeForForcedMerge=9223372036854775807, calibrateSizeByDeletes=true, maxMergeDocs=2147483647, maxCFSSegmentSizeMB=8.796093022207999E12, noCFSRatio=0.0]
   [junit4]   2> 34479 INFO  (coreLoadExecutor-115-thread-1-processing-n:127.0.0.1:33848__vgl) [n:127.0.0.1:33848__vgl c:control_collection s:shard1 r:core_node1 x:collection1] o.a.s.c.SolrDeletionPolicy SolrDeletionPolicy.onCommit: commits: num=1
   [junit4]   2> 	commit{dir=MockDirectoryWrapper(NIOFSDirectory@/home/jenkins/workspace/Lucene-Solr-5.4-Linux/solr/build/solr-core/test/J0/temp/solr.cloud.BasicDistributedZkTest_639B3709D4E0FCE-001/index-NIOFSDirectory-001 lockFactory=org.apache.lucene.store.NativeFSLockFactory@5b0bc4),segFN=segments_1,generation=1}
   [junit4]   2> 34480 INFO  (coreLoadExecutor-115-thread-1-processing-n:127.0.0.1:33848__vgl) [n:127.0.0.1:33848__vgl c:control_collection s:shard1 r:core_node1 x:collection1] o.a.s.c.SolrDeletionPolicy newest commit generation = 1
   [junit4]   2> 34480 INFO  (OldIndexDirectoryCleanupThreadForCore-collection1) [n:127.0.0.1:33848__vgl c:control_collection s:shard1 r:core_node1 x:collection1] o.a.s.c.SolrCore Looking for old index directories to cleanup for core collection1 in /home/jenkins/workspace/Lucene-Solr-5.4-Linux/solr/build/solr-core/test/J0/temp/solr.cloud.BasicDistributedZkTest_639B3709D4E0FCE-001/control-001/cores/collection1/data/
   [junit4]   2> 34480 WARN  (OldIndexDirectoryCleanupThreadForCore-collection1) [n:127.0.0.1:33848__vgl c:control_collection s:shard1 r:core_node1 x:collection1] o.a.s.c.DirectoryFactory /home/jenkins/workspace/Lucene-Solr-5.4-Linux/solr/build/solr-core/test/J0/temp/solr.cloud.BasicDistributedZkTest_639B3709D4E0FCE-001/control-001/cores/collection1/data/ does not point to a valid data directory; skipping clean-up of old index directories.
   [junit4]   2> 34485 INFO  (coreLoadExecutor-115-thread-1-processing-n:127.0.0.1:33848__vgl) [n:127.0.0.1:33848__vgl c:control_collection s:shard1 r:core_node1 x:collection1] o.a.s.u.p.UpdateRequestProcessorChain creating updateRequestProcessorChain "nodistrib"
   [junit4]   2> 34485 INFO  (coreLoadExecutor-115-thread-1-processing-n:127.0.0.1:33848__vgl) [n:127.0.0.1:33848__vgl c:control_collection s:shard1 r:core_node1 x:collection1] o.a.s.u.p.UpdateRequestProcessorChain creating updateRequestProcessorChain "dedupe"
   [junit4]   2> 34485 INFO  (coreLoadExecutor-115-thread-1-processing-n:127.0.0.1:33848__vgl) [n:127.0.0.1:33848__vgl c:control_collection s:shard1 r:core_node1 x:collection1] o.a.s.u.p.UpdateRequestProcessorChain inserting DistributedUpdateProcessorFactory into updateRequestProcessorChain "dedupe"
   [junit4]   2> 34485 INFO  (coreLoadExecutor-115-thread-1-processing-n:127.0.0.1:33848__vgl) [n:127.0.0.1:33848__vgl c:control_collection s:shard1 r:core_node1 x:collection1] o.a.s.u.p.UpdateRequestProcessorChain creating updateRequestProcessorChain "stored_sig"
   [junit4]   2> 34485 INFO  (coreLoadExecutor-115-thread-1-processing-n:127.0.0.1:33848__vgl) [n:127.0.0.1:33848__vgl c:control_collection s:shard1 r:core_node1 x:collection1] o.a.s.u.p.UpdateRequestProcessorChain inserting DistributedUpdateProcessorFactory into updateRequestProcessorChain "stored_sig"
   [junit4]   2> 34485 INFO  (coreLoadExecutor-115-thread-1-processing-n:127.0.0.1:33848__vgl) [n:127.0.0.1:33848__vgl c:control_collection s:shard1 r:core_node1 x:collection1] o.a.s.u.p.UpdateRequestProcessorChain creating updateRequestProcessorChain "distrib-dup-test-chain-explicit"
   [junit4]   2> 34486 INFO  (coreLoadExecutor-115-thread-1-processing-n:127.0.0.1:33848__vgl) [n:127.0.0.1:33848__vgl c:control_collection s:shard1 r:core_node1 x:collection1] o.a.s.u.p.UpdateRequestProcessorChain creating updateRequestProcessorChain "distrib-dup-test-chain-implicit"
   [junit4]   2> 34486 INFO  (coreLoadExecutor-115-thread-1-processing-n:127.0.0.1:33848__vgl) [n:127.0.0.1:33848__vgl c:control_collection s:shard1 r:core_node1 x:collection1] o.a.s.u.p.UpdateRequestProcessorChain inserting DistributedUpdateProcessorFactory into updateRequestProcessorChain "distrib-dup-test-chain-implicit"
   [junit4]   2> 34486 INFO  (coreLoadExecutor-115-thread-1-processing-n:127.0.0.1:33848__vgl) [n:127.0.0.1:33848__vgl c:control_collection s:shard1 r:core_node1 x:collection1] o.a.s.c.SolrCore no updateRequestProcessorChain defined as default, creating implicit default
   [junit4]   2> 34487 WARN  (coreLoadExecutor-115-thread-1-processing-n:127.0.0.1:33848__vgl) [n:127.0.0.1:33848__vgl c:control_collection s:shard1 r:core_node1 x:collection1] o.a.s.c.RequestHandlers INVALID paramSet a in requestHandler {type = requestHandler,name = /dump,class = DumpRequestHandler,args = {defaults={a=A,b=B}}}
   [junit4]   2> 34490 INFO  (coreLoadExecutor-115-thread-1-processing-n:127.0.0.1:33848__vgl) [n:127.0.0.1:33848__vgl c:control_collection s:shard1 r:core_node1 x:collection1] o.a.s.h.l.XMLLoader xsltCacheLifetimeSeconds=60
   [junit4]   2> 34491 INFO  (coreLoadExecutor-115-thread-1-processing-n:127.0.0.1:33848__vgl) [n:127.0.0.1:33848__vgl c:control_collection s:shard1 r:core_node1 x:collection1] o.a.s.h.l.XMLLoader xsltCacheLifetimeSeconds=60
   [junit4]   2> 34493 INFO  (coreLoadExecutor-115-thread-1-processing-n:127.0.0.1:33848__vgl) [n:127.0.0.1:33848__vgl c:control_collection s:shard1 r:core_node1 x:collection1] o.a.s.h.l.XMLLoader xsltCacheLifetimeSeconds=60
   [junit4]   2> 34494 INFO  (coreLoadExecutor-115-thread-1-processing-n:127.0.0.1:33848__vgl) [n:127.0.0.1:33848__vgl c:control_collection s:shard1 r:core_node1 x:collection1] o.a.s.h.l.XMLLoader xsltCacheLifetimeSeconds=60
   [junit4]   2> 34505 INFO  (coreLoadExecutor-115-thread-1-processing-n:127.0.0.1:33848__vgl) [n:127.0.0.1:33848__vgl c:control_collection s:shard1 r:core_node1 x:collection1] o.a.s.c.RequestHandlers Registered paths: /admin/file,/update/csv,/admin/plugins,/admin/properties,/config,/update/json/docs,/update/json,/admin/segments,/get,/replication,/admin/logging,/admin/ping,/admin/threads,/admin/system,/schema,/update,/admin/mbeans,/dump,standard,/admin/luke
   [junit4]   2> 34506 INFO  (coreLoadExecutor-115-thread-1-processing-n:127.0.0.1:33848__vgl) [n:127.0.0.1:33848__vgl c:control_collection s:shard1 r:core_node1 x:collection1] o.a.s.c.SolrCore Using default statsCache cache: org.apache.solr.search.stats.LocalStatsCache
   [junit4]   2> 34507 INFO  (coreLoadExecutor-115-thread-1-processing-n:127.0.0.1:33848__vgl) [n:127.0.0.1:33848__vgl c:control_collection s:shard1 r:core_node1 x:collection1] o.a.s.u.UpdateHandler Using UpdateLog implementation: org.apache.solr.update.UpdateLog
   [junit4]   2> 34507 INFO  (coreLoadExecutor-115-thread-1-processing-n:127.0.0.1:33848__vgl) [n:127.0.0.1:33848__vgl c:control_collection s:shard1 r:core_node1 x:collection1] o.a.s.u.UpdateLog Initializing UpdateLog: dataDir= defaultSyncLevel=FLUSH numRecordsToKeep=100 maxNumLogsToKeep=10 numVersionBuckets=65536
   [junit4]   2> 34508 INFO  (coreLoadExecutor-115-thread-1-processing-n:127.0.0.1:33848__vgl) [n:127.0.0.1:33848__vgl c:control_collection s:shard1 r:core_node1 x:collection1] o.a.s.u.CommitTracker Hard AutoCommit: disabled
   [junit4]   2> 34508 INFO  (coreLoadExecutor-115-thread-1-processing-n:127.0.0.1:33848__vgl) [n:127.0.0.1:33848__vgl c:control_collection s:shard1 r:core_node1 x:collection1] o.a.s.u.CommitTracker Soft AutoCommit: disabled
   [junit4]   2> 34509 INFO  (coreLoadExecutor-115-thread-1-processing-n:127.0.0.1:33848__vgl) [n:127.0.0.1:33848__vgl c:control_collection s:shard1 r:core_node1 x:collection1] o.a.s.u.RandomMergePolicy RandomMergePolicy wrapping class org.apache.lucene.index.TieredMergePolicy: [TieredMergePolicy: maxMergeAtOnce=48, maxMergeAtOnceExplicit=28, maxMergedSegmentMB=94.056640625, floorSegmentMB=0.7724609375, forceMergeDeletesPctAllowed=7.654278320947029, segmentsPerTier=46.0, maxCFSSegmentSizeMB=8.796093022207999E12, noCFSRatio=0.7135337908411659
   [junit4]   2> 34511 INFO  (coreLoadExecutor-115-thread-1-processing-n:127.0.0.1:33848__vgl) [n:127.0.0.1:33848__vgl c:control_collection s:shard1 r:core_node1 x:collection1] o.a.s.c.SolrDeletionPolicy SolrDeletionPolicy.onInit: commits: num=1
   [junit4]   2> 	commit{dir=MockDirectoryWrapper(NIOFSDirectory@/home/jenkins/workspace/Lucene-Solr-5.4-Linux/solr/build/solr-core/test/J0/temp/solr.cloud.BasicDistributedZkTest_639B3709D4E0FCE-001/index-NIOFSDirectory-001 lockFactory=org.apache.lucene.store.NativeFSLockFactory@5b0bc4),segFN=segments_1,generation=1}
   [junit4]   2> 34511 INFO  (coreLoadExecutor-115-thread-1-processing-n:127.0.0.1:33848__vgl) [n:127.0.0.1:33848__vgl c:control_collection s:shard1 r:core_node1 x:collection1] o.a.s.c.SolrDeletionPolicy newest commit generation = 1
   [junit4]   2> 34511 INFO  (coreLoadExecutor-115-thread-1-processing-n:127.0.0.1:33848__vgl) [n:127.0.0.1:33848__vgl c:control_collection s:shard1 r:core_node1 x:collection1] o.a.s.s.SolrIndexSearcher Opening Searcher@c3c35e[collection1] main
   [junit4]   2> 34511 INFO  (coreLoadExecutor-115-thread-1-processing-n:127.0.0.1:33848__vgl) [n:127.0.0.1:33848__vgl c:control_collection s:shard1 r:core_node1 x:collection1] o.a.s.c.c.ZkStateReader Load collection config from:/collections/control_collection
   [junit4]   2> 34511 INFO  (coreLoadExecutor-115-thread-1-processing-n:127.0.0.1:33848__vgl) [n:127.0.0.1:33848__vgl c:control_collection s:shard1 r:core_node1 x:collection1] o.a.s.c.c.ZkStateReader path=/collections/control_collection configName=conf1 specified config exists in ZooKeeper
   [junit4]   2> 34511 INFO  (coreLoadExecutor-115-thread-1-processing-n:127.0.0.1:33848__vgl) [n:127.0.0.1:33848__vgl c:control_collection s:shard1 r:core_node1 x:collection1] o.a.s.r.ManagedResourceStorage Setting up ZooKeeper-based storage for the RestManager with znodeBase: /configs/conf1
   [junit4]   2> 34512 INFO  (coreLoadExecutor-115-thread-1-processing-n:127.0.0.1:33848__vgl) [n:127.0.0.1:33848__vgl c:control_collection s:shard1 r:core_node1 x:collection1] o.a.s.r.ManagedResourceStorage Configured ZooKeeperStorageIO with znodeBase: /configs/conf1
   [junit4]   2> 34512 INFO  (coreLoadExecutor-115-thread-1-processing-n:127.0.0.1:33848__vgl) [n:127.0.0.1:33848__vgl c:control_collection s:shard1 r:core_node1 x:collection1] o.a.s.r.RestManager Initializing RestManager with initArgs: {}
   [junit4]   2> 34512 INFO  (coreLoadExecutor-115-thread-1-processing-n:127.0.0.1:33848__vgl) [n:127.0.0.1:33848__vgl c:control_collection s:shard1 r:core_node1 x:collection1] o.a.s.r.ManagedResourceStorage Reading _rest_managed.json using ZooKeeperStorageIO:path=/configs/conf1
   [junit4]   2> 34512 INFO  (coreLoadExecutor-115-thread-1-processing-n:127.0.0.1:33848__vgl) [n:127.0.0.1:33848__vgl c:control_collection s:shard1 r:core_node1 x:collection1] o.a.s.r.ManagedResourceStorage No data found for znode /configs/conf1/_rest_managed.json
   [junit4]   2> 34512 INFO  (coreLoadExecutor-115-thread-1-processing-n:127.0.0.1:33848__vgl) [n:127.0.0.1:33848__vgl c:control_collection s:shard1 r:core_node1 x:collection1] o.a.s.r.ManagedResourceStorage Loaded null at path _rest_managed.json using ZooKeeperStorageIO:path=/configs/conf1
   [junit4]   2> 34512 INFO  (coreLoadExecutor-115-thread-1-processing-n:127.0.0.1:33848__vgl) [n:127.0.0.1:33848__vgl c:control_collection s:shard1 r:core_node1 x:collection1] o.a.s.r.RestManager Initializing 0 registered ManagedResources
   [junit4]   2> 34512 INFO  (coreLoadExecutor-115-thread-1-processing-n:127.0.0.1:33848__vgl) [n:127.0.0.1:33848__vgl c:control_collection s:shard1 r:core_node1 x:collection1] o.a.s.h.ReplicationHandler Commits will be reserved for  10000
   [junit4]   2> 34513 INFO  (searcherExecutor-116-thread-1-processing-s:shard1 r:core_node1 x:collection1 n:127.0.0.1:33848__vgl c:control_collection) [n:127.0.0.1:33848__vgl c:control_collection s:shard1 r:core_node1 x:collection1] o.a.s.c.SolrCore [collection1] Registered new searcher Searcher@c3c35e[collection1] main{ExitableDirectoryReader(UninvertingDirectoryReader())}
   [junit4]   2> 34513 INFO  (coreLoadExecutor-115-thread-1-processing-n:127.0.0.1:33848__vgl) [n:127.0.0.1:33848__vgl c:control_collection s:shard1 r:core_node1 x:collection1] o.a.s.u.UpdateLog Looking up max value of version field to seed version buckets
   [junit4]   2> 34513 INFO  (coreLoadExecutor-115-thread-1-processing-n:127.0.0.1:33848__vgl) [n:127.0.0.1:33848__vgl c:control_collection s:shard1 r:core_node1 x:collection1] o.a.s.u.VersionInfo Refreshing highest value of _version_ for 65536 version buckets from index
   [junit4]   2> 34513 INFO  (coreLoadExecutor-115-thread-1-processing-n:127.0.0.1:33848__vgl) [n:127.0.0.1:33848__vgl c:control_collection s:shard1 r:core_node1 x:collection1] o.a.s.u.VersionInfo No terms found for _version_, cannot seed version bucket highest value from index
   [junit4]   2> 34513 INFO  (coreLoadExecutor-115-thread-1-processing-n:127.0.0.1:33848__vgl) [n:127.0.0.1:33848__vgl c:control_collection s:shard1 r:core_node1 x:collection1] o.a.s.u.UpdateLog Could not find max version in index or recent updates, using new clock 1523613924155457536
   [junit4]   2> 34516 INFO  (coreLoadExecutor-115-thread-1-processing-n:127.0.0.1:33848__vgl) [n:127.0.0.1:33848__vgl c:control_collection s:shard1 r:core_node1 x:collection1] o.a.s.u.UpdateLog Took 2.0ms to seed version buckets with highest version 1523613924155457536
   [junit4]   2> 34516 INFO  (coreLoadExecutor-115-thread-1-processing-n:127.0.0.1:33848__vgl) [n:127.0.0.1:33848__vgl c:control_collection s:shard1 r:core_node1 x:collection1] o.a.s.c.ZkController watch zkdir /configs/conf1
   [junit4]   2> 34516 INFO  (coreLoadExecutor-115-thread-1-processing-n:127.0.0.1:33848__vgl) [n:127.0.0.1:33848__vgl c:control_collection s:shard1 r:core_node1 x:collection1] o.a.s.c.CoreContainer registering core: collection1
   [junit4]   2> 34516 INFO  (coreZkRegister-109-thread-1-processing-s:shard1 r:core_node1 x:collection1 n:127.0.0.1:33848__vgl c:control_collection) [n:127.0.0.1:33848__vgl c:control_collection s:shard1 r:core_node1 x:collection1] o.a.s.c.ZkController Register replica - core:collection1 address:http://127.0.0.1:33848/_vgl collection:control_collection shard:shard1
   [junit4]   2> 34517 INFO  (coreZkRegister-109-thread-1-processing-s:shard1 r:core_node1 x:collection1 n:127.0.0.1:33848__vgl c:control_collection) [n:127.0.0.1:33848__vgl c:control_collection s:shard1 r:core_node1 x:collection1] o.a.s.c.c.SolrZkClient makePath: /collections/control_collection/leader_elect/shard1/election
   [junit4]   2> 34519 INFO  (coreZkRegister-109-thread-1-processing-s:shard1 r:core_node1 x:collection1 n:127.0.0.1:33848__vgl c:control_collection) [n:127.0.0.1:33848__vgl c:control_collection s:shard1 r:core_node1 x:collection1] o.a.s.c.LeaderElector Joined leadership election with path: /collections/control_collection/leader_elect/shard1/election/95225870153744388-core_node1-n_0000000000
   [junit4]   2> 34520 INFO  (coreZkRegister-109-thread-1-processing-s:shard1 r:core_node1 x:collection1 n:127.0.0.1:33848__vgl c:control_collection) [n:127.0.0.1:33848__vgl c:control_collection s:shard1 r:core_node1 x:collection1] o.a.s.c.ShardLeaderElectionContext Running the leader process for shard shard1
   [junit4]   2> 34521 INFO  (coreZkRegister-109-thread-1-processing-s:shard1 r:core_node1 x:collection1 n:127.0.0.1:33848__vgl c:control_collection) [n:127.0.0.1:33848__vgl c:control_collection s:shard1 r:core_node1 x:collection1] o.a.s.c.ShardLeaderElectionContext Enough replicas found to continue.
   [junit4]   2> 34521 INFO  (coreZkRegister-109-thread-1-processing-s:shard1 r:core_node1 x:collection1 n:127.0.0.1:33848__vgl c:control_collection) [n:127.0.0.1:33848__vgl c:control_collection s:shard1 r:core_node1 x:collection1] o.a.s.c.ShardLeaderElectionContext I may be the new leader - try and sync
   [junit4]   2> 34521 INFO  (coreZkRegister-109-thread-1-processing-s:shard1 r:core_node1 x:collection1 n:127.0.0.1:33848__vgl c:control_collection) [n:127.0.0.1:33848__vgl c:control_collection s:shard1 r:core_node1 x:collection1] o.a.s.c.SyncStrategy Sync replicas to http://127.0.0.1:33848/_vgl/collection1/
   [junit4]   2> 34521 INFO  (coreZkRegister-109-thread-1-processing-s:shard1 r:core_node1 x:collection1 n:127.0.0.1:33848__vgl c:control_collection) [n:127.0.0.1:33848__vgl c:control_collection s:shard1 r:core_node1 x:collection1] o.a.s.c.SyncStrategy Sync Success - now sync replicas to me
   [junit4]   2> 34521 INFO  (coreZkRegister-109-thread-1-processing-s:shard1 r:core_node1 x:collection1 n:127.0.0.1:33848__vgl c:control_collection) [n:127.0.0.1:33848__vgl c:control_collection s:shard1 r:core_node1 x:collection1] o.a.s.c.SyncStrategy http://127.0.0.1:33848/_vgl/collection1/ has no replicas
   [junit4]   2> 34521 INFO  (OverseerStateUpdate-95225870153744388-127.0.0.1:33848__vgl-n_0000000000) [n:127.0.0.1:33848__vgl    ] o.a.s.c.Overseer processMessage: queueSize: 1, message = {
   [junit4]   2>   "operation":"leader",
   [junit4]   2>   "shard":"shard1",
   [junit4]   2>   "collection":"control_collection"} current state version: 1
   [junit4]   2> 34522 INFO  (coreZkRegister-109-thread-1-processing-s:shard1 r:core_node1 x:collection1 n:127.0.0.1:33848__vgl c:control_collection) [n:127.0.0.1:33848__vgl c:control_collection s:shard1 r:core_node1 x:collection1] o.a.s.c.c.SolrZkClient makePath: /collections/control_collection/leaders/shard1
   [junit4]   2> 34524 INFO  (coreZkRegister-109-thread-1-processing-s:shard1 r:core_node1 x:collection1 n:127.0.0.1:33848__vgl c:control_collection) [n:127.0.0.1:33848__vgl c:control_collection s:shard1 r:core_node1 x:collection1] o.a.s.c.ShardLeaderElectionContextBase Creating leader registration node
   [junit4]   2> 34526 INFO  (coreZkRegister-109-thread-1-processing-s:shard1 r:core_node1 x:collection1 n:127.0.0.1:33848__vgl c:control_collection) [n:127.0.0.1:33848__vgl c:control_collection s:shard1 r:core_node1 x:collection1] o.a.s.c.ShardLeaderElectionContext I am the new leader: http://127.0.0.1:33848/_vgl/collection1/ shard1
   [junit4]   2> 34527 INFO  (OverseerStateUpdate-95225870153744388-127.0.0.1:33848__vgl-n_0000000000) [n:127.0.0.1:33848__vgl    ] o.a.s.c.Overseer processMessage: queueSize: 1, message = {
   [junit4]   2>   "operation":"leader",
   [junit4]   2>   "shard":"shard1",
   [junit4]   2>   "collection":"control_collection",
   [junit4]   2>   "base_url":"http://127.0.0.1:33848/_vgl",
   [junit4]   2>   "core":"collection1",
   [junit4]   2>   "state":"active"} current state version: 1
   [junit4]   2> 34629 INFO  (zkCallback-37-thread-2-processing-n:127.0.0.1:33848__vgl) [n:127.0.0.1:33848__vgl    ] o.a.s.c.c.ZkStateReader A cluster state change: WatchedEvent state:SyncConnected type:NodeDataChanged path:/clusterstate.json, has occurred - updating... (live nodes size: 1)
   [junit4]   2> 34629 INFO  (zkCallback-37-thread-1-processing-n:127.0.0.1:33848__vgl) [n:127.0.0.1:33848__vgl    ] o.a.s.c.c.ZkStateReader A cluster state change: WatchedEvent state:SyncConnected type:NodeDataChanged path:/clusterstate.json, has occurred - updating... (live nodes size: 1)
   [junit4]   2> 34676 INFO  (TEST-BasicDistributedZkTest.test-seed#[639B3709D4E0FCE]) [    ] o.a.s.c.c.SolrZkClient Using default ZkCredentialsProvider
   [junit4]   2> 34677 INFO  (TEST-BasicDistributedZkTest.test-seed#[639B3709D4E0FCE]) [    ] o.a.s.c.c.ConnectionManager Waiting for client to connect to ZooKeeper
   [junit4]   2> 34677 INFO  (coreZkRegister-109-thread-1-processing-s:shard1 r:core_node1 x:collection1 n:127.0.0.1:33848__vgl c:control_collection) [n:127.0.0.1:33848__vgl c:control_collection s:shard1 r:core_node1 x:collection1] o.a.s.c.ZkController We are http://127.0.0.1:33848/_vgl/collection1/ and leader is http://127.0.0.1:33848/_vgl/collection1/
   [junit4]   2> 34677 INFO  (coreZkRegister-109-thread-1-processing-s:shard1 r:core_node1 x:collection1 n:127.0.0.1:33848__vgl c:control_collection) [n:127.0.0.1:33848__vgl c:control_collection s:shard1 r:core_node1 x:collection1] o.a.s.c.ZkController No LogReplay needed for core=collection1 baseURL=http://127.0.0.1:33848/_vgl
   [junit4]   2> 34677 INFO  (coreZkRegister-109-thread-1-processing-s:shard1 r:core_node1 x:collection1 n:127.0.0.1:33848__vgl c:control_collection) [n:127.0.0.1:33848__vgl c:control_collection s:shard1 r:core_node1 x:collection1] o.a.s.c.ZkController I am the leader, no recovery necessary
   [junit4]   2> 34677 INFO  (coreZkRegister-109-thread-1-processing-s:shard1 r:core_node1 x:collection1 n:127.0.0.1:33848__vgl c:control_collection) [n:127.0.0.1:33848__vgl c:control_collection s:shard1 r:core_node1 x:collection1] o.a.s.c.ZkController publishing state=active
   [junit4]   2> 34677 INFO  (coreZkRegister-109-thread-1-processing-s:shard1 r:core_node1 x:collection1 n:127.0.0.1:33848__vgl c:control_collection) [n:127.0.0.1:33848__vgl c:control_collection s:shard1 r:core_node1 x:collection1] o.a.s.c.ZkController numShards not found on descriptor - reading it from system property
   [junit4]   2> 34678 INFO  (zkCallback-39-thread-1) [    ] o.a.s.c.c.ConnectionManager Watcher org.apache.solr.common.cloud.ConnectionManager@33858c name:ZooKeeperConnection Watcher:127.0.0.1:59331/solr got event WatchedEvent state:SyncConnected type:None path:null path:null type:None
   [junit4]   2> 34679 INFO  (TEST-BasicDistributedZkTest.test-seed#[639B3709D4E0FCE]) [    ] o.a.s.c.c.ConnectionManager Client is connected to ZooKeeper
   [junit4]   2> 34679 INFO  (TEST-BasicDistributedZkTest.test-seed#[639B3709D4E0FCE]) [    ] o.a.s.c.c.SolrZkClient Using default ZkACLProvider
   [junit4]   2> 34679 INFO  (TEST-BasicDistributedZkTest.test-seed#[639B3709D4E0FCE]) [    ] o.a.s.c.c.ZkStateReader Updating cluster state from ZooKeeper... 
   [junit4]   2> 34679 INFO  (OverseerStateUpdate-95225870153744388-127.0.0.1:33848__vgl-n_0000000000) [n:127.0.0.1:33848__vgl    ] o.a.s.c.Overseer processMessage: queueSize: 1, message = {
   [junit4]   2>   "shard":"shard1",
   [junit4]   2>   "state":"active",
   [junit4]   2>   "roles":null,
   [junit4]   2>   "numShards":"2",
   [junit4]   2>   "base_url":"http://127.0.0.1:33848/_vgl",
   [junit4]   2>   "node_name":"127.0.0.1:33848__vgl",
   [junit4]   2>   "core":"collection1",
   [junit4]   2>   "operation":"state",
   [junit4]   2>   "collection":"control_collection",
   [junit4]   2>   "core_node_name":"core_node1"} current state version: 2
   [junit4]   2> 34680 INFO  (OverseerStateUpdate-95225870153744388-127.0.0.1:33848__vgl-n_0000000000) [n:127.0.0.1:33848__vgl    ] o.a.s.c.o.ReplicaMutator Update state numShards=2 message={
   [junit4]   2>   "shard":"shard1",
   [junit4]   2>   "state":"active",
   [junit4]   2>   "roles":null,
   [junit4]   2>   "numShards":"2",
   [junit4]   2>   "base_url":"http://127.0.0.1:33848/_vgl",
   [junit4]   2>   "node_name":"127.0.0.1:33848__vgl",
   [junit4]   2>   "core":"collection1",
   [junit4]   2>   "operation":"state",
   [junit4]   2>   "collection":"control_collection",
   [junit4]   2>   "core_node_name":"core_node1"}
   [junit4]   2> 34681 INFO  (TEST-BasicDistributedZkTest.test-seed#[639B3709D4E0FCE]) [    ] o.a.s.c.ChaosMonkey monkey: init - expire sessions:false cause connection loss:false
   [junit4]   2> 34771 INFO  (TEST-BasicDistributedZkTest.test-seed#[639B3709D4E0FCE]) [    ] o.a.s.SolrTestCaseJ4 Writing core.properties file to /home/jenkins/workspace/Lucene-Solr-5.4-Linux/solr/build/solr-core/test/J0/temp/solr.cloud.BasicDistributedZkTest_639B3709D4E0FCE-001/shard-1-001/cores/collection1
   [junit4]   2> 34772 INFO  (TEST-BasicDistributedZkTest.test-seed#[639B3709D4E0FCE]) [    ] o.a.s.c.AbstractFullDistribZkTestBase create jetty 1 in directory /home/jenkins/workspace/Lucene-Solr-5.4-Linux/solr/build/solr-core/test/J0/temp/solr.cloud.BasicDistributedZkTest_639B3709D4E0FCE-001/shard-1-001
   [junit4]   2> 34773 INFO  (TEST-BasicDistributedZkTest.test-seed#[639B3709D4E0FCE]) [    ] o.e.j.s.Server jetty-9.2.13.v20150730
   [junit4]   2> 34774 INFO  (TEST-BasicDistributedZkTest.test-seed#[639B3709D4E0FCE]) [    ] o.e.j.s.h.ContextHandler Started o.e.j.s.ServletContextHandler@27456b{/_vgl,null,AVAILABLE}
   [junit4]   2> 34775 INFO  (TEST-BasicDistributedZkTest.test-seed#[639B3709D4E0FCE]) [    ] o.e.j.s.ServerConnector Started ServerConnector@1877bec{HTTP/1.1}{127.0.0.1:34323}
   [junit4]   2> 34775 INFO  (TEST-BasicDistributedZkTest.test-seed#[639B3709D4E0FCE]) [    ] o.e.j.s.Server Started @36072ms
   [junit4]   2> 34775 INFO  (TEST-BasicDistributedZkTest.test-seed#[639B3709D4E0FCE]) [    ] o.a.s.c.s.e.JettySolrRunner Jetty properties: {hostPort=34323, coreRootDirectory=/home/jenkins/workspace/Lucene-Solr-5.4-Linux/solr/build/solr-core/test/J0/temp/solr.cloud.BasicDistributedZkTest_639B3709D4E0FCE-001/shard-1-001/cores, hostContext=/_vgl, solr.data.dir=/home/jenkins/workspace/Lucene-Solr-5.4-Linux/solr/build/solr-core/test/J0/temp/solr.cloud.BasicDistributedZkTest_639B3709D4E0FCE-001/tempDir-001/jetty1, solrconfig=solrconfig.xml}
   [junit4]   2> 34775 INFO  (TEST-BasicDistributedZkTest.test-seed#[639B3709D4E0FCE]) [    ] o.a.s.s.SolrDispatchFilter SolrDispatchFilter.init(): sun.misc.Launcher$AppClassLoader@26c088
   [junit4]   2> 34775 INFO  (TEST-BasicDistributedZkTest.test-seed#[639B3709D4E0FCE]) [    ] o.a.s.c.SolrResourceLoader new SolrResourceLoader for directory: '/home/jenkins/workspace/Lucene-Solr-5.4-Linux/solr/build/solr-core/test/J0/temp/solr.cloud.BasicDistributedZkTest_639B3709D4E0FCE-001/shard-1-001'
   [junit4]   2> 34776 INFO  (TEST-BasicDistributedZkTest.test-seed#[639B3709D4E0FCE]) [    ] o.a.s.c.SolrResourceLoader JNDI not configured for solr (NoInitialContextEx)
   [junit4]   2> 34776 INFO  (TEST-BasicDistributedZkTest.test-seed#[639B3709D4E0FCE]) [    ] o.a.s.c.SolrResourceLoader solr home defaulted to 'solr/' (could not find system property or JNDI)
   [junit4]   2> 34776 INFO  (TEST-BasicDistributedZkTest.test-seed#[639B3709D4E0FCE]) [    ] o.a.s.c.c.SolrZkClient Using default ZkCredentialsProvider
   [junit4]   2> 34776 INFO  (TEST-BasicDistributedZkTest.test-seed#[639B3709D4E0FCE]) [    ] o.a.s.c.c.ConnectionManager Waiting for client to connect to ZooKeeper
   [junit4]   2> 34777 INFO  (zkCallback-40-thread-1) [    ] o.a.s.c.c.ConnectionManager Watcher org.apache.solr.common.cloud.ConnectionManager@1a403ef name:ZooKeeperConnection Watcher:127.0.0.1:59331/solr got event WatchedEvent state:SyncConnected type:None path:null path:null type:None
   [junit4]   2> 34778 INFO  (TEST-BasicDistributedZkTest.test-seed#[639B3709D4E0FCE]) [    ] o.a.s.c.c.ConnectionManager Client is connected to ZooKeeper
   [junit4]   2> 34778 INFO  (TEST-BasicDistributedZkTest.test-seed#[639B3709D4E0FCE]) [    ] o.a.s.c.c.SolrZkClient Using default ZkACLProvider
   [junit4]   2> 34779 INFO  (TEST-BasicDistributedZkTest.test-seed#[639B3709D4E0FCE]) [    ] o.a.s.s.SolrDispatchFilter Loading solr.xml from SolrHome (not found in ZooKeeper)
   [junit4]   2> 34779 INFO  (TEST-BasicDistributedZkTest.test-seed#[639B3709D4E0FCE]) [    ] o.a.s.c.SolrXmlConfig Loading container configuration from /home/jenkins/workspace/Lucene-Solr-5.4-Linux/solr/build/solr-core/test/J0/temp/solr.cloud.BasicDistributedZkTest_639B3709D4E0FCE-001/shard-1-001/solr.xml
   [junit4]   2> 34782 INFO  (zkCallback-39-thread-1) [    ] o.a.s.c.c.ZkStateReader A cluster state change: WatchedEvent state:SyncConnected type:NodeDataChanged path:/clusterstate.json, has occurred - updating... (live nodes size: 1)
   [junit4]   2> 34782 INFO  (zkCallback-37-thread-2-processing-n:127.0.0.1:33848__vgl) [n:127.0.0.1:33848__vgl    ] o.a.s.c.c.ZkStateReader A cluster state change: WatchedEvent state:SyncConnected type:NodeDataChanged path:/clusterstate.json, has occurred - updating... (live nodes size: 1)
   [junit4]   2> 34782 INFO  (zkCallback-37-thread-1-processing-n:127.0.0.1:33848__vgl) [n:127.0.0.1:33848__vgl    ] o.a.s.c.c.ZkStateReader A cluster state change: WatchedEvent state:SyncConnected type:NodeDataChanged path:/clusterstate.json, has occurred - updating... (live nodes size: 1)
   [junit4]   2> 34792 INFO  (TEST-BasicDistributedZkTest.test-seed#[639B3709D4E0FCE]) [    ] o.a.s.c.CorePropertiesLocator Config-defined core root directory: /home/jenkins/workspace/Lucene-Solr-5.4-Linux/solr/build/solr-core/test/J0/temp/solr.cloud.BasicDistributedZkTest_639B3709D4E0FCE-001/shard-1-001/cores
   [junit4]   2> 34792 INFO  (TEST-BasicDistributedZkTest.test-seed#[639B3709D4E0FCE]) [    ] o.a.s.c.CoreContainer New CoreContainer 12298996
   [junit4]   2> 34792 INFO  (TEST-BasicDistributedZkTest.test-seed#[639B3709D4E0FCE]) [    ] o.a.s.c.CoreContainer Loading cores into CoreContainer [instanceDir=/home/jenkins/workspace/Lucene-Solr-5.4-Linux/solr/build/solr-core/test/J0/temp/solr.cloud.BasicDistributedZkTest_639B3709D4E0FCE-001/shard-1-001]
   [junit4]   2> 34792 WARN  (TEST-BasicDistributedZkTest.test-seed#[639B3709D4E0FCE]) [    ] o.a.s.c.CoreContainer Couldn't add files from /home/jenkins/workspace/Lucene-Solr-5.4-Linux/solr/build/solr-core/test/J0/temp/solr.cloud.BasicDistributedZkTest_639B3709D4E0FCE-001/shard-1-001/lib to classpath: /home/jenkins/workspace/Lucene-Solr-5.4-Linux/solr/build/solr-core/test/J0/temp/solr.cloud.BasicDistributedZkTest_639B3709D4E0FCE-001/shard-1-001/lib
   [junit4]   2> 34792 INFO  (TEST-BasicDistributedZkTest.test-seed#[639B3709D4E0FCE]) [    ] o.a.s.h.c.HttpShardHandlerFactory created with socketTimeout : 90000,urlScheme : ,connTimeout : 15000,maxConnectionsPerHost : 20,maxConnections : 10000,corePoolSize : 0,maximumPoolSize : 2147483647,maxThreadIdleTime : 5,sizeOfQueue : -1,fairnessPolicy : false,useRetries : false,
   [junit4]   2> 34793 INFO  (TEST-BasicDistributedZkTest.test-seed#[639B3709D4E0FCE]) [    ] o.a.s.u.UpdateShardHandler Creating UpdateShardHandler HTTP client with params: socketTimeout=340000&connTimeout=45000&retry=true
   [junit4]   2> 34794 INFO  (TEST-BasicDistributedZkTest.test-seed#[639B3709D4E0FCE]) [    ] o.a.s.l.LogWatcher SLF4J impl is org.slf4j.impl.Log4jLoggerFactory
   [junit4]   2> 34794 INFO  (TEST-BasicDistributedZkTest.test-seed#[639B3709D4E0FCE]) [    ] o.a.s.l.LogWatcher Registering Log Listener [Log4j (org.slf4j.impl.Log4jLoggerFactory)]
   [junit4]   2> 34794 INFO  (TEST-BasicDistributedZkTest.test-seed#[639B3709D4E0FCE]) [    ] o.a.s.c.ZkContainer Zookeeper client=127.0.0.1:59331/solr
   [junit4]   2> 34794 INFO  (TEST-BasicDistributedZkTest.test-seed#[639B3709D4E0FCE]) [    ] o.a.s.c.ZkController zkHost includes chroot
   [junit4]   2> 34794 INFO  (TEST-BasicDistributedZkTest.test-seed#[639B3709D4E0FCE]) [    ] o.a.s.c.c.SolrZkClient Using default ZkCredentialsProvider
   [junit4]   2> 34794 INFO  (TEST-BasicDistributedZkTest.test-seed#[639B3709D4E0FCE]) [    ] o.a.s.c.c.ConnectionManager Waiting for client to connect to ZooKeeper
   [junit4]   2> 34795 INFO  (zkCallback-42-thread-1) [    ] o.a.s.c.c.ConnectionManager Watcher org.apache.solr.common.cloud.ConnectionManager@1566ff2 name:ZooKeeperConnection Watcher:127.0.0.1:59331 got event WatchedEvent state:SyncConnected type:None path:null path:null type:None
   [junit4]   2> 34795 INFO  (TEST-BasicDistributedZkTest.test-seed#[639B3709D4E0FCE]) [    ] o.a.s.c.c.ConnectionManager Client is connected to ZooKeeper
   [junit4]   2> 34796 INFO  (TEST-BasicDistributedZkTest.test-seed#[639B3709D4E0FCE]) [    ] o.a.s.c.c.SolrZkClient Using default ZkACLProvider
   [junit4]   2> 34797 INFO  (TEST-BasicDistributedZkTest.test-seed#[639B3709D4E0FCE]) [n:127.0.0.1:34323__vgl    ] o.a.s.c.c.ConnectionManager Waiting for client to connect to ZooKeeper
   [junit4]   2> 34797 INFO  (zkCallback-43-thread-1-processing-n:127.0.0.1:34323__vgl) [n:127.0.0.1:34323__vgl    ] o.a.s.c.c.ConnectionManager Watcher org.apache.solr.common.cloud.ConnectionManager@9ce8ce name:ZooKeeperConnection Watcher:127.0.0.1:59331/solr got event WatchedEvent state:SyncConnected type:None path:null path:null type:None
   [junit4]   2> 34798 INFO  (TEST-BasicDistributedZkTest.test-seed#[639B3709D4E0FCE]) [n:127.0.0.1:34323__vgl    ] o.a.s.c.c.ConnectionManager Client is connected to ZooKeeper
   [junit4]   2> 34801 INFO  (TEST-BasicDistributedZkTest.test-seed#[639B3709D4E0FCE]) [n:127.0.0.1:34323__vgl    ] o.a.s.c.c.ZkStateReader Updating cluster state from ZooKeeper... 
   [junit4]   2> 35804 INFO  (TEST-BasicDistributedZkTest.test-seed#[639B3709D4E0FCE]) [n:127.0.0.1:34323__vgl    ] o.a.s.c.ZkController Register node as live in ZooKeeper:/live_nodes/127.0.0.1:34323__vgl
   [junit4]   2> 35805 INFO  (TEST-BasicDistributedZkTest.test-seed#[639B3709D4E0FCE]) [n:127.0.0.1:34323__vgl    ] o.a.s.c.c.SolrZkClient makePath: /live_nodes/127.0.0.1:34323__vgl
   [junit4]   2> 35805 INFO  (zkCallback-37-thread-1-processing-n:127.0.0.1:33848__vgl) [n:127.0.0.1:33848__vgl    ] o.a.s.c.c.ZkStateReader A live node change: WatchedEvent state:SyncConnected type:NodeChildrenChanged path:/live_nodes, has occurred - updating... (live nodes size: 1)
   [junit4]   2> 35805 INFO  (zkCallback-43-thread-1-processing-n:127.0.0.1:34323__vgl) [n:127.0.0.1:34323__vgl    ] o.a.s.c.c.ZkStateReader A live node change: WatchedEvent state:SyncConnected type:NodeChildrenChanged path:/live_nodes, has occurred - updating... (live nodes size: 1)
   [junit4]   2> 35805 INFO  (zkCallback-39-thread-1) [    ] o.a.s.c.c.ZkStateReader A live node change: WatchedEvent state:SyncConnected type:NodeChildrenChanged path:/live_nodes, has occurred - updating... (live nodes size: 1)
   [junit4]   2> 35805 INFO  (zkCallback-37-thread-2-processing-n:127.0.0.1:33848__vgl) [n:127.0.0.1:33848__vgl    ] o.a.s.c.c.ZkStateReader A live node change: WatchedEvent state:SyncConnected type:NodeChildrenChanged path:/live_nodes, has occurred - updating... (live nodes size: 1)
   [junit4]   2> 35807 INFO  (TEST-BasicDistributedZkTest.test-seed#[639B3709D4E0FCE]) [n:127.0.0.1:34323__vgl    ] o.a.s.c.Overseer Overseer (id=null) closing
   [junit4]   2> 35807 INFO  (TEST-BasicDistributedZkTest.test-seed#[639B3709D4E0FCE]) [n:127.0.0.1:34323__vgl    ] o.a.s.c.LeaderElector Joined leadership election with path: /overseer_elect/election/95225870153744392-127.0.0.1:34323__vgl-n_0000000001
   [junit4]   2> 35807 INFO  (TEST-BasicDistributedZkTest.test-seed#[639B3709D4E0FCE]) [n:127.0.0.1:34323__vgl    ] o.a.s.c.LeaderElector Watching path /overseer_elect/election/95225870153744388-127.0.0.1:33848__vgl-n_0000000000 to know if I could be the leader
   [junit4]   2> 35831 INFO  (TEST-BasicDistributedZkTest.test-seed#[639B3709D4E0FCE]) [n:127.0.0.1:34323__vgl    ] o.a.s.c.CoreContainer Security conf doesn't exist. Skipping setup for authorization module.
   [junit4]   2> 35831 INFO  (TEST-BasicDistributedZkTest.test-seed#[639B3709D4E0FCE]) [n:127.0.0.1:34323__vgl    ] o.a.s.c.CoreContainer No authentication plugin used.
   [junit4]   2> 35832 INFO  (TEST-BasicDistributedZkTest.test-seed#[639B3709D4E0FCE]) [n:127.0.0.1:34323__vgl    ] o.a.s.c.CorePropertiesLocator Looking for core definitions underneath /home/jenkins/workspace/Lucene-Solr-5.4-Linux/solr/build/solr-core/test/J0/temp/solr.cloud.BasicDistributedZkTest_639B3709D4E0FCE-001/shard-1-001/cores
   [junit4]   2> 35832 INFO  (TEST-BasicDistributedZkTest.test-seed#[639B3709D4E0FCE]) [n:127.0.0.1:34323__vgl    ] o.a.s.c.CoreDescriptor Created CoreDescriptor: {shard=, configSetProperties=configsetprops.json, collection=collection1, dataDir=data/, instanceDir=/home/jenkins/workspace/Lucene-Solr-5.4-Linux/solr/build/solr-core/test/J0/temp/solr.cloud.BasicDistributedZkTest_639B3709D4E0FCE-001/shard-1-001/cores/collection1, absoluteInstDir=/home/jenkins/workspace/Lucene-Solr-5.4-Linux/solr/build/solr-core/test/J0/temp/solr.cloud.BasicDistributedZkTest_639B3709D4E0FCE-001/shard-1-001/cores/collection1/, config=solrconfig.xml, coreNodeName=, schema=schema.xml, loadOnStartup=true, transient=false, name=collection1}
   [junit4]   2> 35832 INFO  (TEST-BasicDistributedZkTest.test-seed#[639B3709D4E0FCE]) [n:127.0.0.1:34323__vgl    ] o.a.s.c.CorePropertiesLocator Found core collection1 in /home/jenkins/workspace/Lucene-Solr-5.4-Linux/solr/build/solr-core/test/J0/temp/solr.cloud.BasicDistributedZkTest_639B3709D4E0FCE-001/shard-1-001/cores/collection1/
   [junit4]   2> 35832 INFO  (TEST-BasicDistributedZkTest.test-seed#[639B3709D4E0FCE]) [n:127.0.0.1:34323__vgl    ] o.a.s.c.CorePropertiesLocator Found 1 core definitions
   [junit4]   2> 35833 INFO  (TEST-BasicDistributedZkTest.test-seed#[639B3709D4E0FCE]) [n:127.0.0.1:34323__vgl    ] o.a.s.s.SolrDispatchFilter user.dir=/home/jenkins/workspace/Lucene-Solr-5.4-Linux/solr/build/solr-core/test/J0
   [junit4]   2> 35833 INFO  (TEST-BasicDistributedZkTest.test-seed#[639B3709D4E0FCE]) [n:127.0.0.1:34323__vgl    ] o.a.s.s.SolrDispatchFilter SolrDispatchFilter.init() done
   [junit4]   2> 35833 INFO  (coreLoadExecutor-126-thread-1-processing-n:127.0.0.1:34323__vgl) [n:127.0.0.1:34323__vgl c:collection1   x:collection1] o.a.s.c.ZkController publishing state=down
   [junit4]   2> 35833 INFO  (coreLoadExecutor-126-thread-1-processing-n:127.0.0.1:34323__vgl) [n:127.0.0.1:34323__vgl c:collection1   x:collection1] o.a.s.c.ZkController numShards not found on descriptor - reading it from system property
   [junit4]   2> 35835 INFO  (OverseerStateUpdate-95225870153744388-127.0.0.1:33848__vgl-n_0000000000) [n:127.0.0.1:33848__vgl    ] o.a.s.c.Overseer processMessage: queueSize: 1, message = {
   [junit4]   2>   "shard":null,
   [junit4]   2>   "state":"down",
   [junit4]   2>   "roles":null,
   [junit4]   2>   "numShards":"2",
   [junit4]   2>   "base_url":"http://127.0.0.1:34323/_vgl",
   [junit4]   2>   "node_name":"127.0.0.1:34323__vgl",
   [junit4]   2>   "core":"collection1",
   [junit4]   2>   "operation":"state",
   [junit4]   2>   "collection":"collection1"} current state version: 3
   [junit4]   2> 35835 INFO  (OverseerStateUpdate-95225870153744388-127.0.0.1:33848__vgl-n_0000000000) [n:127.0.0.1:33848__vgl    ] o.a.s.c.o.ReplicaMutator Update state numShards=2 message={
   [junit4]   2>   "shard":null,
   [junit4]   2>   "state":"down",
   [junit4]   2>   "roles":null,
   [junit4]   2>   "numShards":"2",
   [junit4]   2>   "base_url":"http://127.0.0.1:34323/_vgl",
   [junit4]   2>   "node_name":"127.0.0.1:34323__vgl",
   [junit4]   2>   "core":"collection1",
   [junit4]   2>   "operation":"state",
   [junit4]   2>   "collection":"collection1"}
   [junit4]   2> 35835 INFO  (OverseerStateUpdate-95225870153744388-127.0.0.1:33848__vgl-n_0000000000) [n:127.0.0.1:33848__vgl    ] o.a.s.c.o.ClusterStateMutator building a new cName: collection1
   [junit4]   2> 35835 INFO  (OverseerStateUpdate-95225870153744388-127.0.0.1:33848__vgl-n_0000000000) [n:127.0.0.1:33848__vgl    ] o.a.s.c.o.ReplicaMutator Assigning new node to shard shard=shard1
   [junit4]   2> 35836 INFO  (coreLoadExecutor-126-thread-1-processing-n:127.0.0.1:34323__vgl) [n:127.0.0.1:34323__vgl c:collection1   x:collection1] o.a.s.c.ZkController look for our core node name
   [junit4]   2> 35937 INFO  (zkCallback-43-thread-1-processing-n:127.0.0.1:34323__vgl) [n:127.0.0.1:34323__vgl    ] o.a.s.c.c.ZkStateReader A cluster state change: WatchedEvent state:SyncConnected type:NodeDataChanged path:/clusterstate.json, has occurred - updating... (live nodes size: 2)
   [junit4]   2> 35937 INFO  (zkCallback-37-thread-2-processing-n:127.0.0.1:33848__vgl) [n:127.0.0.1:33848__vgl    ] o.a.s.c.c.ZkStateReader A cluster state change: WatchedEvent state:SyncConnected type:NodeDataChanged path:/clusterstate.json, has occurred - updating... (live nodes size: 2)
   [junit4]   2> 35937 INFO  (zkCallback-39-thread-1) [    ] o.a.s.c.c.ZkStateReader A cluster state change: WatchedEvent state:SyncConnected type:NodeDataChanged path:/clusterstate.json, has occurred - updating... (live nodes size: 2)
   [junit4]   2> 35937 INFO  (zkCallback-37-thread-1-processing-n:127.0.0.1:33848__vgl) [n:127.0.0.1:33848__vgl    ] o.a.s.c.c.ZkStateReader A cluster state change: WatchedEvent state:SyncConnected type:NodeDataChanged path:/clusterstate.json, has occurred - updating... (live nodes size: 2)
   [junit4]   2> 36836 INFO  (coreLoadExecutor-126-thread-1-processing-n:127.0.0.1:34323__vgl) [n:127.0.0.1:34323__vgl c:collection1   x:collection1] o.a.s.c.ZkController waiting to find shard id in clusterstate for collection1
   [junit4]   2> 36836 INFO  (coreLoadExecutor-126-thread-1-processing-n:127.0.0.1:34323__vgl) [n:127.0.0.1:34323__vgl c:collection1   x:collection1] o.a.s.c.ZkController Check for collection zkNode:collection1
   [junit4]   2> 36837 INFO  (coreLoadExecutor-126-thread-1-processing-n:127.0.0.1:34323__vgl) [n:127.0.0.1:34323__vgl c:collection1   x:collection1] o.a.s.c.ZkController Collection zkNode exists
   [junit4]   2> 36837 INFO  (coreLoadExecutor-126-thread-1-processing-n:127.0.0.1:34323__vgl) [n:127.0.0.1:34323__vgl c:collection1   x:collection1] o.a.s.c.c.ZkStateReader Load collection config from:/collections/collection1
   [junit4]   2> 36837 INFO  (coreLoadExecutor-126-thread-1-processing-n:127.0.0.1:34323__vgl) [n:127.0.0.1:34323__vgl c:collection1   x:collection1] o.a.s.c.c.ZkStateReader path=/collections/collection1 configName=conf1 specified config exists in ZooKeeper
   [junit4]   2> 36837 INFO  (coreLoadExecutor-126-thread-1-processing-n:127.0.0.1:34323__vgl) [n:127.0.0.1:34323__vgl c:collection1   x:collection1] o.a.s.c.SolrResourceLoader new SolrResourceLoader for directory: '/home/jenkins/workspace/Lucene-Solr-5.4-Linux/solr/build/solr-core/test/J0/temp/solr.cloud.BasicDistributedZkTest_639B3709D4E0FCE-001/shard-1-001/cores/collection1'
   [junit4]   2> 36837 INFO  (coreLoadExecutor-126-thread-1-processing-n:127.0.0.1:34323__vgl) [n:127.0.0.1:34323__vgl c:collection1   x:collection1] o.a.s.c.SolrResourceLoader JNDI not configured for solr (NoInitialContextEx)
   [junit4]   2> 36837 INFO  (coreLoadExecutor-126-thread-1-processing-n:127.0.0.1:34323__vgl) [n:127.0.0.1:34323__vgl c:collection1   x:collection1] o.a.s.c.SolrResourceLoader solr home defaulted to 'solr/' (could not find system property or JNDI)
   [junit4]   2> 36849 INFO  (coreLoadExecutor-126-thread-1-processing-n:127.0.0.1:34323__vgl) [n:127.0.0.1:34323__vgl c:collection1   x:collection1] o.a.s.c.Config loaded config solrconfig.xml with version 0 
   [junit4]   2> 36855 INFO  (coreLoadExecutor-126-thread-1-processing-n:127.0.0.1:34323__vgl) [n:127.0.0.1:34323__vgl c:collection1   x:collection1] o.a.s.c.SolrConfig current version of requestparams : -1
   [junit4]   2> 36866 INFO  (coreLoadExecutor-126-thread-1-processing-n:127.0.0.1:34323__vgl) [n:127.0.0.1:34323__vgl c:collection1   x:collection1] o.a.s.c.SolrConfig Using Lucene MatchVersion: 5.4.1
   [junit4]   2> 36888 INFO  (coreLoadExecutor-126-thread-1-processing-n:127.0.0.1:34323__vgl) [n:127.0.0.1:34323__vgl c:collection1   x:collection1] o.a.s.c.SolrConfig Loaded SolrConfig: solrconfig.xml
   [junit4]   2> 36896 INFO  (coreLoadExecutor-126-thread-1-processing-n:127.0.0.1:34323__vgl) [n:127.0.0.1:34323__vgl c:collection1   x:collection1] o.a.s.s.IndexSchema [collection1] Schema name=test
   [junit4]   2> 37106 INFO  (coreLoadExecutor-126-thread-1-processing-n:127.0.0.1:34323__vgl) [n:127.0.0.1:34323__vgl c:collection1   x:collection1] o.a.s.s.OpenExchangeRatesOrgProvider Initialized with rates=open-exchange-rates.json, refreshInterval=1440.
   [junit4]   2> 37113 INFO  (coreLoadExecutor-126-thread-1-processing-n:127.0.0.1:34323__vgl) [n:127.0.0.1:34323__vgl c:collection1   x:collection1] o.a.s.s.IndexSchema default search field in schema is text
   [junit4]   2> 37115 INFO  (coreLoadExecutor-126-thread-1-processing-n:127.0.0.1:34323__vgl) [n:127.0.0.1:34323__vgl c:collection1   x:collection1] o.a.s.s.IndexSchema unique key field: id
   [junit4]   2> 37123 INFO  (coreLoadExecutor-126-thread-1-processing-n:127.0.0.1:34323__vgl) [n:127.0.0.1:34323__vgl c:collection1   x:collection1] o.a.s.s.FileExchangeRateProvider Reloading exchange rates from file currency.xml
   [junit4]   2> 37125 INFO  (coreLoadExecutor-126-thread-1-processing-n:127.0.0.1:34323__vgl) [n:127.0.0.1:34323__vgl c:collection1   x:collection1] o.a.s.s.FileExchangeRateProvider Reloading exchange rates from file currency.xml
   [junit4]   2> 37128 INFO  (coreLoadExecutor-126-thread-1-processing-n:127.0.0.1:34323__vgl) [n:127.0.0.1:34323__vgl c:collection1   x:collection1] o.a.s.s.OpenExchangeRatesOrgProvider Reloading exchange rates from open-exchange-rates.json
   [junit4]   2> 37128 WARN  (coreLoadExecutor-126-thread-1-processing-n:127.0.0.1:34323__vgl) [n:127.0.0.1:34323__vgl c:collection1   x:collection1] o.a.s.s.OpenExchangeRatesOrgProvider Unknown key IMPORTANT NOTE
   [junit4]   2> 37128 WARN  (coreLoadExecutor-126-thread-1-processing-n:127.0.0.1:34323__vgl) [n:127.0.0.1:34323__vgl c:collection1   x:collection1] o.a.s.s.OpenExchangeRatesOrgProvider Expected key, got STRING
   [junit4]   2> 37128 INFO  (coreLoadExecutor-126-thread-1-processing-n:127.0.0.1:34323__vgl) [n:127.0.0.1:34323__vgl c:collection1   x:collection1] o.a.s.s.OpenExchangeRatesOrgProvider Reloading exchange rates from open-exchange-rates.json
   [junit4]   2> 37129 WARN  (coreLoadExecutor-126-thread-1-processing-n:127.0.0.1:34323__vgl) [n:127.0.0.1:34323__vgl c:collection1   x:collection1] o.a.s.s.OpenExchangeRatesOrgProvider Unknown key IMPORTANT NOTE
   [junit4]   2> 37129 WARN  (coreLoadExecutor-126-thread-1-processing-n:127.0.0.1:34323__vgl) [n:127.0.0.1:34323__vgl c:collection1   x:collection1] o.a.s.s.OpenExchangeRatesOrgProvider Expected key, got STRING
   [junit4]   2> 37130 INFO  (coreLoadExecutor-126-thread-1-processing-n:127.0.0.1:34323__vgl) [n:127.0.0.1:34323__vgl c:collection1   x:collection1] o.a.s.c.ConfigSetProperties Did not find ConfigSet properties, assuming default properties: Can't find resource 'configsetprops.json' in classpath or '/configs/conf1', cwd=/home/jenkins/workspace/Lucene-Solr-5.4-Linux/solr/build/solr-core/test/J0
   [junit4]   2> 37130 INFO  (coreLoadExecutor-126-thread-1-processing-n:127.0.0.1:34323__vgl) [n:127.0.0.1:34323__vgl c:collection1   x:collection1] o.a.s.c.CoreContainer Creating SolrCore 'collection1' using configuration from collection collection1
   [junit4]   2> 37130 INFO  (coreLoadExecutor-126-thread-1-processing-n:127.0.0.1:34323__vgl) [n:127.0.0.1:34323__vgl c:collection1 s:shard1 r:core_node1 x:collection1] o.a.s.c.SolrCore org.apache.solr.core.MockDirectoryFactory
   [junit4]   2> 37130 INFO  (coreLoadExecutor-126-thread-1-processing-n:127.0.0.1:34323__vgl) [n:127.0.0.1:34323__vgl c:collection1 s:shard1 r:core_node1 x:collection1] o.a.s.c.SolrCore [[collection1] ] Opening new SolrCore at [/home/jenkins/workspace/Lucene-Solr-5.4-Linux/solr/build/solr-core/test/J0/temp/solr.cloud.BasicDistributedZkTest_639B3709D4E0FCE-001/shard-1-001/cores/collection1], dataDir=[null]
   [junit4]   2> 37130 INFO  (coreLoadExecutor-126-thread-1-processing-n:127.0.0.1:34323__vgl) [n:127.0.0.1:34323__vgl c:collection1 s:shard1 r:core_node1 x:collection1] o.a.s.c.JmxMonitoredMap JMX monitoring is enabled. Adding Solr mbeans to JMX Server: com.sun.jmx.mbeanserver.JmxMBeanServer@139f05e
   [junit4]   2> 37131 INFO  (coreLoadExecutor-126-thread-1-processing-n:127.0.0.1:34323__vgl) [n:127.0.0.1:34323__vgl c:collection1 s:shard1 r:core_node1 x:collection1] o.a.s.c.CachingDirectoryFactory return new directory for /home/jenkins/workspace/Lucene-Solr-5.4-Linux/solr/build/solr-core/test/J0/temp/solr.cloud.BasicDistributedZkTest_639B3709D4E0FCE-001/shard-1-001/cores/collection1/data
   [junit4]   2> 37131 INFO  (coreLoadExecutor-126-thread-1-processing-n:127.0.0.1:34323__vgl) [n:127.0.0.1:34323__vgl c:collection1 s:shard1 r:core_node1 x:collection1] o.a.s.c.SolrCore New index directory detected: old=null new=/home/jenkins/workspace/Lucene-Solr-5.4-Linux/solr/build/solr-core/test/J0/temp/solr.cloud.BasicDistributedZkTest_639B3709D4E0FCE-001/shard-1-001/cores/collection1/data/index/
   [junit4]   2> 37131 WARN  (coreLoadExecutor-126-thread-1-processing-n:127.0.0.1:34323__vgl) [n:127.0.0.1:34323__vgl c:collection1 s:shard1 r:core_node1 x:collection1] o.a.s.c.SolrCore [collection1] Solr index directory '/home/jenkins/workspace/Lucene-Solr-5.4-Linux/solr/build/solr-core/test/J0/temp/solr.cloud.BasicDistributedZkTest_639B3709D4E0FCE-001/shard-1-001/cores/collection1/data/index' doesn't exist. Creating new index...
   [junit4]   2> 37132 INFO  (coreLoadExecutor-126-thread-1-processing-n:127.0.0.1:34323__vgl) [n:127.0.0.1:34323__vgl c:collection1 s:shard1 r:core_node1 x:collection1] o.a.s.c.CachingDirectoryFactory return new directory for /home/jenkins/workspace/Lucene-Solr-5.4-Linux/solr/build/solr-core/test/J0/temp/solr.cloud.BasicDistributedZkTest_639B3709D4E0FCE-001/shard-1-001/cores/collection1/data/index
   [junit4]   2> 37132 INFO  (coreLoadExecutor-126-thread-1-processing-n:127.0.0.1:34323__vgl) [n:127.0.0.1:34323__vgl c:collection1 s:shard1 r:core_node1 x:collection1] o.a.s.u.RandomMergePolicy RandomMergePolicy wrapping class org.apache.lucene.index.LogDocMergePolicy: [LogDocMergePolicy: minMergeSize=1000, mergeFactor=35, maxMergeSize=9223372036854775807, ma

[...truncated too long message...]

ud.BasicDistributedZkTest_639B3709D4E0FCE-001/collection3-004/index
   [junit4]   2> 117998 INFO  (TEST-BasicDistributedZkTest.test-seed#[639B3709D4E0FCE]) [n:127.0.0.1:35228__vgl c:collection3 s:shard2 r:core_node4 x:collection3] o.a.s.c.CachingDirectoryFactory looking to close /home/jenkins/workspace/Lucene-Solr-5.4-Linux/solr/build/solr-core/test/J0/temp/solr.cloud.BasicDistributedZkTest_639B3709D4E0FCE-001/collection3-004 [CachedDir<<refCount=0;path=/home/jenkins/workspace/Lucene-Solr-5.4-Linux/solr/build/solr-core/test/J0/temp/solr.cloud.BasicDistributedZkTest_639B3709D4E0FCE-001/collection3-004;done=false>>]
   [junit4]   2> 117998 INFO  (TEST-BasicDistributedZkTest.test-seed#[639B3709D4E0FCE]) [n:127.0.0.1:35228__vgl c:collection3 s:shard2 r:core_node4 x:collection3] o.a.s.c.CachingDirectoryFactory Closing directory: /home/jenkins/workspace/Lucene-Solr-5.4-Linux/solr/build/solr-core/test/J0/temp/solr.cloud.BasicDistributedZkTest_639B3709D4E0FCE-001/collection3-004
   [junit4]   2> 117999 INFO  (TEST-BasicDistributedZkTest.test-seed#[639B3709D4E0FCE]) [n:127.0.0.1:35228__vgl c:collection3 s:shard2 r:core_node4 x:collection3] o.a.s.c.Overseer Overseer (id=95225870153744401-127.0.0.1:35228__vgl-n_0000000004) closing
   [junit4]   2> 117999 INFO  (OverseerStateUpdate-95225870153744401-127.0.0.1:35228__vgl-n_0000000004) [n:127.0.0.1:35228__vgl    ] o.a.s.c.Overseer Overseer Loop exiting : 127.0.0.1:35228__vgl
   [junit4]   2> 118000 INFO  (zkCallback-56-thread-1-processing-n:127.0.0.1:35228__vgl) [n:127.0.0.1:35228__vgl    ] o.a.s.c.c.ZkStateReader A live node change: WatchedEvent state:SyncConnected type:NodeChildrenChanged path:/live_nodes, has occurred - updating... (live nodes size: 1)
   [junit4]   2> 118000 WARN  (zkCallback-56-thread-1-processing-n:127.0.0.1:35228__vgl) [n:127.0.0.1:35228__vgl    ] o.a.s.c.c.ZkStateReader ZooKeeper watch triggered, but Solr cannot talk to ZK
   [junit4]   2> 118001 INFO  (TEST-BasicDistributedZkTest.test-seed#[639B3709D4E0FCE]) [    ] o.e.j.s.ServerConnector Stopped ServerConnector@fa4a2{HTTP/1.1}{127.0.0.1:0}
   [junit4]   2> 118001 INFO  (TEST-BasicDistributedZkTest.test-seed#[639B3709D4E0FCE]) [    ] o.e.j.s.h.ContextHandler Stopped o.e.j.s.ServletContextHandler@cc0591{/_vgl,null,UNAVAILABLE}
   [junit4]   2> 118002 INFO  (TEST-BasicDistributedZkTest.test-seed#[639B3709D4E0FCE]) [n:127.0.0.1:35228__vgl c:collection3 s:shard2 r:core_node4 x:collection3] o.a.s.c.ZkTestServer connecting to 127.0.0.1:59331 59331
   [junit4]   2> 118095 INFO  (Thread-87) [    ] o.a.s.c.ZkTestServer connecting to 127.0.0.1:59331 59331
   [junit4]   2> 118096 WARN  (Thread-87) [    ] o.a.s.c.ZkTestServer Watch limit violations: 
   [junit4]   2> Maximum concurrent create/delete watches above limit:
   [junit4]   2> 
   [junit4]   2> 	8	/solr/aliases.json
   [junit4]   2> 	6	/solr/security.json
   [junit4]   2> 	5	/solr/configs/conf1
   [junit4]   2> 
   [junit4]   2> Maximum concurrent data watches above limit:
   [junit4]   2> 
   [junit4]   2> 	57	/solr/clusterstate.json
   [junit4]   2> 
   [junit4]   2> Maximum concurrent children watches above limit:
   [junit4]   2> 
   [junit4]   2> 	12	/solr/live_nodes
   [junit4]   2> 	12	/solr/collections
   [junit4]   2> 	5	/solr/overseer/collection-queue-work
   [junit4]   2> 	5	/solr/overseer/queue
   [junit4]   2> 	2	/solr/overseer/queue-work
   [junit4]   2> 
   [junit4]   2> NOTE: reproduce with: ant test  -Dtestcase=BasicDistributedZkTest -Dtests.method=test -Dtests.seed=639B3709D4E0FCE -Dtests.multiplier=3 -Dtests.slow=true -Dtests.locale=ar_JO -Dtests.timezone=Africa/Freetown -Dtests.asserts=true -Dtests.file.encoding=ISO-8859-1
   [junit4] ERROR   85.2s J0 | BasicDistributedZkTest.test <<<
   [junit4]    > Throwable #1: org.apache.solr.client.solrj.impl.HttpSolrClient$RemoteSolrException: Error from server at http://127.0.0.1:54555/_vgl/collection1: Bad Request
   [junit4]    > request: http://127.0.0.1:34323/_vgl/collection1/update?update.chain=distrib-dup-test-chain-explicit&update.distrib=TOLEADER&distrib.from=http%3A%2F%2F127.0.0.1%3A54555%2F_vgl%2Fcollection1%2F&wt=javabin&version=2
   [junit4]    > 	at __randomizedtesting.SeedInfo.seed([639B3709D4E0FCE:8E6D8CAA33B26236]:0)
   [junit4]    > 	at org.apache.solr.client.solrj.impl.HttpSolrClient.executeMethod(HttpSolrClient.java:575)
   [junit4]    > 	at org.apache.solr.client.solrj.impl.HttpSolrClient.request(HttpSolrClient.java:241)
   [junit4]    > 	at org.apache.solr.client.solrj.impl.HttpSolrClient.request(HttpSolrClient.java:230)
   [junit4]    > 	at org.apache.solr.client.solrj.SolrRequest.process(SolrRequest.java:150)
   [junit4]    > 	at org.apache.solr.client.solrj.SolrRequest.process(SolrRequest.java:167)
   [junit4]    > 	at org.apache.solr.BaseDistributedSearchTestCase.add(BaseDistributedSearchTestCase.java:512)
   [junit4]    > 	at org.apache.solr.cloud.BasicDistributedZkTest.testUpdateProcessorsRunOnlyOnce(BasicDistributedZkTest.java:645)
   [junit4]    > 	at org.apache.solr.cloud.BasicDistributedZkTest.test(BasicDistributedZkTest.java:356)
   [junit4]    > 	at org.apache.solr.BaseDistributedSearchTestCase$ShardsRepeatRule$ShardsFixedStatement.callStatement(BaseDistributedSearchTestCase.java:964)
   [junit4]    > 	at org.apache.solr.BaseDistributedSearchTestCase$ShardsRepeatRule$ShardsStatement.evaluate(BaseDistributedSearchTestCase.java:939)
   [junit4]    > 	at java.lang.Thread.run(Thread.java:745)
   [junit4]   2> 118100 INFO  (SUITE-BasicDistributedZkTest-seed#[639B3709D4E0FCE]-worker) [n:127.0.0.1:35228__vgl c:collection3 s:shard2 r:core_node4 x:collection3] o.a.s.SolrTestCaseJ4 ###deleteCore
   [junit4]   2> NOTE: leaving temporary files on disk at: /home/jenkins/workspace/Lucene-Solr-5.4-Linux/solr/build/solr-core/test/J0/temp/solr.cloud.BasicDistributedZkTest_639B3709D4E0FCE-001
   [junit4]   2> Jan 17, 2016 11:52:31 AM com.carrotsearch.randomizedtesting.ThreadLeakControl checkThreadLeaks
   [junit4]   2> WARNING: Will linger awaiting termination of 1 leaked thread(s).
   [junit4]   2> NOTE: test params are: codec=Asserting(Lucene54): {a_t=FSTOrd50, sequence_i=Lucene50(blocksize=128), intDefault=TestBloomFilteredLucenePostings(BloomFilteringPostingsFormat(Lucene50(blocksize=128))), oddField_s=Lucene50(blocksize=128), rnd_b=Lucene50(blocksize=128), a_i1=FSTOrd50, foo_f=PostingsFormat(name=Memory doPackFST= false), n_l1=FSTOrd50, range_facet_l=FSTOrd50, n_d1=FSTOrd50, n_tdt1=TestBloomFilteredLucenePostings(BloomFilteringPostingsFormat(Lucene50(blocksize=128))), price=PostingsFormat(name=Memory doPackFST= false), inStock=PostingsFormat(name=Memory doPackFST= false), foo_d=Lucene50(blocksize=128), n_tl1=TestBloomFilteredLucenePostings(BloomFilteringPostingsFormat(Lucene50(blocksize=128))), id=Lucene50(blocksize=128), _version_=TestBloomFilteredLucenePostings(BloomFilteringPostingsFormat(Lucene50(blocksize=128))), text=PostingsFormat(name=Memory doPackFST= false), n_f1=TestBloomFilteredLucenePostings(BloomFilteringPostingsFormat(Lucene50(blocksize=128))), n_td1=TestBloomFilteredLucenePostings(BloomFilteringPostingsFormat(Lucene50(blocksize=128))), regex_dup_A_s=PostingsFormat(name=Memory doPackFST= false), timestamp=FSTOrd50, genre_s=Lucene50(blocksize=128), n_ti1=Lucene50(blocksize=128), val_i=Lucene50(blocksize=128), name=Lucene50(blocksize=128), SubjectTerms_mfacet=TestBloomFilteredLucenePostings(BloomFilteringPostingsFormat(Lucene50(blocksize=128))), n_tf1=FSTOrd50, range_facet_i_dv=FSTOrd50, range_facet_l_dv=Lucene50(blocksize=128), multiDefault=FSTOrd50, n_dt1=TestBloomFilteredLucenePostings(BloomFilteringPostingsFormat(Lucene50(blocksize=128))), regex_dup_B_s=FSTOrd50, foo_i=TestBloomFilteredLucenePostings(BloomFilteringPostingsFormat(Lucene50(blocksize=128))), foo_b=PostingsFormat(name=Memory doPackFST= false), author_t=TestBloomFilteredLucenePostings(BloomFilteringPostingsFormat(Lucene50(blocksize=128))), other_tl1=TestBloomFilteredLucenePostings(BloomFilteringPostingsFormat(Lucene50(blocksize=128))), series_t=TestBloomFilteredLucenePostings(BloomFilteringPostingsFormat(Lucene50(blocksize=128))), cat=FSTOrd50}, docValues:{range_facet_i_dv=DocValuesFormat(name=Lucene54), timestamp=DocValuesFormat(name=Lucene54), range_facet_l_dv=DocValuesFormat(name=Memory)}, sim=DefaultSimilarity, locale=ar_JO, timezone=Africa/Freetown
   [junit4]   2> NOTE: Linux 3.19.0-42-generic i386/Oracle Corporation 1.7.0_80 (32-bit)/cpus=12,threads=1,free=273831464,total=457179136
   [junit4]   2> NOTE: All tests run in this JVM: [CloudExitableDirectoryReaderTest, TestFunctionQuery, EnumFieldTest, TestEmbeddedSolrServerConstructors, IndexSchemaTest, PrimUtilsTest, BasicDistributedZkTest]
   [junit4] Completed [18/551] on J0 in 86.24s, 1 test, 1 error <<< FAILURES!

[...truncated 1684 lines...]
BUILD FAILED
/home/jenkins/workspace/Lucene-Solr-5.4-Linux/build.xml:792: The following error occurred while executing this line:
/home/jenkins/workspace/Lucene-Solr-5.4-Linux/build.xml:736: The following error occurred while executing this line:
/home/jenkins/workspace/Lucene-Solr-5.4-Linux/build.xml:59: The following error occurred while executing this line:
/home/jenkins/workspace/Lucene-Solr-5.4-Linux/solr/build.xml:233: The following error occurred while executing this line:
/home/jenkins/workspace/Lucene-Solr-5.4-Linux/solr/common-build.xml:526: The following error occurred while executing this line:
/home/jenkins/workspace/Lucene-Solr-5.4-Linux/lucene/common-build.xml:1452: The following error occurred while executing this line:
/home/jenkins/workspace/Lucene-Solr-5.4-Linux/lucene/common-build.xml:1006: There were test failures: 551 suites (7 ignored), 2179 tests, 1 error, 76 ignored (38 assumptions) [seed: 639B3709D4E0FCE]

Total time: 56 minutes 50 seconds
Build step 'Invoke Ant' marked build as failure
Archiving artifacts
[WARNINGS] Skipping publisher since build result is FAILURE
Recording test results
Email was triggered for: Failure - Any
Sending email for trigger: Failure - Any