You are viewing a plain text version of this content. The canonical link for it is here.
Posted to builds@beam.apache.org by Apache Jenkins Server <je...@builds.apache.org> on 2021/12/29 00:52:41 UTC
Build failed in Jenkins: beam_PreCommit_Java_Cron #4921
See <https://ci-beam.apache.org/job/beam_PreCommit_Java_Cron/4921/display/redirect?page=changes>
Changes:
[dpcollins] [BEAM-13402] Simplify PubsubLiteSink
[Kyle Weaver] [BEAM-13571] Fix ClassNotFound exception in Flink tests
[Kyle Weaver] [BEAM-13498] [BEAM-13573] exclude new tests on Flink
[noreply] Exclude UsesOnWindowExpiration by category from Dataflow v2 streaming
[noreply] [BEAM-13052] Increment pubsub python version and fix breakages. (#16126)
[noreply] [BEAM-13052] Add Pub/Sub Lite xlang transforms in python (#15727)
[noreply] [BEAM-13402] Version bump Pub/Sub Lite and implement changes to ensure
------------------------------------------
[...truncated 2.77 MB...]
<https://ci-beam.apache.org/job/beam_PreCommit_Java_Cron/ws/src/sdks/java/core/src/main/java/org/apache/beam/sdk/io/TextIO.java>:833: warning - Tag @link: can't find to(DynamicDestinations) in org.apache.beam.sdk.io.TextIO.TypedWrite
<https://ci-beam.apache.org/job/beam_PreCommit_Java_Cron/ws/src/sdks/java/core/src/main/java/org/apache/beam/sdk/io/TextIO.java>:1109: warning - Tag @link: can't find to(DynamicDestinations) in org.apache.beam.sdk.io.TextIO.TypedWrite
<https://ci-beam.apache.org/job/beam_PreCommit_Java_Cron/ws/src/sdks/java/core/src/main/java/org/apache/beam/sdk/io/TextIO.java>:1096: warning - Tag @link: can't find to(FilenamePolicy) in org.apache.beam.sdk.io.TextIO.TypedWrite
<https://ci-beam.apache.org/job/beam_PreCommit_Java_Cron/ws/src/sdks/java/core/src/main/java/org/apache/beam/sdk/io/TextIO.java>:1122: warning - Tag @link: can't find to(SerializableFunction, Params) in org.apache.beam.sdk.io.TextIO.TypedWrite
<https://ci-beam.apache.org/job/beam_PreCommit_Java_Cron/ws/src/sdks/java/core/src/main/java/org/apache/beam/sdk/io/TextIO.java>:1215: warning - Tag @link: can't find to(DynamicDestinations) in org.apache.beam.sdk.io.TextIO.Write
<https://ci-beam.apache.org/job/beam_PreCommit_Java_Cron/ws/src/sdks/java/core/src/main/java/org/apache/beam/sdk/io/TextIO.java>:1215: warning - Tag @link: can't find to(SerializableFunction, Params) in org.apache.beam.sdk.io.TextIO.Write
<https://ci-beam.apache.org/job/beam_PreCommit_Java_Cron/ws/src/sdks/java/core/src/main/java/org/apache/beam/sdk/io/TextIO.java>:1183: warning - Tag @link: can't find withWritableByteChannelFactory(WritableByteChannelFactory) in org.apache.beam.sdk.io.TextIO.TypedWrite
> Task :runners:samza:job-server:startShadowScripts
> Task :sdks:java:io:azure:compileJava
> Task :sdks:java:extensions:sbe:spotbugsTest SKIPPED
> Task :sdks:java:core:javadoc
<https://ci-beam.apache.org/job/beam_PreCommit_Java_Cron/ws/src/sdks/java/core/src/main/java/org/apache/beam/sdk/values/PCollection.java>:310: warning - Tag @link:illegal character: "60" in "PCollection<Row>"
<https://ci-beam.apache.org/job/beam_PreCommit_Java_Cron/ws/src/sdks/java/core/src/main/java/org/apache/beam/sdk/values/PCollection.java>:310: warning - Tag @link:illegal character: "62" in "PCollection<Row>"
> Task :sdks:java:fn-execution:check
> Task :sdks:java:fn-execution:build
> Task :sdks:java:io:azure:classes
> Task :sdks:java:io:azure:jar
> Task :sdks:java:io:azure:assemble
> Task :sdks:java:io:azure:analyzeClassesDependencies SKIPPED
> Task :runners:samza:job-server:shadowDistTar
> Task :sdks:java:core:javadoc
<https://ci-beam.apache.org/job/beam_PreCommit_Java_Cron/ws/src/sdks/java/core/src/main/java/org/apache/beam/sdk/schemas/SchemaRegistry.java>:291: warning - Tag @link:illegal character: "42" in "* NoSuchSchemaException"
<https://ci-beam.apache.org/job/beam_PreCommit_Java_Cron/ws/src/sdks/java/core/src/main/java/org/apache/beam/sdk/schemas/SchemaRegistry.java>:299: warning - Tag @link:illegal character: "42" in "* NoSuchSchemaException"
<https://ci-beam.apache.org/job/beam_PreCommit_Java_Cron/ws/src/sdks/java/core/src/main/java/org/apache/beam/sdk/options/SdkHarnessOptions.java>:199: warning - Tag @link: can't find addOverrideForName(String, LogLevel) in org.apache.beam.sdk.options.SdkHarnessOptions.SdkHarnessLogLevelOverrides
<https://ci-beam.apache.org/job/beam_PreCommit_Java_Cron/ws/src/sdks/java/core/src/main/java/org/apache/beam/sdk/options/SdkHarnessOptions.java>:211: warning - Tag @link: can't find addOverrideForName(String, LogLevel) in org.apache.beam.sdk.options.SdkHarnessOptions.SdkHarnessLogLevelOverrides
<https://ci-beam.apache.org/job/beam_PreCommit_Java_Cron/ws/src/sdks/java/core/src/main/java/org/apache/beam/sdk/state/StateSpecs.java>:89: warning - Tag @see: can't find combining(Coder, CombineFn) in org.apache.beam.sdk.state.StateSpecs
<https://ci-beam.apache.org/job/beam_PreCommit_Java_Cron/ws/src/sdks/java/core/src/main/java/org/apache/beam/sdk/state/StateSpecs.java>:107: warning - Tag @see: can't find combining(Coder, CombineFnWithContext) in org.apache.beam.sdk.state.StateSpecs
<https://ci-beam.apache.org/job/beam_PreCommit_Java_Cron/ws/src/sdks/java/core/src/main/java/org/apache/beam/sdk/state/StateSpecs.java>:118: warning - Tag @link: can't find combining(CombineFn) in org.apache.beam.sdk.state.StateSpecs
<https://ci-beam.apache.org/job/beam_PreCommit_Java_Cron/ws/src/sdks/java/core/src/main/java/org/apache/beam/sdk/state/StateSpecs.java>:137: warning - Tag @link: can't find combining(CombineFnWithContext) in org.apache.beam.sdk.state.StateSpecs
> Task :sdks:java:extensions:sbe:test
> Task :sdks:java:io:common:analyzeTestClassesDependencies SKIPPED
> Task :sdks:java:io:common:analyzeDependencies SKIPPED
> Task :sdks:java:io:azure:compileTestJava
Note: <https://ci-beam.apache.org/job/beam_PreCommit_Java_Cron/ws/src/sdks/java/io/azure/src/test/java/org/apache/beam/sdk/io/azure/blobstore/AzfsResourceIdTest.java> uses or overrides a deprecated API.
Note: Recompile with -Xlint:deprecation for details.
Note: <https://ci-beam.apache.org/job/beam_PreCommit_Java_Cron/ws/src/sdks/java/io/azure/src/test/java/org/apache/beam/sdk/io/azure/blobstore/AzureBlobStoreFileSystemTest.java> uses unchecked or unsafe operations.
Note: Recompile with -Xlint:unchecked for details.
> Task :sdks:java:io:common:checkstyleTest
> Task :sdks:java:io:common:spotbugsTest SKIPPED
> Task :sdks:java:io:azure:testClasses
> Task :sdks:java:io:azure:analyzeTestClassesDependencies SKIPPED
> Task :sdks:java:io:azure:analyzeDependencies SKIPPED
> Task :sdks:java:io:azure:checkstyleMain
> Task :sdks:java:io:azure:checkstyleTest
> Task :sdks:java:core:javadoc
59 warnings
> Task :sdks:java:extensions:protobuf:test
> Task :sdks:java:io:elasticsearch:assemble
> Task :sdks:java:io:elasticsearch:analyzeClassesDependencies SKIPPED
> Task :sdks:java:io:elasticsearch:compileTestJava NO-SOURCE
> Task :sdks:java:io:elasticsearch:testClasses UP-TO-DATE
> Task :sdks:java:io:elasticsearch:analyzeTestClassesDependencies SKIPPED
> Task :sdks:java:io:elasticsearch:analyzeDependencies SKIPPED
> Task :sdks:java:io:elasticsearch:checkstyleMain
> Task :sdks:java:core:spotbugsTest SKIPPED
> Task :sdks:java:extensions:protobuf:spotbugsMain
> Task :sdks:java:extensions:protobuf:check
> Task :sdks:java:extensions:protobuf:build
> Task :sdks:java:io:elasticsearch:checkstyleTest NO-SOURCE
> Task :sdks:java:io:azure:javadoc
> Task :sdks:java:extensions:sbe:spotbugsMain
> Task :sdks:java:extensions:sbe:check
> Task :sdks:java:extensions:sbe:build
> Task :sdks:java:extensions:sbe:buildDependents
> Task :sdks:java:io:azure:spotbugsTest SKIPPED
> Task :sdks:java:harness:check
> Task :sdks:java:harness:build
> Task :sdks:java:io:hadoop-common:assemble
> Task :sdks:java:io:hadoop-common:analyzeClassesDependencies SKIPPED
> Task :sdks:java:io:elasticsearch:javadoc
> Task :sdks:java:io:hadoop-common:compileTestJava
Note: <https://ci-beam.apache.org/job/beam_PreCommit_Java_Cron/ws/src/sdks/java/io/hadoop-common/src/test/java/org/apache/beam/sdk/io/hadoop/SerializableConfigurationTest.java> uses or overrides a deprecated API.
Note: Recompile with -Xlint:deprecation for details.
> Task :sdks:java:io:elasticsearch:spotbugsTest SKIPPED
> Task :sdks:java:io:elasticsearch:test NO-SOURCE
> Task :sdks:java:io:hadoop-common:testClasses
> Task :sdks:java:io:hadoop-common:analyzeTestClassesDependencies SKIPPED
> Task :sdks:java:io:hadoop-common:analyzeDependencies SKIPPED
> Task :sdks:java:io:hadoop-common:checkstyleMain
> Task :sdks:java:io:hadoop-common:checkstyleTest
> Task :runners:samza:job-server:shadowDistZip
> Task :runners:samza:job-server:assemble
> Task :runners:samza:job-server:analyzeClassesDependencies SKIPPED
> Task :runners:samza:job-server:analyzeTestClassesDependencies SKIPPED
> Task :runners:samza:job-server:analyzeDependencies SKIPPED
> Task :runners:samza:job-server:checkstyleMain NO-SOURCE
> Task :runners:samza:job-server:checkstyleTest NO-SOURCE
> Task :runners:samza:job-server:javadoc NO-SOURCE
> Task :runners:samza:job-server:spotbugsMain NO-SOURCE
> Task :runners:samza:job-server:spotbugsTest SKIPPED
> Task :runners:samza:job-server:test NO-SOURCE
> Task :runners:samza:job-server:check UP-TO-DATE
> Task :runners:samza:job-server:build
> Task :runners:samza:job-server:buildDependents
> Task :runners:samza:buildDependents
> Task :model:job-management:buildNeeded
> Task :sdks:java:io:hadoop-common:javadoc
> Task :sdks:java:container:java8:copyDockerfileDependencies
> Task :sdks:java:io:hadoop-common:spotbugsTest SKIPPED
> Task :sdks:java:io:azure:spotbugsMain
> Task :sdks:java:javadoc:allJavadoc
> Task :release:go-licenses:java:createLicenses
> Task :sdks:java:container:java8:copyGolangLicenses
> Task :sdks:java:container:pullLicenses
Copying already-fetched licenses from <https://ci-beam.apache.org/job/beam_PreCommit_Java_Cron/ws/src/sdks/java/container/build/reports/dependency-license> to <https://ci-beam.apache.org/job/beam_PreCommit_Java_Cron/ws/src/sdks/java/container/build/target/java_third_party_licenses>
> Task :sdks:java:io:azure:test
> Task :sdks:java:io:azure:check
> Task :sdks:java:io:azure:build
> Task :sdks:java:io:azure:buildDependents
> Task :sdks:java:io:common:test
> Task :sdks:java:io:hadoop-common:test
> Task :sdks:java:io:common:check
> Task :sdks:java:io:common:build
> Task :sdks:java:io:hadoop-common:spotbugsMain
> Task :sdks:java:io:hadoop-common:check
> Task :sdks:java:io:hadoop-common:build
> Task :sdks:java:container:pullLicenses
Collecting beautifulsoup4<5.0,>=4.9.0
Using cached beautifulsoup4-4.10.0-py3-none-any.whl (97 kB)
> Task :sdks:java:core:spotbugsMain
> Task :sdks:java:core:test
> Task :sdks:java:io:elasticsearch:spotbugsMain
> Task :sdks:java:io:elasticsearch:check
> Task :sdks:java:io:elasticsearch:build
> Task :sdks:java:container:pullLicenses
Collecting pyyaml<6.0.0,>=3.12
Using cached PyYAML-5.4.1-cp38-cp38-manylinux1_x86_64.whl (662 kB)
Collecting tenacity<6.0,>=5.0.2
Using cached tenacity-5.1.5-py2.py3-none-any.whl (34 kB)
Collecting soupsieve>1.2
Using cached soupsieve-2.3.1-py3-none-any.whl (37 kB)
Collecting six>=1.9.0
Using cached six-1.16.0-py2.py3-none-any.whl (11 kB)
Installing collected packages: soupsieve, beautifulsoup4, pyyaml, six, tenacity
Successfully installed beautifulsoup4-4.10.0 pyyaml-5.4.1 six-1.16.0 soupsieve-2.3.1 tenacity-5.1.5
WARNING: You are using pip version 20.2.3; however, version 21.3.1 is available.
You should consider upgrading via the '<https://ci-beam.apache.org/job/beam_PreCommit_Java_Cron/ws/src/sdks/java/container/build/virtualenv/bin/python3.8> -m pip install --upgrade pip' command.
Executing <https://ci-beam.apache.org/job/beam_PreCommit_Java_Cron/ws/src/sdks/java/container/build/virtualenv/bin/python> <https://ci-beam.apache.org/job/beam_PreCommit_Java_Cron/ws/src/sdks/java/container/license_scripts/pull_licenses_java.py> --license_index=<https://ci-beam.apache.org/job/beam_PreCommit_Java_Cron/ws/src/sdks/java/container/build/reports/dependency-license/index.json> --output_dir=<https://ci-beam.apache.org/job/beam_PreCommit_Java_Cron/ws/src/sdks/java/container/build/target/java_third_party_licenses> --dep_url_yaml=<https://ci-beam.apache.org/job/beam_PreCommit_Java_Cron/ws/src/sdks/java/container/license_scripts/dep_urls_java.yaml>
INFO:root:Pulling license for 214 dependencies using 16 threads.
INFO:root:pull_licenses_java.py succeed. It took 6.322052 seconds with 16 threads.
Copying licenses from <https://ci-beam.apache.org/job/beam_PreCommit_Java_Cron/ws/src/sdks/java/container/build/target/java_third_party_licenses> to <https://ci-beam.apache.org/job/beam_PreCommit_Java_Cron/ws/src/sdks/java/container/build/target/third_party_licenses.>
Finished license_scripts.sh
> Task :sdks:java:container:java8:copyJavaThirdPartyLicenses
> Task :sdks:java:container:java8:dockerPrepare
> Task :sdks:java:extensions:sql:jdbc:shadowJarTest
> Task :sdks:java:extensions:sql:jdbc:preCommit
> Task :sdks:java:container:java8:docker
Removing intermediate container 820bdffb9def
---> 09ae36090fa2
Step 17/18 : COPY target/profiler/* /opt/google_cloud_profiler/
---> 45066a8f1bb0
Step 18/18 : ENTRYPOINT ["/opt/apache/beam/boot"]
---> Running in 4ff0645c6f08
Removing intermediate container 4ff0645c6f08
---> 939b333ea872
Successfully built 939b333ea872
Successfully tagged apache/beam_java8_sdk:2.36.0.dev
> Task :sdks:java:io:elasticsearch-tests:elasticsearch-tests-6:check
> Task :sdks:java:io:elasticsearch-tests:elasticsearch-tests-6:build
> Task :sdks:java:io:elasticsearch-tests:elasticsearch-tests-6:buildDependents
> Task :sdks:java:io:elasticsearch-tests:elasticsearch-tests-7:check
> Task :sdks:java:io:elasticsearch-tests:elasticsearch-tests-7:build
> Task :sdks:java:io:elasticsearch-tests:elasticsearch-tests-7:buildDependents
> Task :sdks:java:io:elasticsearch-tests:elasticsearch-tests-5:check
> Task :sdks:java:io:elasticsearch-tests:elasticsearch-tests-5:build
> Task :sdks:java:io:elasticsearch-tests:elasticsearch-tests-5:buildDependents
> Task :sdks:java:io:elasticsearch-tests:elasticsearch-tests-common:buildDependents
> Task :sdks:java:io:elasticsearch:buildDependents
> Task :sdks:java:core:validateShadedJarDoesntLeakNonProjectClasses
> Task :sdks:java:core:check
> Task :sdks:java:core:build
> Task :sdks:java:core:buildNeeded
> Task :sdks:java:testing:nexmark:check
> Task :sdks:java:testing:nexmark:build
> Task :sdks:java:testing:nexmark:buildDependents
> Task :sdks:java:extensions:sql:zetasql:buildDependents
> Task :sdks:java:extensions:sql:buildDependents
> Task :sdks:java:extensions:join-library:buildDependents
> Task :sdks:java:io:kafka:buildDependents
> Task :sdks:java:io:mongodb:buildDependents
> Task :sdks:java:io:parquet:buildDependents
> Task :sdks:java:io:synthetic:buildDependents
> Task :sdks:java:io:thrift:buildDependents
> Task :sdks:java:io:hadoop-common:buildDependents
FAILURE: Build completed with 2 failures.
1: Task failed with an exception.
-----------
* What went wrong:
Execution failed for task ':runners:flink:1.12:test'.
> There were failing tests. See the report at: file://<https://ci-beam.apache.org/job/beam_PreCommit_Java_Cron/ws/src/runners/flink/1.12/build/reports/tests/test/index.html>
* Try:
> Run with --stacktrace option to get the stack trace.
> Run with --info or --debug option to get more log output.
> Run with --scan to get full insights.
==============================================================================
2: Task failed with an exception.
-----------
* What went wrong:
Execution failed for task ':runners:flink:1.13:test'.
> There were failing tests. See the report at: file://<https://ci-beam.apache.org/job/beam_PreCommit_Java_Cron/ws/src/runners/flink/1.13/build/reports/tests/test/index.html>
* Try:
> Run with --stacktrace option to get the stack trace.
> Run with --info or --debug option to get more log output.
> Run with --scan to get full insights.
==============================================================================
* Get more help at https://help.gradle.org
Deprecated Gradle features were used in this build, making it incompatible with Gradle 8.0.
You can use '--warning-mode all' to show the individual deprecation warnings and determine if they come from your own scripts or plugins.
See https://docs.gradle.org/7.3.2/userguide/command_line_interface.html#sec:command_line_warnings
Execution optimizations have been disabled for 11 invalid unit(s) of work during this build to ensure correctness.
Please consult deprecation warnings for more details.
BUILD FAILED in 49m 5s
986 actionable tasks: 899 executed, 85 from cache, 2 up-to-date
Publishing build scan...
https://gradle.com/s/aegzocshnqavs
Build step 'Invoke Gradle script' changed build result to FAILURE
Build step 'Invoke Gradle script' marked build as failure
---------------------------------------------------------------------
To unsubscribe, e-mail: builds-unsubscribe@beam.apache.org
For additional commands, e-mail: builds-help@beam.apache.org
Jenkins build is back to normal : beam_PreCommit_Java_Cron #4922
Posted by Apache Jenkins Server <je...@builds.apache.org>.
See <https://ci-beam.apache.org/job/beam_PreCommit_Java_Cron/4922/display/redirect>
---------------------------------------------------------------------
To unsubscribe, e-mail: builds-unsubscribe@beam.apache.org
For additional commands, e-mail: builds-help@beam.apache.org