You are viewing a plain text version of this content. The canonical link for it is here.
Posted to builds@beam.apache.org by Apache Jenkins Server <je...@builds.apache.org> on 2022/09/14 06:22:58 UTC

Build failed in Jenkins: beam_PostCommit_Python_Examples_Direct #874

See <https://ci-beam.apache.org/job/beam_PostCommit_Python_Examples_Direct/874/display/redirect>

Changes:


------------------------------------------
[...truncated 15.82 KB...]
Collecting filelock>=3.0.0
  Using cached filelock-3.8.0-py3-none-any.whl (10 kB)
Collecting pluggy>=0.12.0
  Using cached pluggy-1.0.0-py2.py3-none-any.whl (13 kB)
Collecting py>=1.4.17
  Using cached py-1.11.0-py2.py3-none-any.whl (98 kB)
Collecting packaging>=14
  Using cached packaging-21.3-py3-none-any.whl (40 kB)
Collecting virtualenv!=20.0.0,!=20.0.1,!=20.0.2,!=20.0.3,!=20.0.4,!=20.0.5,!=20.0.6,!=20.0.7,>=16.0.0
  Using cached virtualenv-20.16.5-py3-none-any.whl (8.8 MB)
Collecting six>=1.14.0
  Using cached six-1.16.0-py2.py3-none-any.whl (11 kB)
Collecting toml>=0.9.4
  Using cached toml-0.10.2-py2.py3-none-any.whl (16 kB)
Collecting grpcio>=1.37.0
  Using cached grpcio-1.48.1-cp38-cp38-manylinux_2_17_x86_64.manylinux2014_x86_64.whl (4.6 MB)
Collecting protobuf<4.0dev,>=3.5.0.post1
  Using cached protobuf-3.20.2-py2.py3-none-any.whl (162 kB)
Collecting pyparsing!=3.0.5,>=2.0.2
  Using cached pyparsing-3.0.9-py3-none-any.whl (98 kB)
Collecting virtualenv!=20.0.0,!=20.0.1,!=20.0.2,!=20.0.3,!=20.0.4,!=20.0.5,!=20.0.6,!=20.0.7,>=16.0.0
  Using cached virtualenv-20.16.4-py3-none-any.whl (8.8 MB)
  Using cached virtualenv-20.16.3-py2.py3-none-any.whl (8.8 MB)
  Using cached virtualenv-20.16.2-py2.py3-none-any.whl (8.8 MB)
Collecting platformdirs<3,>=2
  Using cached platformdirs-2.5.2-py3-none-any.whl (14 kB)
Installing collected packages: distlib, wheel, toml, six, setuptools, pyparsing, py, protobuf, pluggy, platformdirs, filelock, virtualenv, packaging, mypy-protobuf, grpcio, tox, grpcio-tools
  Attempting uninstall: setuptools
    Found existing installation: setuptools 44.0.0
    Uninstalling setuptools-44.0.0:
      Successfully uninstalled setuptools-44.0.0
Successfully installed distlib-0.3.1 filelock-3.8.0 grpcio-1.48.1 grpcio-tools-1.37.0 mypy-protobuf-1.18 packaging-21.3 platformdirs-2.5.2 pluggy-1.0.0 protobuf-3.20.2 py-1.11.0 pyparsing-3.0.9 setuptools-65.3.0 six-1.16.0 toml-0.10.2 tox-3.20.1 virtualenv-20.16.2 wheel-0.37.1

> Task :sdks:python:test-suites:direct:py39:setupVirtualenv
Requirement already satisfied: pip in <https://ci-beam.apache.org/job/beam_PostCommit_Python_Examples_Direct/ws/src/build/gradleenv/1398941893/lib/python3.9/site-packages> (21.2.4)
Collecting pip
  Using cached pip-22.2.2-py3-none-any.whl (2.0 MB)
Installing collected packages: pip
  Attempting uninstall: pip
    Found existing installation: pip 21.2.4
    Uninstalling pip-21.2.4:
      Successfully uninstalled pip-21.2.4
Successfully installed pip-22.2.2
Collecting tox==3.20.1
  Using cached tox-3.20.1-py2.py3-none-any.whl (83 kB)
Requirement already satisfied: setuptools in <https://ci-beam.apache.org/job/beam_PostCommit_Python_Examples_Direct/ws/src/build/gradleenv/1398941893/lib/python3.9/site-packages> (from -r <https://ci-beam.apache.org/job/beam_PostCommit_Python_Examples_Direct/ws/src/sdks/python/build-requirements.txt> (line 20)) (58.1.0)
Collecting setuptools
  Using cached setuptools-65.3.0-py3-none-any.whl (1.2 MB)
Collecting wheel>=0.36.0
  Using cached wheel-0.37.1-py2.py3-none-any.whl (35 kB)
Collecting grpcio-tools==1.37.0
  Using cached grpcio_tools-1.37.0-cp39-cp39-manylinux2014_x86_64.whl (2.5 MB)
Collecting mypy-protobuf==1.18
  Using cached mypy_protobuf-1.18-py3-none-any.whl (7.3 kB)
Collecting distlib==0.3.1
  Using cached distlib-0.3.1-py2.py3-none-any.whl (335 kB)
Collecting pluggy>=0.12.0
  Using cached pluggy-1.0.0-py2.py3-none-any.whl (13 kB)
Collecting filelock>=3.0.0
  Using cached filelock-3.8.0-py3-none-any.whl (10 kB)
Collecting virtualenv!=20.0.0,!=20.0.1,!=20.0.2,!=20.0.3,!=20.0.4,!=20.0.5,!=20.0.6,!=20.0.7,>=16.0.0
  Using cached virtualenv-20.16.5-py3-none-any.whl (8.8 MB)
Collecting six>=1.14.0
  Using cached six-1.16.0-py2.py3-none-any.whl (11 kB)
Collecting toml>=0.9.4
  Using cached toml-0.10.2-py2.py3-none-any.whl (16 kB)
Collecting packaging>=14
  Using cached packaging-21.3-py3-none-any.whl (40 kB)
Collecting py>=1.4.17
  Using cached py-1.11.0-py2.py3-none-any.whl (98 kB)
Collecting grpcio>=1.37.0
  Using cached grpcio-1.48.1-cp39-cp39-manylinux_2_17_x86_64.manylinux2014_x86_64.whl (4.6 MB)
Collecting protobuf<4.0dev,>=3.5.0.post1
  Using cached protobuf-3.20.2-py2.py3-none-any.whl (162 kB)
Collecting pyparsing!=3.0.5,>=2.0.2
  Using cached pyparsing-3.0.9-py3-none-any.whl (98 kB)
Collecting platformdirs<3,>=2.4
  Using cached platformdirs-2.5.2-py3-none-any.whl (14 kB)
Collecting virtualenv!=20.0.0,!=20.0.1,!=20.0.2,!=20.0.3,!=20.0.4,!=20.0.5,!=20.0.6,!=20.0.7,>=16.0.0
  Using cached virtualenv-20.16.4-py3-none-any.whl (8.8 MB)
  Using cached virtualenv-20.16.3-py2.py3-none-any.whl (8.8 MB)
  Using cached virtualenv-20.16.2-py2.py3-none-any.whl (8.8 MB)
Installing collected packages: distlib, wheel, toml, six, setuptools, pyparsing, py, protobuf, pluggy, platformdirs, filelock, virtualenv, packaging, mypy-protobuf, grpcio, tox, grpcio-tools
  Attempting uninstall: setuptools
    Found existing installation: setuptools 58.1.0
    Uninstalling setuptools-58.1.0:
      Successfully uninstalled setuptools-58.1.0
Successfully installed distlib-0.3.1 filelock-3.8.0 grpcio-1.48.1 grpcio-tools-1.37.0 mypy-protobuf-1.18 packaging-21.3 platformdirs-2.5.2 pluggy-1.0.0 protobuf-3.20.2 py-1.11.0 pyparsing-3.0.9 setuptools-65.3.0 six-1.16.0 toml-0.10.2 tox-3.20.1 virtualenv-20.16.2 wheel-0.37.1

> Task :sdks:python:sdist
org/apache/beam/model/interactive/v1/beam_interactive_api.proto:36:1: warning: Import google/protobuf/timestamp.proto is unused.
Writing mypy to org/apache/beam/model/pipeline/v1/external_transforms_pb2.pyi
Writing mypy to org/apache/beam/model/pipeline/v1/beam_runner_api_pb2.pyi
Writing mypy to org/apache/beam/model/pipeline/v1/standard_window_fns_pb2.pyi
Writing mypy to org/apache/beam/model/pipeline/v1/metrics_pb2.pyi
Writing mypy to org/apache/beam/model/pipeline/v1/endpoints_pb2.pyi
Writing mypy to org/apache/beam/model/pipeline/v1/schema_pb2.pyi
Writing mypy to org/apache/beam/model/job_management/v1/beam_artifact_api_pb2.pyi
Writing mypy to org/apache/beam/model/job_management/v1/beam_expansion_api_pb2.pyi
Writing mypy to org/apache/beam/model/job_management/v1/beam_job_api_pb2.pyi
Writing mypy to org/apache/beam/model/fn_execution/v1/beam_provision_api_pb2.pyi
Writing mypy to org/apache/beam/model/fn_execution/v1/beam_fn_api_pb2.pyi
Writing mypy to org/apache/beam/model/interactive/v1/beam_interactive_api_pb2.pyi
setup.py:142: UserWarning: Could not import gen_protos, skipping proto generation.
  warnings.warn("Could not import gen_protos, skipping proto generation.")
<https://ci-beam.apache.org/job/beam_PostCommit_Python_Examples_Direct/ws/src/build/gradleenv/1922375555/lib/python3.8/site-packages/setuptools/dist.py>:530: UserWarning: Normalizing '2.43.0.dev' to '2.43.0.dev0'
  warnings.warn(tmpl.format(**locals()))
warning: no files found matching 'README.md'
warning: no files found matching 'NOTICE'
warning: no files found matching 'LICENSE'
warning: no files found matching 'LICENSE.python'
warning: sdist: standard file not found: should have one of README, README.rst, README.txt, README.md


> Task :sdks:python:test-suites:direct:py38:installGcpTest FAILED
Processing <https://ci-beam.apache.org/job/beam_PostCommit_Python_Examples_Direct/ws/src/sdks/python/build/apache-beam.tar.gz>
  Preparing metadata (setup.py): started
  Preparing metadata (setup.py): finished with status 'error'
  error: subprocess-exited-with-error
  
  × python setup.py egg_info did not run successfully.
  │ exit code: 1
  ╰─> [10 lines of output]
      Traceback (most recent call last):
        File "<string>", line 2, in <module>
        File "<pip-setuptools-caller>", line 34, in <module>
        File "/tmp/pip-req-build-0ma7d6fv/setup.py", line 169, in <module>
          generate_protos_first()
        File "/tmp/pip-req-build-0ma7d6fv/setup.py", line 139, in generate_protos_first
          gen_protos.generate_proto_files()
        File "/tmp/pip-req-build-0ma7d6fv/gen_protos.py", line 476, in generate_proto_files
          raise RuntimeError(error_msg)
      RuntimeError: Not in apache git tree, unable to find proto definitions.
      [end of output]
  
  note: This error originates from a subprocess, and is likely not a problem with pip.
error: metadata-generation-failed

× Encountered error while generating package metadata.
╰─> See above for output.

note: This is an issue with the package mentioned above, not pip.
hint: See above for details.

> Task :sdks:python:test-suites:direct:py39:installGcpTest FAILED
Processing <https://ci-beam.apache.org/job/beam_PostCommit_Python_Examples_Direct/ws/src/sdks/python/build/apache-beam.tar.gz>
  Preparing metadata (setup.py): started
  Preparing metadata (setup.py): finished with status 'error'
  error: subprocess-exited-with-error
  
  × python setup.py egg_info did not run successfully.
  │ exit code: 1
  ╰─> [10 lines of output]
      Traceback (most recent call last):
        File "<string>", line 2, in <module>
        File "<pip-setuptools-caller>", line 34, in <module>
        File "/tmp/pip-req-build-qbmw0_dy/setup.py", line 169, in <module>
          generate_protos_first()
        File "/tmp/pip-req-build-qbmw0_dy/setup.py", line 139, in generate_protos_first
          gen_protos.generate_proto_files()
        File "/tmp/pip-req-build-qbmw0_dy/gen_protos.py", line 476, in generate_proto_files
          raise RuntimeError(error_msg)
      RuntimeError: Not in apache git tree, unable to find proto definitions.
      [end of output]
  
  note: This error originates from a subprocess, and is likely not a problem with pip.
error: metadata-generation-failed

× Encountered error while generating package metadata.
╰─> See above for output.

note: This is an issue with the package mentioned above, not pip.
hint: See above for details.

> Task :sdks:python:test-suites:direct:py37:installGcpTest FAILED
Processing <https://ci-beam.apache.org/job/beam_PostCommit_Python_Examples_Direct/ws/src/sdks/python/build/apache-beam.tar.gz>
  Preparing metadata (setup.py): started
  Preparing metadata (setup.py): finished with status 'error'
  error: subprocess-exited-with-error
  
  × python setup.py egg_info did not run successfully.
  │ exit code: 1
  ╰─> [10 lines of output]
      Traceback (most recent call last):
        File "<string>", line 36, in <module>
        File "<pip-setuptools-caller>", line 34, in <module>
        File "/tmp/pip-req-build-0iigokyo/setup.py", line 169, in <module>
          generate_protos_first()
        File "/tmp/pip-req-build-0iigokyo/setup.py", line 139, in generate_protos_first
          gen_protos.generate_proto_files()
        File "/tmp/pip-req-build-0iigokyo/gen_protos.py", line 476, in generate_proto_files
          raise RuntimeError(error_msg)
      RuntimeError: Not in apache git tree, unable to find proto definitions.
      [end of output]
  
  note: This error originates from a subprocess, and is likely not a problem with pip.
error: metadata-generation-failed

× Encountered error while generating package metadata.
╰─> See above for output.

note: This is an issue with the package mentioned above, not pip.
hint: See above for details.

FAILURE: Build completed with 3 failures.

1: Task failed with an exception.
-----------
* What went wrong:
Execution failed for task ':sdks:python:test-suites:direct:py38:installGcpTest'.
> Process 'command 'sh'' finished with non-zero exit value 1

* Try:
> Run with --stacktrace option to get the stack trace.
> Run with --info or --debug option to get more log output.
==============================================================================

2: Task failed with an exception.
-----------
* What went wrong:
Execution failed for task ':sdks:python:test-suites:direct:py39:installGcpTest'.
> Process 'command 'sh'' finished with non-zero exit value 1

* Try:
> Run with --stacktrace option to get the stack trace.
> Run with --info or --debug option to get more log output.
==============================================================================

3: Task failed with an exception.
-----------
* What went wrong:
Execution failed for task ':sdks:python:test-suites:direct:py37:installGcpTest'.
> Process 'command 'sh'' finished with non-zero exit value 1

* Try:
> Run with --stacktrace option to get the stack trace.
> Run with --info or --debug option to get more log output.
==============================================================================

* Get more help at https://help.gradle.org

BUILD FAILED in 28s
18 actionable tasks: 12 executed, 4 from cache, 2 up-to-date

Publishing build scan...
https://gradle.com/s/xarwf5ssrtkcu

Build step 'Invoke Gradle script' changed build result to FAILURE
Build step 'Invoke Gradle script' marked build as failure

---------------------------------------------------------------------
To unsubscribe, e-mail: builds-unsubscribe@beam.apache.org
For additional commands, e-mail: builds-help@beam.apache.org


Jenkins build is back to normal : beam_PostCommit_Python_Examples_Direct #877

Posted by Apache Jenkins Server <je...@builds.apache.org>.
See <https://ci-beam.apache.org/job/beam_PostCommit_Python_Examples_Direct/877/display/redirect?page=changes>


---------------------------------------------------------------------
To unsubscribe, e-mail: builds-unsubscribe@beam.apache.org
For additional commands, e-mail: builds-help@beam.apache.org


Build failed in Jenkins: beam_PostCommit_Python_Examples_Direct #876

Posted by Apache Jenkins Server <je...@builds.apache.org>.
See <https://ci-beam.apache.org/job/beam_PostCommit_Python_Examples_Direct/876/display/redirect?page=changes>

Changes:

[noreply] Fix assignees check

[noreply] Exclude protobuf 3.20.2 (#23226)

[noreply] Fix IllegalStateException in StorageApiWriteUnshardedRecords error

[noreply] Update cibuildwheel (#23024)

[noreply] Add section to docs on resource hints/RunInference (#23215)


------------------------------------------
[...truncated 477.43 KB...]

top = '/tmp/pip-unpack-2ea3fkyy', topdown = True, onerror = None
followlinks = False

    def walk(top, topdown=True, onerror=None, followlinks=False):
        """Directory tree generator.
    
        For each directory in the directory tree rooted at top (including top
        itself, but excluding '.' and '..'), yields a 3-tuple
    
            dirpath, dirnames, filenames
    
        dirpath is a string, the path to the directory.  dirnames is a list of
        the names of the subdirectories in dirpath (excluding '.' and '..').
        filenames is a list of the names of the non-directory files in dirpath.
        Note that the names in the lists are just names, with no path components.
        To get a full path (which begins with top) to a file or directory in
        dirpath, do os.path.join(dirpath, name).
    
        If optional arg 'topdown' is true or not specified, the triple for a
        directory is generated before the triples for any of its subdirectories
        (directories are generated top down).  If topdown is false, the triple
        for a directory is generated after the triples for all of its
        subdirectories (directories are generated bottom up).
    
        When topdown is true, the caller can modify the dirnames list in-place
        (e.g., via del or slice assignment), and walk will only recurse into the
        subdirectories whose names remain in dirnames; this can be used to prune the
        search, or to impose a specific order of visiting.  Modifying dirnames when
        topdown is false has no effect on the behavior of os.walk(), since the
        directories in dirnames have already been generated by the time dirnames
        itself is generated. No matter the value of topdown, the list of
        subdirectories is retrieved before the tuples for the directory and its
        subdirectories are generated.
    
        By default errors from the os.scandir() call are ignored.  If
        optional arg 'onerror' is specified, it should be a function; it
        will be called with one argument, an OSError instance.  It can
        report the error to continue with the walk, or raise the exception
        to abort the walk.  Note that the filename is available as the
        filename attribute of the exception object.
    
        By default, os.walk does not follow symbolic links to subdirectories on
        systems that support them.  In order to get this functionality, set the
        optional argument 'followlinks' to true.
    
        Caution:  if you pass a relative pathname for top, don't change the
        current working directory between resumptions of walk.  walk never
        changes the current directory, and assumes that the client doesn't
        either.
    
        Example:
    
        import os
        from os.path import join, getsize
        for root, dirs, files in os.walk('python/Lib/email'):
            print(root, "consumes", end="")
            print(sum([getsize(join(root, name)) for name in files]), end="")
            print("bytes in", len(files), "non-directory files")
            if 'CVS' in dirs:
                dirs.remove('CVS')  # don't visit CVS directories
    
        """
        top = fspath(top)
        dirs = []
        nondirs = []
        walk_dirs = []
    
        # We may not have read permission for top, in which case we can't
        # get a list of the files the directory contains.  os.walk
        # always suppressed the exception then, rather than blow up for a
        # minor reason when (say) a thousand readable directories are still
        # left to visit.  That logic is copied here.
        try:
            # Note that scandir is global in this module due
            # to earlier import-*.
            scandir_it = scandir(top)
        except OSError as error:
            if onerror is not None:
                onerror(error)
            return
    
        with scandir_it:
            while True:
                try:
                    try:
>                       entry = next(scandir_it)
E                       Failed: Timeout >600.0s

/usr/lib/python3.7/os.py:362: Failed
------------------------------ Captured log call -------------------------------
INFO     root:pipeline.py:188 Missing pipeline option (runner). Executing pipeline using the default runner: DirectRunner.
=============================== warnings summary ===============================
../../build/gradleenv/1398941891/lib/python3.7/site-packages/hdfs/config.py:15
  <https://ci-beam.apache.org/job/beam_PostCommit_Python_Examples_Direct/ws/src/build/gradleenv/1398941891/lib/python3.7/site-packages/hdfs/config.py>:15: DeprecationWarning: the imp module is deprecated in favour of importlib; see the module's documentation for alternative uses
    from imp import load_source

../../build/gradleenv/1398941891/lib/python3.7/site-packages/google/api_core/grpc_helpers.py:42
  <https://ci-beam.apache.org/job/beam_PostCommit_Python_Examples_Direct/ws/src/build/gradleenv/1398941891/lib/python3.7/site-packages/google/api_core/grpc_helpers.py>:42: DeprecationWarning: Support for grpcio-gcp is deprecated. This feature will be
              removed from `google-api-core` after January 1, 2024. If you need to
              continue to use this feature, please pin to a specific version of
              `google-api-core`.
    DeprecationWarning,

apache_beam/examples/complete/game/hourly_team_score_it_test.py::HourlyTeamScoreIT::test_hourly_team_score_output_checksum_on_small_input
  <https://ci-beam.apache.org/job/beam_PostCommit_Python_Examples_Direct/ws/src/sdks/python/apache_beam/io/gcp/tests/utils.py>:63: PendingDeprecationWarning: Client.dataset is deprecated and will be removed in a future version. Use a string like 'my_project.my_dataset' or a cloud.google.bigquery.DatasetReference object, instead.
    dataset_ref = client.dataset(unique_dataset_name, project=project)

apache_beam/examples/complete/game/hourly_team_score_it_test.py::HourlyTeamScoreIT::test_hourly_team_score_output_checksum_on_small_input
apache_beam/examples/cookbook/bigquery_tornadoes_it_test.py::BigqueryTornadoesIT::test_bigquery_tornadoes_it
apache_beam/examples/cookbook/filters_test.py::FiltersTest::test_filters_output_bigquery_matcher
  <https://ci-beam.apache.org/job/beam_PostCommit_Python_Examples_Direct/ws/src/sdks/python/apache_beam/io/gcp/bigquery.py>:2285: BeamDeprecationWarning: options is deprecated since First stable release. References to <pipeline>.options will not be supported
    is_streaming_pipeline = p.options.view_as(StandardOptions).streaming

apache_beam/examples/complete/game/hourly_team_score_it_test.py::HourlyTeamScoreIT::test_hourly_team_score_output_checksum_on_small_input
apache_beam/examples/cookbook/bigquery_tornadoes_it_test.py::BigqueryTornadoesIT::test_bigquery_tornadoes_it
apache_beam/examples/cookbook/filters_test.py::FiltersTest::test_filters_output_bigquery_matcher
  <https://ci-beam.apache.org/job/beam_PostCommit_Python_Examples_Direct/ws/src/sdks/python/apache_beam/io/gcp/bigquery.py>:2291: BeamDeprecationWarning: options is deprecated since First stable release. References to <pipeline>.options will not be supported
    experiments = p.options.view_as(DebugOptions).experiments or []

apache_beam/examples/complete/game/hourly_team_score_it_test.py::HourlyTeamScoreIT::test_hourly_team_score_output_checksum_on_small_input
apache_beam/examples/cookbook/bigquery_tornadoes_it_test.py::BigqueryTornadoesIT::test_bigquery_tornadoes_it
apache_beam/examples/cookbook/filters_test.py::FiltersTest::test_filters_output_bigquery_matcher
  <https://ci-beam.apache.org/job/beam_PostCommit_Python_Examples_Direct/ws/src/sdks/python/apache_beam/io/gcp/bigquery_file_loads.py>:1141: BeamDeprecationWarning: options is deprecated since First stable release. References to <pipeline>.options will not be supported
    temp_location = p.options.view_as(GoogleCloudOptions).temp_location

apache_beam/examples/complete/game/hourly_team_score_it_test.py::HourlyTeamScoreIT::test_hourly_team_score_output_checksum_on_small_input
apache_beam/examples/cookbook/bigquery_tornadoes_it_test.py::BigqueryTornadoesIT::test_bigquery_tornadoes_it
apache_beam/examples/cookbook/filters_test.py::FiltersTest::test_filters_output_bigquery_matcher
  <https://ci-beam.apache.org/job/beam_PostCommit_Python_Examples_Direct/ws/src/sdks/python/apache_beam/io/gcp/bigquery_file_loads.py>:1143: BeamDeprecationWarning: options is deprecated since First stable release. References to <pipeline>.options will not be supported
    p.options.view_as(GoogleCloudOptions).job_name or 'AUTOMATIC_JOB_NAME')

apache_beam/examples/cookbook/bigquery_side_input_it_test.py::BigQuerySideInputIT::test_bigquery_side_input_it
apache_beam/examples/cookbook/bigquery_side_input_it_test.py::BigQuerySideInputIT::test_bigquery_side_input_it
apache_beam/examples/cookbook/bigquery_tornadoes_it_test.py::BigqueryTornadoesIT::test_bigquery_tornadoes_it
apache_beam/examples/cookbook/filters_test.py::FiltersTest::test_filters_output_bigquery_matcher
apache_beam/examples/dataframe/flight_delays_it_test.py::FlightDelaysTest::test_flight_delays
  <https://ci-beam.apache.org/job/beam_PostCommit_Python_Examples_Direct/ws/src/sdks/python/apache_beam/io/gcp/bigquery.py>:2775: BeamDeprecationWarning: options is deprecated since First stable release. References to <pipeline>.options will not be supported
    temp_location = pcoll.pipeline.options.view_as(

apache_beam/examples/cookbook/bigquery_side_input_it_test.py::BigQuerySideInputIT::test_bigquery_side_input_it
apache_beam/examples/cookbook/bigquery_side_input_it_test.py::BigQuerySideInputIT::test_bigquery_side_input_it
apache_beam/examples/cookbook/bigquery_tornadoes_it_test.py::BigqueryTornadoesIT::test_bigquery_tornadoes_it
apache_beam/examples/cookbook/filters_test.py::FiltersTest::test_filters_output_bigquery_matcher
apache_beam/examples/dataframe/flight_delays_it_test.py::FlightDelaysTest::test_flight_delays
  <https://ci-beam.apache.org/job/beam_PostCommit_Python_Examples_Direct/ws/src/sdks/python/apache_beam/io/gcp/bigquery.py>:2777: BeamDeprecationWarning: options is deprecated since First stable release. References to <pipeline>.options will not be supported
    job_name = pcoll.pipeline.options.view_as(GoogleCloudOptions).job_name

apache_beam/examples/cookbook/bigquery_side_input_it_test.py::BigQuerySideInputIT::test_bigquery_side_input_it
apache_beam/examples/cookbook/bigquery_side_input_it_test.py::BigQuerySideInputIT::test_bigquery_side_input_it
apache_beam/examples/cookbook/bigquery_tornadoes_it_test.py::BigqueryTornadoesIT::test_bigquery_tornadoes_it
apache_beam/examples/cookbook/filters_test.py::FiltersTest::test_filters_output_bigquery_matcher
apache_beam/examples/dataframe/flight_delays_it_test.py::FlightDelaysTest::test_flight_delays
  <https://ci-beam.apache.org/job/beam_PostCommit_Python_Examples_Direct/ws/src/sdks/python/apache_beam/io/gcp/bigquery.py>:2808: BeamDeprecationWarning: options is deprecated since First stable release. References to <pipeline>.options will not be supported
    | _PassThroughThenCleanup(files_to_remove_pcoll))

apache_beam/examples/cookbook/bigquery_tornadoes_it_test.py::BigqueryTornadoesIT::test_bigquery_tornadoes_it
apache_beam/examples/cookbook/filters_test.py::FiltersTest::test_filters_output_bigquery_matcher
  <https://ci-beam.apache.org/job/beam_PostCommit_Python_Examples_Direct/ws/src/sdks/python/apache_beam/io/gcp/bigquery.py>:2281: BeamDeprecationWarning: options is deprecated since First stable release. References to <pipeline>.options will not be supported
    self.table_reference.projectId = pcoll.pipeline.options.view_as(

apache_beam/examples/cookbook/bigquery_tornadoes_it_test.py::BigqueryTornadoesIT::test_bigquery_tornadoes_it
apache_beam/examples/cookbook/filters_test.py::FiltersTest::test_filters_output_bigquery_matcher
  <https://ci-beam.apache.org/job/beam_PostCommit_Python_Examples_Direct/ws/src/sdks/python/apache_beam/io/gcp/bigquery_file_loads.py>:1134: BeamDeprecationWarning: options is deprecated since First stable release. References to <pipeline>.options will not be supported
    self.project = self.project or p.options.view_as(GoogleCloudOptions).project

apache_beam/examples/cookbook/bigquery_tornadoes_it_test.py::BigqueryTornadoesIT::test_bigquery_tornadoes_it
apache_beam/examples/cookbook/filters_test.py::FiltersTest::test_filters_output_bigquery_matcher
  <https://ci-beam.apache.org/job/beam_PostCommit_Python_Examples_Direct/ws/src/sdks/python/apache_beam/io/gcp/tests/utils.py>:100: PendingDeprecationWarning: Client.dataset is deprecated and will be removed in a future version. Use a string like 'my_project.my_dataset' or a cloud.google.bigquery.DatasetReference object, instead.
    table_ref = client.dataset(dataset_id).table(table_id)

apache_beam/examples/dataframe/flight_delays_it_test.py::FlightDelaysTest::test_flight_delays
  <https://ci-beam.apache.org/job/beam_PostCommit_Python_Examples_Direct/ws/src/sdks/python/apache_beam/examples/dataframe/flight_delays.py>:47: FutureWarning: Dropping of nuisance columns in DataFrame reductions (with 'numeric_only=None') is deprecated; in a future version this will raise TypeError.  Select only valid columns before calling the reduction.
    return airline_df[at_top_airports].mean()

apache_beam/examples/dataframe/flight_delays_it_test.py::FlightDelaysTest::test_flight_delays
apache_beam/examples/dataframe/wordcount_test.py::WordCountTest::test_basics
  <https://ci-beam.apache.org/job/beam_PostCommit_Python_Examples_Direct/ws/src/sdks/python/apache_beam/dataframe/io.py>:664: FutureWarning: WriteToFiles is experimental.
    sink=lambda _: _WriteToPandasFileSink(

apache_beam/examples/dataframe/flight_delays_it_test.py::FlightDelaysTest::test_flight_delays
apache_beam/examples/dataframe/wordcount_test.py::WordCountTest::test_basics
  <https://ci-beam.apache.org/job/beam_PostCommit_Python_Examples_Direct/ws/src/sdks/python/apache_beam/io/fileio.py>:590: BeamDeprecationWarning: options is deprecated since First stable release. References to <pipeline>.options will not be supported
    p.options.view_as(GoogleCloudOptions).temp_location or

-- Docs: https://docs.pytest.org/en/stable/how-to/capture-warnings.html
- generated xml file: <https://ci-beam.apache.org/job/beam_PostCommit_Python_Examples_Direct/ws/src/sdks/python/pytest_postCommitExamples-direct-py37.xml> -
=========================== short test summary info ============================
FAILED apache_beam/examples/wordcount_debugging_test.py::WordCountDebuggingTest::test_basics
FAILED apache_beam/examples/wordcount_minimal_test.py::WordCountMinimalTest::test_basics
FAILED apache_beam/examples/wordcount_test.py::WordCountTest::test_basics - F...
= 3 failed, 19 passed, 3 skipped, 6642 deselected, 41 warnings in 2650.69s (0:44:10) =

> Task :sdks:python:test-suites:direct:py37:examples FAILED

FAILURE: Build completed with 3 failures.

1: Task failed with an exception.
-----------
* Where:
Script '<https://ci-beam.apache.org/job/beam_PostCommit_Python_Examples_Direct/ws/src/sdks/python/test-suites/direct/common.gradle'> line: 92

* What went wrong:
Execution failed for task ':sdks:python:test-suites:direct:py38:examples'.
> Process 'command 'sh'' finished with non-zero exit value 1

* Try:
> Run with --stacktrace option to get the stack trace.
> Run with --info or --debug option to get more log output.
==============================================================================

2: Task failed with an exception.
-----------
* Where:
Script '<https://ci-beam.apache.org/job/beam_PostCommit_Python_Examples_Direct/ws/src/sdks/python/test-suites/direct/common.gradle'> line: 92

* What went wrong:
Execution failed for task ':sdks:python:test-suites:direct:py39:examples'.
> Process 'command 'sh'' finished with non-zero exit value 1

* Try:
> Run with --stacktrace option to get the stack trace.
> Run with --info or --debug option to get more log output.
==============================================================================

3: Task failed with an exception.
-----------
* Where:
Script '<https://ci-beam.apache.org/job/beam_PostCommit_Python_Examples_Direct/ws/src/sdks/python/test-suites/direct/common.gradle'> line: 92

* What went wrong:
Execution failed for task ':sdks:python:test-suites:direct:py37:examples'.
> Process 'command 'sh'' finished with non-zero exit value 1

* Try:
> Run with --stacktrace option to get the stack trace.
> Run with --info or --debug option to get more log output.
==============================================================================

* Get more help at https://help.gradle.org

BUILD FAILED in 45m 40s
21 actionable tasks: 15 executed, 4 from cache, 2 up-to-date

Publishing build scan...
https://gradle.com/s/dohib6dgy6ksg

Build step 'Invoke Gradle script' changed build result to FAILURE
Build step 'Invoke Gradle script' marked build as failure

---------------------------------------------------------------------
To unsubscribe, e-mail: builds-unsubscribe@beam.apache.org
For additional commands, e-mail: builds-help@beam.apache.org


Build failed in Jenkins: beam_PostCommit_Python_Examples_Direct #875

Posted by Apache Jenkins Server <je...@builds.apache.org>.
See <https://ci-beam.apache.org/job/beam_PostCommit_Python_Examples_Direct/875/display/redirect?page=changes>

Changes:

[noreply] Publish results of JMH benchmark runs (Java SDK) to InfluxDB (part of


------------------------------------------
[...truncated 15.62 KB...]
Collecting distlib==0.3.1
  Using cached distlib-0.3.1-py2.py3-none-any.whl (335 kB)
Collecting virtualenv!=20.0.0,!=20.0.1,!=20.0.2,!=20.0.3,!=20.0.4,!=20.0.5,!=20.0.6,!=20.0.7,>=16.0.0
  Using cached virtualenv-20.16.5-py3-none-any.whl (8.8 MB)
Collecting py>=1.4.17
  Using cached py-1.11.0-py2.py3-none-any.whl (98 kB)
Collecting pluggy>=0.12.0
  Using cached pluggy-1.0.0-py2.py3-none-any.whl (13 kB)
Collecting toml>=0.9.4
  Using cached toml-0.10.2-py2.py3-none-any.whl (16 kB)
Collecting packaging>=14
  Using cached packaging-21.3-py3-none-any.whl (40 kB)
Collecting six>=1.14.0
  Using cached six-1.16.0-py2.py3-none-any.whl (11 kB)
Collecting filelock>=3.0.0
  Using cached filelock-3.8.0-py3-none-any.whl (10 kB)
Collecting grpcio>=1.37.0
  Using cached grpcio-1.48.1-cp38-cp38-manylinux_2_17_x86_64.manylinux2014_x86_64.whl (4.6 MB)
Collecting protobuf<4.0dev,>=3.5.0.post1
  Using cached protobuf-3.20.2-py2.py3-none-any.whl (162 kB)
Collecting pyparsing!=3.0.5,>=2.0.2
  Using cached pyparsing-3.0.9-py3-none-any.whl (98 kB)
Collecting virtualenv!=20.0.0,!=20.0.1,!=20.0.2,!=20.0.3,!=20.0.4,!=20.0.5,!=20.0.6,!=20.0.7,>=16.0.0
  Using cached virtualenv-20.16.4-py3-none-any.whl (8.8 MB)
  Using cached virtualenv-20.16.3-py2.py3-none-any.whl (8.8 MB)
  Using cached virtualenv-20.16.2-py2.py3-none-any.whl (8.8 MB)
Collecting platformdirs<3,>=2
  Using cached platformdirs-2.5.2-py3-none-any.whl (14 kB)
Installing collected packages: distlib, wheel, toml, six, setuptools, pyparsing, py, protobuf, pluggy, platformdirs, filelock, virtualenv, packaging, mypy-protobuf, grpcio, tox, grpcio-tools
  Attempting uninstall: setuptools
    Found existing installation: setuptools 44.0.0
    Uninstalling setuptools-44.0.0:
      Successfully uninstalled setuptools-44.0.0
Successfully installed distlib-0.3.1 filelock-3.8.0 grpcio-1.48.1 grpcio-tools-1.37.0 mypy-protobuf-1.18 packaging-21.3 platformdirs-2.5.2 pluggy-1.0.0 protobuf-3.20.2 py-1.11.0 pyparsing-3.0.9 setuptools-65.3.0 six-1.16.0 toml-0.10.2 tox-3.20.1 virtualenv-20.16.2 wheel-0.37.1

> Task :sdks:python:setupVirtualenv
Installing collected packages: distlib, wheel, toml, six, setuptools, pyparsing, py, protobuf, pluggy, platformdirs, filelock, virtualenv, packaging, mypy-protobuf, grpcio, tox, grpcio-tools
  Attempting uninstall: setuptools
    Found existing installation: setuptools 44.0.0
    Uninstalling setuptools-44.0.0:
      Successfully uninstalled setuptools-44.0.0
Successfully installed distlib-0.3.1 filelock-3.8.0 grpcio-1.48.1 grpcio-tools-1.37.0 mypy-protobuf-1.18 packaging-21.3 platformdirs-2.5.2 pluggy-1.0.0 protobuf-3.20.2 py-1.11.0 pyparsing-3.0.9 setuptools-65.3.0 six-1.16.0 toml-0.10.2 tox-3.20.1 virtualenv-20.16.2 wheel-0.37.1

> Task :sdks:python:test-suites:direct:py39:setupVirtualenv
Collecting grpcio>=1.37.0
  Using cached grpcio-1.48.1-cp39-cp39-manylinux_2_17_x86_64.manylinux2014_x86_64.whl (4.6 MB)
Collecting protobuf<4.0dev,>=3.5.0.post1
  Using cached protobuf-3.20.2-py2.py3-none-any.whl (162 kB)
Collecting pyparsing!=3.0.5,>=2.0.2
  Using cached pyparsing-3.0.9-py3-none-any.whl (98 kB)
Collecting virtualenv!=20.0.0,!=20.0.1,!=20.0.2,!=20.0.3,!=20.0.4,!=20.0.5,!=20.0.6,!=20.0.7,>=16.0.0
  Using cached virtualenv-20.16.4-py3-none-any.whl (8.8 MB)
  Using cached virtualenv-20.16.3-py2.py3-none-any.whl (8.8 MB)
  Using cached virtualenv-20.16.2-py2.py3-none-any.whl (8.8 MB)
Collecting platformdirs<3,>=2
  Using cached platformdirs-2.5.2-py3-none-any.whl (14 kB)
Installing collected packages: distlib, wheel, toml, six, setuptools, pyparsing, py, protobuf, pluggy, platformdirs, filelock, virtualenv, packaging, mypy-protobuf, grpcio, tox, grpcio-tools
  Attempting uninstall: setuptools
    Found existing installation: setuptools 58.1.0
    Uninstalling setuptools-58.1.0:
      Successfully uninstalled setuptools-58.1.0
Successfully installed distlib-0.3.1 filelock-3.8.0 grpcio-1.48.1 grpcio-tools-1.37.0 mypy-protobuf-1.18 packaging-21.3 platformdirs-2.5.2 pluggy-1.0.0 protobuf-3.20.2 py-1.11.0 pyparsing-3.0.9 setuptools-65.3.0 six-1.16.0 toml-0.10.2 tox-3.20.1 virtualenv-20.16.2 wheel-0.37.1

> Task :sdks:python:test-suites:direct:py37:setupVirtualenv
Collecting virtualenv!=20.0.0,!=20.0.1,!=20.0.2,!=20.0.3,!=20.0.4,!=20.0.5,!=20.0.6,!=20.0.7,>=16.0.0
  Using cached virtualenv-20.16.5-py3-none-any.whl (8.8 MB)
Collecting pluggy>=0.12.0
  Using cached pluggy-1.0.0-py2.py3-none-any.whl (13 kB)
Collecting grpcio>=1.37.0
  Using cached grpcio-1.48.1-cp37-cp37m-manylinux_2_17_x86_64.manylinux2014_x86_64.whl (4.6 MB)
Collecting protobuf<4.0dev,>=3.5.0.post1
  Using cached protobuf-3.20.2-py2.py3-none-any.whl (162 kB)
Collecting zipp>=0.5
  Using cached zipp-3.8.1-py3-none-any.whl (5.6 kB)
Collecting pyparsing!=3.0.5,>=2.0.2
  Using cached pyparsing-3.0.9-py3-none-any.whl (98 kB)
Collecting virtualenv!=20.0.0,!=20.0.1,!=20.0.2,!=20.0.3,!=20.0.4,!=20.0.5,!=20.0.6,!=20.0.7,>=16.0.0
  Using cached virtualenv-20.16.4-py3-none-any.whl (8.8 MB)
  Using cached virtualenv-20.16.3-py2.py3-none-any.whl (8.8 MB)
  Using cached virtualenv-20.16.2-py2.py3-none-any.whl (8.8 MB)
Collecting platformdirs<3,>=2
  Using cached platformdirs-2.5.2-py3-none-any.whl (14 kB)
Installing collected packages: distlib, zipp, wheel, toml, six, setuptools, pyparsing, py, protobuf, platformdirs, filelock, packaging, mypy-protobuf, importlib-metadata, grpcio, virtualenv, pluggy, grpcio-tools, tox
  Attempting uninstall: setuptools
    Found existing installation: setuptools 47.1.0
    Uninstalling setuptools-47.1.0:
      Successfully uninstalled setuptools-47.1.0
Successfully installed distlib-0.3.1 filelock-3.8.0 grpcio-1.48.1 grpcio-tools-1.37.0 importlib-metadata-2.1.3 mypy-protobuf-1.18 packaging-21.3 platformdirs-2.5.2 pluggy-1.0.0 protobuf-3.20.2 py-1.11.0 pyparsing-3.0.9 setuptools-65.3.0 six-1.16.0 toml-0.10.2 tox-3.20.1 virtualenv-20.16.2 wheel-0.37.1 zipp-3.8.1

> Task :sdks:python:sdist
org/apache/beam/model/interactive/v1/beam_interactive_api.proto:36:1: warning: Import google/protobuf/timestamp.proto is unused.
Writing mypy to org/apache/beam/model/pipeline/v1/external_transforms_pb2.pyi
Writing mypy to org/apache/beam/model/pipeline/v1/beam_runner_api_pb2.pyi
Writing mypy to org/apache/beam/model/pipeline/v1/standard_window_fns_pb2.pyi
Writing mypy to org/apache/beam/model/pipeline/v1/metrics_pb2.pyi
Writing mypy to org/apache/beam/model/pipeline/v1/endpoints_pb2.pyi
Writing mypy to org/apache/beam/model/pipeline/v1/schema_pb2.pyi
Writing mypy to org/apache/beam/model/job_management/v1/beam_artifact_api_pb2.pyi
Writing mypy to org/apache/beam/model/job_management/v1/beam_expansion_api_pb2.pyi
Writing mypy to org/apache/beam/model/job_management/v1/beam_job_api_pb2.pyi
Writing mypy to org/apache/beam/model/fn_execution/v1/beam_provision_api_pb2.pyi
Writing mypy to org/apache/beam/model/fn_execution/v1/beam_fn_api_pb2.pyi
Writing mypy to org/apache/beam/model/interactive/v1/beam_interactive_api_pb2.pyi
setup.py:142: UserWarning: Could not import gen_protos, skipping proto generation.
  warnings.warn("Could not import gen_protos, skipping proto generation.")
<https://ci-beam.apache.org/job/beam_PostCommit_Python_Examples_Direct/ws/src/build/gradleenv/1922375555/lib/python3.8/site-packages/setuptools/dist.py>:530: UserWarning: Normalizing '2.43.0.dev' to '2.43.0.dev0'
  warnings.warn(tmpl.format(**locals()))
warning: no files found matching 'README.md'
warning: no files found matching 'NOTICE'
warning: no files found matching 'LICENSE'
warning: no files found matching 'LICENSE.python'
warning: sdist: standard file not found: should have one of README, README.rst, README.txt, README.md


> Task :sdks:python:test-suites:direct:py39:installGcpTest FAILED
Processing <https://ci-beam.apache.org/job/beam_PostCommit_Python_Examples_Direct/ws/src/sdks/python/build/apache-beam.tar.gz>
  Preparing metadata (setup.py): started
  Preparing metadata (setup.py): finished with status 'error'
  error: subprocess-exited-with-error
  
  × python setup.py egg_info did not run successfully.
  │ exit code: 1
  ╰─> [10 lines of output]
      Traceback (most recent call last):
        File "<string>", line 2, in <module>
        File "<pip-setuptools-caller>", line 34, in <module>
        File "/tmp/pip-req-build-ng9q7m2a/setup.py", line 169, in <module>
          generate_protos_first()
        File "/tmp/pip-req-build-ng9q7m2a/setup.py", line 139, in generate_protos_first
          gen_protos.generate_proto_files()
        File "/tmp/pip-req-build-ng9q7m2a/gen_protos.py", line 476, in generate_proto_files
          raise RuntimeError(error_msg)
      RuntimeError: Not in apache git tree, unable to find proto definitions.
      [end of output]
  
  note: This error originates from a subprocess, and is likely not a problem with pip.
error: metadata-generation-failed

× Encountered error while generating package metadata.
╰─> See above for output.

note: This is an issue with the package mentioned above, not pip.
hint: See above for details.

> Task :sdks:python:test-suites:direct:py38:installGcpTest FAILED
Processing <https://ci-beam.apache.org/job/beam_PostCommit_Python_Examples_Direct/ws/src/sdks/python/build/apache-beam.tar.gz>
  Preparing metadata (setup.py): started
  Preparing metadata (setup.py): finished with status 'error'
  error: subprocess-exited-with-error
  
  × python setup.py egg_info did not run successfully.
  │ exit code: 1
  ╰─> [10 lines of output]
      Traceback (most recent call last):
        File "<string>", line 2, in <module>
        File "<pip-setuptools-caller>", line 34, in <module>
        File "/tmp/pip-req-build-460szcrh/setup.py", line 169, in <module>
          generate_protos_first()
        File "/tmp/pip-req-build-460szcrh/setup.py", line 139, in generate_protos_first
          gen_protos.generate_proto_files()
        File "/tmp/pip-req-build-460szcrh/gen_protos.py", line 476, in generate_proto_files
          raise RuntimeError(error_msg)
      RuntimeError: Not in apache git tree, unable to find proto definitions.
      [end of output]
  
  note: This error originates from a subprocess, and is likely not a problem with pip.
error: metadata-generation-failed

× Encountered error while generating package metadata.
╰─> See above for output.

note: This is an issue with the package mentioned above, not pip.
hint: See above for details.

> Task :sdks:python:test-suites:direct:py37:installGcpTest FAILED
Processing <https://ci-beam.apache.org/job/beam_PostCommit_Python_Examples_Direct/ws/src/sdks/python/build/apache-beam.tar.gz>
  Preparing metadata (setup.py): started
  Preparing metadata (setup.py): finished with status 'error'
  error: subprocess-exited-with-error
  
  × python setup.py egg_info did not run successfully.
  │ exit code: 1
  ╰─> [10 lines of output]
      Traceback (most recent call last):
        File "<string>", line 36, in <module>
        File "<pip-setuptools-caller>", line 34, in <module>
        File "/tmp/pip-req-build-c05pipna/setup.py", line 169, in <module>
          generate_protos_first()
        File "/tmp/pip-req-build-c05pipna/setup.py", line 139, in generate_protos_first
          gen_protos.generate_proto_files()
        File "/tmp/pip-req-build-c05pipna/gen_protos.py", line 476, in generate_proto_files
          raise RuntimeError(error_msg)
      RuntimeError: Not in apache git tree, unable to find proto definitions.
      [end of output]
  
  note: This error originates from a subprocess, and is likely not a problem with pip.
error: metadata-generation-failed

× Encountered error while generating package metadata.
╰─> See above for output.

note: This is an issue with the package mentioned above, not pip.
hint: See above for details.

FAILURE: Build completed with 3 failures.

1: Task failed with an exception.
-----------
* What went wrong:
Execution failed for task ':sdks:python:test-suites:direct:py39:installGcpTest'.
> Process 'command 'sh'' finished with non-zero exit value 1

* Try:
> Run with --stacktrace option to get the stack trace.
> Run with --info or --debug option to get more log output.
==============================================================================

2: Task failed with an exception.
-----------
* What went wrong:
Execution failed for task ':sdks:python:test-suites:direct:py38:installGcpTest'.
> Process 'command 'sh'' finished with non-zero exit value 1

* Try:
> Run with --stacktrace option to get the stack trace.
> Run with --info or --debug option to get more log output.
==============================================================================

3: Task failed with an exception.
-----------
* What went wrong:
Execution failed for task ':sdks:python:test-suites:direct:py37:installGcpTest'.
> Process 'command 'sh'' finished with non-zero exit value 1

* Try:
> Run with --stacktrace option to get the stack trace.
> Run with --info or --debug option to get more log output.
==============================================================================

* Get more help at https://help.gradle.org

BUILD FAILED in 1m 5s
18 actionable tasks: 12 executed, 4 from cache, 2 up-to-date

Publishing build scan...
https://gradle.com/s/nyupad643ifvg

Build step 'Invoke Gradle script' changed build result to FAILURE
Build step 'Invoke Gradle script' marked build as failure

---------------------------------------------------------------------
To unsubscribe, e-mail: builds-unsubscribe@beam.apache.org
For additional commands, e-mail: builds-help@beam.apache.org