You are viewing a plain text version of this content. The canonical link for it is here.
Posted to dev@kafka.apache.org by Apache Jenkins Server <je...@builds.apache.org> on 2018/05/07 18:25:41 UTC

Build failed in Jenkins: kafka-trunk-jdk8 #2623

See <https://builds.apache.org/job/kafka-trunk-jdk8/2623/display/redirect?page=changes>

Changes:

[wangguoz] KAFKA-6474: Rewrite tests to use new public TopologyTestDriver [cleanup]

[github] MINOR: Remove deprecated parameter in ProcessorContext#register (#4911)

[mjsax] KAFKA-6871: KStreams Scala API: incorrect Javadocs and misleading

[github] MINOR: Remove deprecated KTable#writeAs, print, foreach, to, through

------------------------------------------
[...truncated 420.01 KB...]
kafka.admin.ResetConsumerGroupOffsetTest > testResetOffsetsShiftPlus STARTED

kafka.admin.ResetConsumerGroupOffsetTest > testResetOffsetsShiftPlus PASSED

kafka.admin.ResetConsumerGroupOffsetTest > testResetOffsetsToLatest STARTED

kafka.admin.ResetConsumerGroupOffsetTest > testResetOffsetsToLatest PASSED

kafka.admin.ResetConsumerGroupOffsetTest > testResetOffsetsNewConsumerExistingTopic STARTED

kafka.admin.ResetConsumerGroupOffsetTest > testResetOffsetsNewConsumerExistingTopic PASSED

kafka.admin.ResetConsumerGroupOffsetTest > testResetOffsetsShiftByLowerThanEarliest STARTED

kafka.admin.ResetConsumerGroupOffsetTest > testResetOffsetsShiftByLowerThanEarliest PASSED

kafka.admin.ResetConsumerGroupOffsetTest > testResetOffsetsByDuration STARTED

kafka.admin.ResetConsumerGroupOffsetTest > testResetOffsetsByDuration PASSED

kafka.admin.ResetConsumerGroupOffsetTest > testResetOffsetsToLocalDateTime STARTED

kafka.admin.ResetConsumerGroupOffsetTest > testResetOffsetsToLocalDateTime PASSED

kafka.admin.ResetConsumerGroupOffsetTest > testResetOffsetsToEarliestOnTopicsAndPartitions STARTED

kafka.admin.ResetConsumerGroupOffsetTest > testResetOffsetsToEarliestOnTopicsAndPartitions PASSED

kafka.admin.ResetConsumerGroupOffsetTest > testResetOffsetsToEarliestOnTopics STARTED

kafka.admin.ResetConsumerGroupOffsetTest > testResetOffsetsToEarliestOnTopics PASSED

kafka.admin.ReassignPartitionsCommandArgsTest > shouldFailIfBlankArg STARTED

kafka.admin.ReassignPartitionsCommandArgsTest > shouldFailIfBlankArg PASSED

kafka.admin.ReassignPartitionsCommandArgsTest > shouldNotAllowVerifyWithoutReassignmentOption STARTED

kafka.admin.ReassignPartitionsCommandArgsTest > shouldNotAllowVerifyWithoutReassignmentOption PASSED

kafka.admin.ReassignPartitionsCommandArgsTest > shouldNotAllowGenerateWithoutBrokersOption STARTED

kafka.admin.ReassignPartitionsCommandArgsTest > shouldNotAllowGenerateWithoutBrokersOption PASSED

kafka.admin.ReassignPartitionsCommandArgsTest > shouldNotAllowTopicsOptionWithVerify STARTED

kafka.admin.ReassignPartitionsCommandArgsTest > shouldNotAllowTopicsOptionWithVerify PASSED

kafka.admin.ReassignPartitionsCommandArgsTest > shouldNotAllowGenerateWithThrottleOption STARTED

kafka.admin.ReassignPartitionsCommandArgsTest > shouldNotAllowGenerateWithThrottleOption PASSED

kafka.admin.ReassignPartitionsCommandArgsTest > shouldFailIfNoArgs STARTED

kafka.admin.ReassignPartitionsCommandArgsTest > shouldFailIfNoArgs PASSED

kafka.admin.ReassignPartitionsCommandArgsTest > shouldNotAllowExecuteWithoutReassignmentOption STARTED

kafka.admin.ReassignPartitionsCommandArgsTest > shouldNotAllowExecuteWithoutReassignmentOption PASSED

kafka.admin.ReassignPartitionsCommandArgsTest > shouldNotAllowBrokersListWithVerifyOption STARTED

kafka.admin.ReassignPartitionsCommandArgsTest > shouldNotAllowBrokersListWithVerifyOption PASSED

kafka.admin.ReassignPartitionsCommandArgsTest > shouldCorrectlyParseValidMinimumExecuteOptions STARTED

kafka.admin.ReassignPartitionsCommandArgsTest > shouldCorrectlyParseValidMinimumExecuteOptions PASSED

kafka.admin.ReassignPartitionsCommandArgsTest > shouldNotAllowGenerateWithReassignmentOption STARTED

kafka.admin.ReassignPartitionsCommandArgsTest > shouldNotAllowGenerateWithReassignmentOption PASSED

kafka.admin.ReassignPartitionsCommandArgsTest > shouldCorrectlyParseValidMinimumGenerateOptions STARTED

kafka.admin.ReassignPartitionsCommandArgsTest > shouldCorrectlyParseValidMinimumGenerateOptions PASSED

kafka.admin.ReassignPartitionsCommandArgsTest > shouldNotAllowGenerateWithoutBrokersAndTopicsOptions STARTED

kafka.admin.ReassignPartitionsCommandArgsTest > shouldNotAllowGenerateWithoutBrokersAndTopicsOptions PASSED

kafka.admin.ReassignPartitionsCommandArgsTest > shouldNotAllowThrottleWithVerifyOption STARTED

kafka.admin.ReassignPartitionsCommandArgsTest > shouldNotAllowThrottleWithVerifyOption PASSED

kafka.admin.ReassignPartitionsCommandArgsTest > shouldUseDefaultsIfEnabled STARTED

kafka.admin.ReassignPartitionsCommandArgsTest > shouldUseDefaultsIfEnabled PASSED

kafka.admin.ReassignPartitionsCommandArgsTest > shouldAllowThrottleOptionOnExecute STARTED

kafka.admin.ReassignPartitionsCommandArgsTest > shouldAllowThrottleOptionOnExecute PASSED

kafka.admin.ReassignPartitionsCommandArgsTest > shouldNotAllowExecuteWithBrokers STARTED

kafka.admin.ReassignPartitionsCommandArgsTest > shouldNotAllowExecuteWithBrokers PASSED

kafka.admin.ReassignPartitionsCommandArgsTest > shouldNotAllowExecuteWithTopicsOption STARTED

kafka.admin.ReassignPartitionsCommandArgsTest > shouldNotAllowExecuteWithTopicsOption PASSED

kafka.admin.ReassignPartitionsCommandArgsTest > shouldCorrectlyParseValidMinimumVerifyOptions STARTED

kafka.admin.ReassignPartitionsCommandArgsTest > shouldCorrectlyParseValidMinimumVerifyOptions PASSED

kafka.admin.ReassignPartitionsCommandArgsTest > shouldNotAllowGenerateWithoutTopicsOption STARTED

kafka.admin.ReassignPartitionsCommandArgsTest > shouldNotAllowGenerateWithoutTopicsOption PASSED

kafka.admin.BrokerApiVersionsCommandTest > checkBrokerApiVersionCommandOutput STARTED

kafka.admin.BrokerApiVersionsCommandTest > checkBrokerApiVersionCommandOutput PASSED

kafka.admin.TopicCommandTest > testCreateIfNotExists STARTED

kafka.admin.TopicCommandTest > testCreateIfNotExists PASSED

kafka.admin.TopicCommandTest > testCreateAlterTopicWithRackAware STARTED

kafka.admin.TopicCommandTest > testCreateAlterTopicWithRackAware PASSED

kafka.admin.TopicCommandTest > testTopicDeletion STARTED

kafka.admin.TopicCommandTest > testTopicDeletion PASSED

kafka.admin.TopicCommandTest > testConfigPreservationAcrossPartitionAlteration STARTED

kafka.admin.TopicCommandTest > testConfigPreservationAcrossPartitionAlteration PASSED

kafka.admin.TopicCommandTest > testAlterIfExists STARTED

kafka.admin.TopicCommandTest > testAlterIfExists PASSED

kafka.admin.TopicCommandTest > testDescribeAndListTopicsMarkedForDeletion STARTED

kafka.admin.TopicCommandTest > testDescribeAndListTopicsMarkedForDeletion PASSED

kafka.admin.TopicCommandTest > testDeleteIfExists STARTED

kafka.admin.TopicCommandTest > testDeleteIfExists PASSED

kafka.admin.AdminZkClientTest > testGetBrokerMetadatas STARTED

kafka.admin.AdminZkClientTest > testGetBrokerMetadatas PASSED

kafka.admin.AdminZkClientTest > testBootstrapClientIdConfig STARTED

kafka.admin.AdminZkClientTest > testBootstrapClientIdConfig PASSED

kafka.admin.AdminZkClientTest > testTopicConfigChange STARTED

kafka.admin.AdminZkClientTest > testTopicConfigChange PASSED

kafka.admin.AdminZkClientTest > testManualReplicaAssignment STARTED

kafka.admin.AdminZkClientTest > testManualReplicaAssignment PASSED

kafka.admin.AdminZkClientTest > testConcurrentTopicCreation STARTED

kafka.admin.AdminZkClientTest > testConcurrentTopicCreation PASSED

kafka.admin.AdminZkClientTest > shouldPropagateDynamicBrokerConfigs STARTED

kafka.admin.AdminZkClientTest > shouldPropagateDynamicBrokerConfigs PASSED

kafka.admin.AdminZkClientTest > testTopicCreationWithCollision STARTED

kafka.admin.AdminZkClientTest > testTopicCreationWithCollision PASSED

kafka.admin.AdminZkClientTest > testTopicCreationInZK STARTED

kafka.admin.AdminZkClientTest > testTopicCreationInZK PASSED

unit.kafka.admin.DeleteConsumerGroupTest > testDeleteNonEmptyGroup STARTED

unit.kafka.admin.DeleteConsumerGroupTest > testDeleteNonEmptyGroup PASSED

unit.kafka.admin.DeleteConsumerGroupTest > testDeleteCmdWithMixOfSuccessAndError STARTED

unit.kafka.admin.DeleteConsumerGroupTest > testDeleteCmdWithMixOfSuccessAndError PASSED

unit.kafka.admin.DeleteConsumerGroupTest > testDeleteWithShortInitialization STARTED

unit.kafka.admin.DeleteConsumerGroupTest > testDeleteWithShortInitialization PASSED

unit.kafka.admin.DeleteConsumerGroupTest > testDeleteCmdWithShortInitialization STARTED

unit.kafka.admin.DeleteConsumerGroupTest > testDeleteCmdWithShortInitialization PASSED

unit.kafka.admin.DeleteConsumerGroupTest > testDeleteWithTopicOption STARTED

unit.kafka.admin.DeleteConsumerGroupTest > testDeleteWithTopicOption PASSED

unit.kafka.admin.DeleteConsumerGroupTest > testDeleteNonExistingGroup STARTED

unit.kafka.admin.DeleteConsumerGroupTest > testDeleteNonExistingGroup PASSED

unit.kafka.admin.DeleteConsumerGroupTest > testDeleteCmdNonEmptyGroup STARTED

unit.kafka.admin.DeleteConsumerGroupTest > testDeleteCmdNonEmptyGroup PASSED

unit.kafka.admin.DeleteConsumerGroupTest > testDeleteCmdNonExistingGroup STARTED

unit.kafka.admin.DeleteConsumerGroupTest > testDeleteCmdNonExistingGroup PASSED

unit.kafka.admin.DeleteConsumerGroupTest > testDeleteEmptyGroup STARTED

unit.kafka.admin.DeleteConsumerGroupTest > testDeleteEmptyGroup PASSED

unit.kafka.admin.DeleteConsumerGroupTest > testDeleteWithMixOfSuccessAndError STARTED

unit.kafka.admin.DeleteConsumerGroupTest > testDeleteWithMixOfSuccessAndError PASSED

unit.kafka.admin.DeleteConsumerGroupTest > testDeleteCmdEmptyGroup STARTED

unit.kafka.admin.DeleteConsumerGroupTest > testDeleteCmdEmptyGroup PASSED

1938 tests completed, 1 failed, 5 skipped
:kafka-trunk-jdk8:core:test FAILED
:test_core_2_11 FAILED

FAILURE: Build failed with an exception.

* What went wrong:
Execution failed for task ':kafka-trunk-jdk8:core:test'.
> There were failing tests. See the report at: file://<https://builds.apache.org/job/kafka-trunk-jdk8/ws/core/build/reports/tests/test/index.html>

* Try:
Run with --stacktrace option to get the stack trace. Run with --info or --debug option to get more log output. Run with --scan to get full insights.

* Get more help at https://help.gradle.org

BUILD FAILED in 1h 13m 7s
24 actionable tasks: 3 executed, 21 up-to-date
Build step 'Execute shell' marked build as failure
[FINDBUGS] Collecting findbugs analysis files...
Setting GRADLE_4_4_HOME=/home/jenkins/tools/gradle/4.4
[FINDBUGS] Searching for all files in <https://builds.apache.org/job/kafka-trunk-jdk8/ws/> that match the pattern **/build/reports/findbugs/*.xml
[FINDBUGS] Parsing 1 file in <https://builds.apache.org/job/kafka-trunk-jdk8/ws/>
[FINDBUGS] Successfully parsed file <https://builds.apache.org/job/kafka-trunk-jdk8/ws/core/build/reports/findbugs/main.xml> with 0 unique warnings and 0 duplicates.
Setting GRADLE_4_4_HOME=/home/jenkins/tools/gradle/4.4
Setting GRADLE_4_4_HOME=/home/jenkins/tools/gradle/4.4
<Git Blamer> Using GitBlamer to create author and commit information for all warnings.
<Git Blamer> GIT_COMMIT=42771eb37d6abd0a34220d30773e559680bdf9b0, workspace=<https://builds.apache.org/job/kafka-trunk-jdk8/ws/>
[FINDBUGS] Computing warning deltas based on reference build #2620
Recording test results
Setting GRADLE_4_4_HOME=/home/jenkins/tools/gradle/4.4
Setting GRADLE_4_4_HOME=/home/jenkins/tools/gradle/4.4
Not sending mail to unregistered user wangguoz@gmail.com
Not sending mail to unregistered user github@alasdairhodge.co.uk

Jenkins build is back to normal : kafka-trunk-jdk8 #2626

Posted by Apache Jenkins Server <je...@builds.apache.org>.
See <https://builds.apache.org/job/kafka-trunk-jdk8/2626/display/redirect?page=changes>


Build failed in Jenkins: kafka-trunk-jdk8 #2625

Posted by Apache Jenkins Server <je...@builds.apache.org>.
See <https://builds.apache.org/job/kafka-trunk-jdk8/2625/display/redirect?page=changes>

Changes:

[github] KAFKA-6813: Remove deprecated APIs in KIP-182, Part I (#4919)

------------------------------------------
[...truncated 1.46 MB...]
org.apache.kafka.common.config.ConfigDefTest > testInvalidDefaultRange STARTED

org.apache.kafka.common.config.ConfigDefTest > testInvalidDefaultRange PASSED

org.apache.kafka.common.config.ConfigDefTest > testNames STARTED

org.apache.kafka.common.config.ConfigDefTest > testNames PASSED

org.apache.kafka.common.config.ConfigDefTest > testGroupInference STARTED

org.apache.kafka.common.config.ConfigDefTest > testGroupInference PASSED

org.apache.kafka.common.config.ConfigDefTest > testConvertValueToStringNestedClass STARTED

org.apache.kafka.common.config.ConfigDefTest > testConvertValueToStringNestedClass PASSED

org.apache.kafka.common.config.ConfigDefTest > testConvertValueToStringInt STARTED

org.apache.kafka.common.config.ConfigDefTest > testConvertValueToStringInt PASSED

org.apache.kafka.common.config.ConfigDefTest > testValidators STARTED

org.apache.kafka.common.config.ConfigDefTest > testValidators PASSED

org.apache.kafka.common.config.ConfigDefTest > testValidateCannotParse STARTED

org.apache.kafka.common.config.ConfigDefTest > testValidateCannotParse PASSED

org.apache.kafka.common.config.ConfigDefTest > testValidate STARTED

org.apache.kafka.common.config.ConfigDefTest > testValidate PASSED

org.apache.kafka.common.config.ConfigDefTest > testInternalConfigDoesntShowUpInDocs STARTED

org.apache.kafka.common.config.ConfigDefTest > testInternalConfigDoesntShowUpInDocs PASSED

org.apache.kafka.common.config.ConfigDefTest > testInvalidDefaultString STARTED

org.apache.kafka.common.config.ConfigDefTest > testInvalidDefaultString PASSED

org.apache.kafka.common.config.ConfigDefTest > testSslPasswords STARTED

org.apache.kafka.common.config.ConfigDefTest > testSslPasswords PASSED

org.apache.kafka.common.config.ConfigDefTest > testDynamicUpdateModeInDocs STARTED

org.apache.kafka.common.config.ConfigDefTest > testDynamicUpdateModeInDocs PASSED

org.apache.kafka.common.config.ConfigDefTest > testBaseConfigDefDependents STARTED

org.apache.kafka.common.config.ConfigDefTest > testBaseConfigDefDependents PASSED

org.apache.kafka.common.config.ConfigDefTest > testConvertValueToStringClass STARTED

org.apache.kafka.common.config.ConfigDefTest > testConvertValueToStringClass PASSED

org.apache.kafka.common.config.ConfigDefTest > testConvertValueToStringShort STARTED

org.apache.kafka.common.config.ConfigDefTest > testConvertValueToStringShort PASSED

org.apache.kafka.common.config.ConfigDefTest > testInvalidDefault STARTED

org.apache.kafka.common.config.ConfigDefTest > testInvalidDefault PASSED

org.apache.kafka.common.config.ConfigDefTest > toRst STARTED

org.apache.kafka.common.config.ConfigDefTest > toRst PASSED

org.apache.kafka.common.config.ConfigDefTest > testCanAddInternalConfig STARTED

org.apache.kafka.common.config.ConfigDefTest > testCanAddInternalConfig PASSED

org.apache.kafka.common.config.ConfigDefTest > testMissingRequired STARTED

org.apache.kafka.common.config.ConfigDefTest > testMissingRequired PASSED

org.apache.kafka.common.config.ConfigDefTest > testParsingEmptyDefaultValueForStringFieldShouldSucceed STARTED

org.apache.kafka.common.config.ConfigDefTest > testParsingEmptyDefaultValueForStringFieldShouldSucceed PASSED

org.apache.kafka.common.config.ConfigDefTest > testConvertValueToStringPassword STARTED

org.apache.kafka.common.config.ConfigDefTest > testConvertValueToStringPassword PASSED

org.apache.kafka.common.config.ConfigDefTest > testConvertValueToStringList STARTED

org.apache.kafka.common.config.ConfigDefTest > testConvertValueToStringList PASSED

org.apache.kafka.common.config.ConfigDefTest > testConvertValueToStringLong STARTED

org.apache.kafka.common.config.ConfigDefTest > testConvertValueToStringLong PASSED

org.apache.kafka.common.config.ConfigDefTest > testConvertValueToStringBoolean STARTED

org.apache.kafka.common.config.ConfigDefTest > testConvertValueToStringBoolean PASSED

org.apache.kafka.common.config.ConfigDefTest > testNullDefaultWithValidator STARTED

org.apache.kafka.common.config.ConfigDefTest > testNullDefaultWithValidator PASSED

org.apache.kafka.common.config.ConfigDefTest > testMissingDependentConfigs STARTED

org.apache.kafka.common.config.ConfigDefTest > testMissingDependentConfigs PASSED

org.apache.kafka.common.config.ConfigDefTest > testConvertValueToStringDouble STARTED

org.apache.kafka.common.config.ConfigDefTest > testConvertValueToStringDouble PASSED

org.apache.kafka.common.config.ConfigDefTest > toEnrichedRst STARTED

org.apache.kafka.common.config.ConfigDefTest > toEnrichedRst PASSED

org.apache.kafka.common.config.ConfigDefTest > testDefinedTwice STARTED

org.apache.kafka.common.config.ConfigDefTest > testDefinedTwice PASSED

org.apache.kafka.common.config.ConfigDefTest > testConvertValueToStringString STARTED

org.apache.kafka.common.config.ConfigDefTest > testConvertValueToStringString PASSED

org.apache.kafka.common.config.ConfigDefTest > testNestedClass STARTED

org.apache.kafka.common.config.ConfigDefTest > testNestedClass PASSED

org.apache.kafka.common.config.ConfigDefTest > testBadInputs STARTED

org.apache.kafka.common.config.ConfigDefTest > testBadInputs PASSED

org.apache.kafka.common.config.ConfigDefTest > testValidateMissingConfigKey STARTED

org.apache.kafka.common.config.ConfigDefTest > testValidateMissingConfigKey PASSED

org.apache.kafka.common.config.AbstractConfigTest > testOriginalsWithPrefix STARTED

org.apache.kafka.common.config.AbstractConfigTest > testOriginalsWithPrefix PASSED

org.apache.kafka.common.config.AbstractConfigTest > testConfiguredInstances STARTED

org.apache.kafka.common.config.AbstractConfigTest > testConfiguredInstances PASSED

org.apache.kafka.common.config.AbstractConfigTest > testEmptyList STARTED

org.apache.kafka.common.config.AbstractConfigTest > testEmptyList PASSED

org.apache.kafka.common.config.AbstractConfigTest > testValuesWithSecondaryPrefix STARTED

org.apache.kafka.common.config.AbstractConfigTest > testValuesWithSecondaryPrefix PASSED

org.apache.kafka.common.config.AbstractConfigTest > testValuesWithPrefixOverride STARTED

org.apache.kafka.common.config.AbstractConfigTest > testValuesWithPrefixOverride PASSED

org.apache.kafka.common.config.AbstractConfigTest > testValuesWithPrefixAllOrNothing STARTED

org.apache.kafka.common.config.AbstractConfigTest > testValuesWithPrefixAllOrNothing PASSED

org.apache.kafka.common.config.AbstractConfigTest > testUnused STARTED

org.apache.kafka.common.config.AbstractConfigTest > testUnused PASSED

org.apache.kafka.common.config.AbstractConfigTest > testClassConfigs STARTED

org.apache.kafka.common.config.AbstractConfigTest > testClassConfigs PASSED

org.apache.kafka.common.KafkaFutureTest > testCompletingFutures STARTED

org.apache.kafka.common.KafkaFutureTest > testCompletingFutures PASSED

org.apache.kafka.common.KafkaFutureTest > testThenApply STARTED

org.apache.kafka.common.KafkaFutureTest > testThenApply PASSED

org.apache.kafka.common.KafkaFutureTest > testCompleteFutures STARTED

org.apache.kafka.common.KafkaFutureTest > testCompleteFutures PASSED

org.apache.kafka.common.KafkaFutureTest > testAllOfFuturesHandlesZeroFutures STARTED

org.apache.kafka.common.KafkaFutureTest > testAllOfFuturesHandlesZeroFutures PASSED

org.apache.kafka.common.KafkaFutureTest > testFutureTimeoutWithZeroWait STARTED

org.apache.kafka.common.KafkaFutureTest > testFutureTimeoutWithZeroWait PASSED

org.apache.kafka.common.KafkaFutureTest > testAllOfFutures STARTED

org.apache.kafka.common.KafkaFutureTest > testAllOfFutures PASSED

org.apache.kafka.common.header.internals.RecordHeadersTest > testAdd STARTED

org.apache.kafka.common.header.internals.RecordHeadersTest > testAdd PASSED

org.apache.kafka.common.header.internals.RecordHeadersTest > testNew STARTED

org.apache.kafka.common.header.internals.RecordHeadersTest > testNew PASSED

org.apache.kafka.common.header.internals.RecordHeadersTest > testReadOnly STARTED

org.apache.kafka.common.header.internals.RecordHeadersTest > testReadOnly PASSED

org.apache.kafka.common.header.internals.RecordHeadersTest > testHeaders STARTED

org.apache.kafka.common.header.internals.RecordHeadersTest > testHeaders PASSED

org.apache.kafka.common.header.internals.RecordHeadersTest > testLastHeader STARTED

org.apache.kafka.common.header.internals.RecordHeadersTest > testLastHeader PASSED

org.apache.kafka.common.header.internals.RecordHeadersTest > testRemove STARTED

org.apache.kafka.common.header.internals.RecordHeadersTest > testRemove PASSED

org.apache.kafka.common.header.internals.RecordHeadersTest > testAddRemoveInterleaved STARTED

org.apache.kafka.common.header.internals.RecordHeadersTest > testAddRemoveInterleaved PASSED

4149 tests completed, 1 failed, 1 skipped
:clients:test FAILED

FAILURE: Build failed with an exception.

* What went wrong:
Execution failed for task ':clients:test'.
> There were failing tests. See the report at: file://<https://builds.apache.org/job/kafka-trunk-jdk8/ws/clients/build/reports/tests/test/index.html>

* Try:
Run with --stacktrace option to get the stack trace. Run with --info or --debug option to get more log output. Run with --scan to get full insights.

* Get more help at https://help.gradle.org

BUILD FAILED in 1h 38m 8s
31 actionable tasks: 6 executed, 25 up-to-date
Build step 'Execute shell' marked build as failure
[FINDBUGS] Collecting findbugs analysis files...
Setting GRADLE_4_4_HOME=/home/jenkins/tools/gradle/4.4
[FINDBUGS] Searching for all files in <https://builds.apache.org/job/kafka-trunk-jdk8/ws/> that match the pattern **/build/reports/findbugs/*.xml
[FINDBUGS] Parsing 2 files in <https://builds.apache.org/job/kafka-trunk-jdk8/ws/>
[FINDBUGS] Successfully parsed file <https://builds.apache.org/job/kafka-trunk-jdk8/ws/clients/build/reports/findbugs/main.xml> with 0 unique warnings and 0 duplicates.
[FINDBUGS] Successfully parsed file <https://builds.apache.org/job/kafka-trunk-jdk8/ws/core/build/reports/findbugs/main.xml> with 0 unique warnings and 0 duplicates.
Setting GRADLE_4_4_HOME=/home/jenkins/tools/gradle/4.4
Setting GRADLE_4_4_HOME=/home/jenkins/tools/gradle/4.4
<Git Blamer> Using GitBlamer to create author and commit information for all warnings.
<Git Blamer> GIT_COMMIT=2b5a59406622affa1e333e073546f075f59b4ac9, workspace=<https://builds.apache.org/job/kafka-trunk-jdk8/ws/>
[FINDBUGS] Computing warning deltas based on reference build #2620
Recording test results
Setting GRADLE_4_4_HOME=/home/jenkins/tools/gradle/4.4
Setting GRADLE_4_4_HOME=/home/jenkins/tools/gradle/4.4
Not sending mail to unregistered user wangguoz@gmail.com
Not sending mail to unregistered user github@alasdairhodge.co.uk

Build failed in Jenkins: kafka-trunk-jdk8 #2624

Posted by Apache Jenkins Server <je...@builds.apache.org>.
See <https://builds.apache.org/job/kafka-trunk-jdk8/2624/display/redirect?page=changes>

Changes:

[wangguoz] KAFKA-6628: RocksDBSegmentedBytesStoreTest does not cover time window

------------------------------------------
[...truncated 420.02 KB...]
kafka.admin.ResetConsumerGroupOffsetTest > testResetOffsetsShiftPlus STARTED

kafka.admin.ResetConsumerGroupOffsetTest > testResetOffsetsShiftPlus PASSED

kafka.admin.ResetConsumerGroupOffsetTest > testResetOffsetsToLatest STARTED

kafka.admin.ResetConsumerGroupOffsetTest > testResetOffsetsToLatest PASSED

kafka.admin.ResetConsumerGroupOffsetTest > testResetOffsetsNewConsumerExistingTopic STARTED

kafka.admin.ResetConsumerGroupOffsetTest > testResetOffsetsNewConsumerExistingTopic PASSED

kafka.admin.ResetConsumerGroupOffsetTest > testResetOffsetsShiftByLowerThanEarliest STARTED

kafka.admin.ResetConsumerGroupOffsetTest > testResetOffsetsShiftByLowerThanEarliest PASSED

kafka.admin.ResetConsumerGroupOffsetTest > testResetOffsetsByDuration STARTED

kafka.admin.ResetConsumerGroupOffsetTest > testResetOffsetsByDuration PASSED

kafka.admin.ResetConsumerGroupOffsetTest > testResetOffsetsToLocalDateTime STARTED

kafka.admin.ResetConsumerGroupOffsetTest > testResetOffsetsToLocalDateTime PASSED

kafka.admin.ResetConsumerGroupOffsetTest > testResetOffsetsToEarliestOnTopicsAndPartitions STARTED

kafka.admin.ResetConsumerGroupOffsetTest > testResetOffsetsToEarliestOnTopicsAndPartitions PASSED

kafka.admin.ResetConsumerGroupOffsetTest > testResetOffsetsToEarliestOnTopics STARTED

kafka.admin.ResetConsumerGroupOffsetTest > testResetOffsetsToEarliestOnTopics PASSED

kafka.admin.ReassignPartitionsCommandArgsTest > shouldFailIfBlankArg STARTED

kafka.admin.ReassignPartitionsCommandArgsTest > shouldFailIfBlankArg PASSED

kafka.admin.ReassignPartitionsCommandArgsTest > shouldNotAllowVerifyWithoutReassignmentOption STARTED

kafka.admin.ReassignPartitionsCommandArgsTest > shouldNotAllowVerifyWithoutReassignmentOption PASSED

kafka.admin.ReassignPartitionsCommandArgsTest > shouldNotAllowGenerateWithoutBrokersOption STARTED

kafka.admin.ReassignPartitionsCommandArgsTest > shouldNotAllowGenerateWithoutBrokersOption PASSED

kafka.admin.ReassignPartitionsCommandArgsTest > shouldNotAllowTopicsOptionWithVerify STARTED

kafka.admin.ReassignPartitionsCommandArgsTest > shouldNotAllowTopicsOptionWithVerify PASSED

kafka.admin.ReassignPartitionsCommandArgsTest > shouldNotAllowGenerateWithThrottleOption STARTED

kafka.admin.ReassignPartitionsCommandArgsTest > shouldNotAllowGenerateWithThrottleOption PASSED

kafka.admin.ReassignPartitionsCommandArgsTest > shouldFailIfNoArgs STARTED

kafka.admin.ReassignPartitionsCommandArgsTest > shouldFailIfNoArgs PASSED

kafka.admin.ReassignPartitionsCommandArgsTest > shouldNotAllowExecuteWithoutReassignmentOption STARTED

kafka.admin.ReassignPartitionsCommandArgsTest > shouldNotAllowExecuteWithoutReassignmentOption PASSED

kafka.admin.ReassignPartitionsCommandArgsTest > shouldNotAllowBrokersListWithVerifyOption STARTED

kafka.admin.ReassignPartitionsCommandArgsTest > shouldNotAllowBrokersListWithVerifyOption PASSED

kafka.admin.ReassignPartitionsCommandArgsTest > shouldCorrectlyParseValidMinimumExecuteOptions STARTED

kafka.admin.ReassignPartitionsCommandArgsTest > shouldCorrectlyParseValidMinimumExecuteOptions PASSED

kafka.admin.ReassignPartitionsCommandArgsTest > shouldNotAllowGenerateWithReassignmentOption STARTED

kafka.admin.ReassignPartitionsCommandArgsTest > shouldNotAllowGenerateWithReassignmentOption PASSED

kafka.admin.ReassignPartitionsCommandArgsTest > shouldCorrectlyParseValidMinimumGenerateOptions STARTED

kafka.admin.ReassignPartitionsCommandArgsTest > shouldCorrectlyParseValidMinimumGenerateOptions PASSED

kafka.admin.ReassignPartitionsCommandArgsTest > shouldNotAllowGenerateWithoutBrokersAndTopicsOptions STARTED

kafka.admin.ReassignPartitionsCommandArgsTest > shouldNotAllowGenerateWithoutBrokersAndTopicsOptions PASSED

kafka.admin.ReassignPartitionsCommandArgsTest > shouldNotAllowThrottleWithVerifyOption STARTED

kafka.admin.ReassignPartitionsCommandArgsTest > shouldNotAllowThrottleWithVerifyOption PASSED

kafka.admin.ReassignPartitionsCommandArgsTest > shouldUseDefaultsIfEnabled STARTED

kafka.admin.ReassignPartitionsCommandArgsTest > shouldUseDefaultsIfEnabled PASSED

kafka.admin.ReassignPartitionsCommandArgsTest > shouldAllowThrottleOptionOnExecute STARTED

kafka.admin.ReassignPartitionsCommandArgsTest > shouldAllowThrottleOptionOnExecute PASSED

kafka.admin.ReassignPartitionsCommandArgsTest > shouldNotAllowExecuteWithBrokers STARTED

kafka.admin.ReassignPartitionsCommandArgsTest > shouldNotAllowExecuteWithBrokers PASSED

kafka.admin.ReassignPartitionsCommandArgsTest > shouldNotAllowExecuteWithTopicsOption STARTED

kafka.admin.ReassignPartitionsCommandArgsTest > shouldNotAllowExecuteWithTopicsOption PASSED

kafka.admin.ReassignPartitionsCommandArgsTest > shouldCorrectlyParseValidMinimumVerifyOptions STARTED

kafka.admin.ReassignPartitionsCommandArgsTest > shouldCorrectlyParseValidMinimumVerifyOptions PASSED

kafka.admin.ReassignPartitionsCommandArgsTest > shouldNotAllowGenerateWithoutTopicsOption STARTED

kafka.admin.ReassignPartitionsCommandArgsTest > shouldNotAllowGenerateWithoutTopicsOption PASSED

kafka.admin.BrokerApiVersionsCommandTest > checkBrokerApiVersionCommandOutput STARTED

kafka.admin.BrokerApiVersionsCommandTest > checkBrokerApiVersionCommandOutput PASSED

kafka.admin.TopicCommandTest > testCreateIfNotExists STARTED

kafka.admin.TopicCommandTest > testCreateIfNotExists PASSED

kafka.admin.TopicCommandTest > testCreateAlterTopicWithRackAware STARTED

kafka.admin.TopicCommandTest > testCreateAlterTopicWithRackAware PASSED

kafka.admin.TopicCommandTest > testTopicDeletion STARTED

kafka.admin.TopicCommandTest > testTopicDeletion PASSED

kafka.admin.TopicCommandTest > testConfigPreservationAcrossPartitionAlteration STARTED

kafka.admin.TopicCommandTest > testConfigPreservationAcrossPartitionAlteration PASSED

kafka.admin.TopicCommandTest > testAlterIfExists STARTED

kafka.admin.TopicCommandTest > testAlterIfExists PASSED

kafka.admin.TopicCommandTest > testDescribeAndListTopicsMarkedForDeletion STARTED

kafka.admin.TopicCommandTest > testDescribeAndListTopicsMarkedForDeletion PASSED

kafka.admin.TopicCommandTest > testDeleteIfExists STARTED

kafka.admin.TopicCommandTest > testDeleteIfExists PASSED

kafka.admin.AdminZkClientTest > testGetBrokerMetadatas STARTED

kafka.admin.AdminZkClientTest > testGetBrokerMetadatas PASSED

kafka.admin.AdminZkClientTest > testBootstrapClientIdConfig STARTED

kafka.admin.AdminZkClientTest > testBootstrapClientIdConfig PASSED

kafka.admin.AdminZkClientTest > testTopicConfigChange STARTED

kafka.admin.AdminZkClientTest > testTopicConfigChange PASSED

kafka.admin.AdminZkClientTest > testManualReplicaAssignment STARTED

kafka.admin.AdminZkClientTest > testManualReplicaAssignment PASSED

kafka.admin.AdminZkClientTest > testConcurrentTopicCreation STARTED

kafka.admin.AdminZkClientTest > testConcurrentTopicCreation PASSED

kafka.admin.AdminZkClientTest > shouldPropagateDynamicBrokerConfigs STARTED

kafka.admin.AdminZkClientTest > shouldPropagateDynamicBrokerConfigs PASSED

kafka.admin.AdminZkClientTest > testTopicCreationWithCollision STARTED

kafka.admin.AdminZkClientTest > testTopicCreationWithCollision PASSED

kafka.admin.AdminZkClientTest > testTopicCreationInZK STARTED

kafka.admin.AdminZkClientTest > testTopicCreationInZK PASSED

unit.kafka.admin.DeleteConsumerGroupTest > testDeleteNonEmptyGroup STARTED

unit.kafka.admin.DeleteConsumerGroupTest > testDeleteNonEmptyGroup PASSED

unit.kafka.admin.DeleteConsumerGroupTest > testDeleteCmdWithMixOfSuccessAndError STARTED

unit.kafka.admin.DeleteConsumerGroupTest > testDeleteCmdWithMixOfSuccessAndError PASSED

unit.kafka.admin.DeleteConsumerGroupTest > testDeleteWithShortInitialization STARTED

unit.kafka.admin.DeleteConsumerGroupTest > testDeleteWithShortInitialization PASSED

unit.kafka.admin.DeleteConsumerGroupTest > testDeleteCmdWithShortInitialization STARTED

unit.kafka.admin.DeleteConsumerGroupTest > testDeleteCmdWithShortInitialization PASSED

unit.kafka.admin.DeleteConsumerGroupTest > testDeleteWithTopicOption STARTED

unit.kafka.admin.DeleteConsumerGroupTest > testDeleteWithTopicOption PASSED

unit.kafka.admin.DeleteConsumerGroupTest > testDeleteNonExistingGroup STARTED

unit.kafka.admin.DeleteConsumerGroupTest > testDeleteNonExistingGroup PASSED

unit.kafka.admin.DeleteConsumerGroupTest > testDeleteCmdNonEmptyGroup STARTED

unit.kafka.admin.DeleteConsumerGroupTest > testDeleteCmdNonEmptyGroup PASSED

unit.kafka.admin.DeleteConsumerGroupTest > testDeleteCmdNonExistingGroup STARTED

unit.kafka.admin.DeleteConsumerGroupTest > testDeleteCmdNonExistingGroup PASSED

unit.kafka.admin.DeleteConsumerGroupTest > testDeleteEmptyGroup STARTED

unit.kafka.admin.DeleteConsumerGroupTest > testDeleteEmptyGroup PASSED

unit.kafka.admin.DeleteConsumerGroupTest > testDeleteWithMixOfSuccessAndError STARTED

unit.kafka.admin.DeleteConsumerGroupTest > testDeleteWithMixOfSuccessAndError PASSED

unit.kafka.admin.DeleteConsumerGroupTest > testDeleteCmdEmptyGroup STARTED

unit.kafka.admin.DeleteConsumerGroupTest > testDeleteCmdEmptyGroup PASSED

1938 tests completed, 1 failed, 5 skipped
:kafka-trunk-jdk8:core:test FAILED
:test_core_2_11 FAILED

FAILURE: Build failed with an exception.

* What went wrong:
Execution failed for task ':kafka-trunk-jdk8:core:test'.
> There were failing tests. See the report at: file://<https://builds.apache.org/job/kafka-trunk-jdk8/ws/core/build/reports/tests/test/index.html>

* Try:
Run with --stacktrace option to get the stack trace. Run with --info or --debug option to get more log output. Run with --scan to get full insights.

* Get more help at https://help.gradle.org

BUILD FAILED in 1h 4m 12s
24 actionable tasks: 3 executed, 21 up-to-date
Build step 'Execute shell' marked build as failure
[FINDBUGS] Collecting findbugs analysis files...
Setting GRADLE_4_4_HOME=/home/jenkins/tools/gradle/4.4
[FINDBUGS] Searching for all files in <https://builds.apache.org/job/kafka-trunk-jdk8/ws/> that match the pattern **/build/reports/findbugs/*.xml
[FINDBUGS] Parsing 1 file in <https://builds.apache.org/job/kafka-trunk-jdk8/ws/>
[FINDBUGS] Successfully parsed file <https://builds.apache.org/job/kafka-trunk-jdk8/ws/core/build/reports/findbugs/main.xml> with 0 unique warnings and 0 duplicates.
Setting GRADLE_4_4_HOME=/home/jenkins/tools/gradle/4.4
Setting GRADLE_4_4_HOME=/home/jenkins/tools/gradle/4.4
<Git Blamer> Using GitBlamer to create author and commit information for all warnings.
<Git Blamer> GIT_COMMIT=55dd97097f51e9e9a687c35afa0cfd38d60a6b45, workspace=<https://builds.apache.org/job/kafka-trunk-jdk8/ws/>
[FINDBUGS] Computing warning deltas based on reference build #2620
Recording test results
Setting GRADLE_4_4_HOME=/home/jenkins/tools/gradle/4.4
Setting GRADLE_4_4_HOME=/home/jenkins/tools/gradle/4.4
Not sending mail to unregistered user wangguoz@gmail.com
Not sending mail to unregistered user github@alasdairhodge.co.uk