You are viewing a plain text version of this content. The canonical link for it is here.
Posted to builds@beam.apache.org by Apache Jenkins Server <je...@builds.apache.org> on 2019/10/18 07:14:17 UTC
Build failed in Jenkins: beam_PerformanceTests_ManyFiles_TextIOIT
#1110
See <https://builds.apache.org/job/beam_PerformanceTests_ManyFiles_TextIOIT/1110/display/redirect>
Changes:
------------------------------------------
[...truncated 218.46 KB...]
Task ':sdks:java:io:xml:testJar' is not up-to-date because:
No history is available.
:sdks:java:io:xml:testJar (Thread[Execution worker for ':' Thread 9,5,main]) completed. Took 0.011 secs.
> Task :sdks:java:extensions:google-cloud-platform-core:compileTestJava FROM-CACHE
Build cache key for task ':sdks:java:extensions:google-cloud-platform-core:compileTestJava' is b1e5328d5fdc5422681a85bc37b4486e
Task ':sdks:java:extensions:google-cloud-platform-core:compileTestJava' is not up-to-date because:
No history is available.
Origin for org.gradle.api.internal.tasks.execution.ExecuteActionsTaskExecuter$TaskExecution@53c4dbcb: {executionTime=7459, hostName=apache-beam-jenkins-4, operatingSystem=Linux, buildInvocationId=ndhpmx5cx5adddczm4nuu5ph5y, creationTime=1570833066451, identity=:sdks:java:extensions:google-cloud-platform-core:compileTestJava, type=org.gradle.api.internal.tasks.execution.ExecuteActionsTaskExecuter.TaskExecution, userName=jenkins, gradleVersion=5.2.1, rootPath=/home/jenkins/jenkins-slave/workspace/beam_PostCommit_Java/src}
Unpacked trees for task ':sdks:java:extensions:google-cloud-platform-core:compileTestJava' from cache.
:sdks:java:extensions:google-cloud-platform-core:compileTestJava (Thread[Execution worker for ':' Thread 8,5,main]) completed. Took 0.39 secs.
:sdks:java:io:file-based-io-tests:compileTestJava (Thread[Execution worker for ':' Thread 9,5,main]) started.
:sdks:java:extensions:google-cloud-platform-core:testClasses (Thread[Execution worker for ':' Thread 8,5,main]) started.
> Task :sdks:java:extensions:google-cloud-platform-core:testClasses UP-TO-DATE
Skipping task ':sdks:java:extensions:google-cloud-platform-core:testClasses' as it has no actions.
:sdks:java:extensions:google-cloud-platform-core:testClasses (Thread[Execution worker for ':' Thread 8,5,main]) completed. Took 0.0 secs.
:sdks:java:extensions:google-cloud-platform-core:testJar (Thread[Execution worker for ':' Thread 8,5,main]) started.
> Task :sdks:java:extensions:google-cloud-platform-core:testJar
Build cache key for task ':sdks:java:extensions:google-cloud-platform-core:testJar' is c2665386849a33a7fb04bd7cbaeccb62
Caching disabled for task ':sdks:java:extensions:google-cloud-platform-core:testJar': Caching has not been enabled for the task
Task ':sdks:java:extensions:google-cloud-platform-core:testJar' is not up-to-date because:
No history is available.
:sdks:java:extensions:google-cloud-platform-core:testJar (Thread[Execution worker for ':' Thread 8,5,main]) completed. Took 0.015 secs.
> Task :sdks:java:io:file-based-io-tests:compileTestJava FROM-CACHE
Build cache key for task ':sdks:java:io:file-based-io-tests:compileTestJava' is e38b7375db48eb10f398489f403ce1af
Task ':sdks:java:io:file-based-io-tests:compileTestJava' is not up-to-date because:
No history is available.
Origin for org.gradle.api.internal.tasks.execution.ExecuteActionsTaskExecuter$TaskExecution@2201956e: {executionTime=13379, hostName=apache-beam-jenkins-4, operatingSystem=Linux, buildInvocationId=jnd3mhj665aqhpcyplt23iqcw4, creationTime=1571320026205, identity=:sdks:java:io:file-based-io-tests:compileTestJava, type=org.gradle.api.internal.tasks.execution.ExecuteActionsTaskExecuter.TaskExecution, userName=jenkins, gradleVersion=5.2.1, rootPath=/home/jenkins/jenkins-slave/workspace/beam_PerformanceTests_XmlIOIT/src}
Unpacked trees for task ':sdks:java:io:file-based-io-tests:compileTestJava' from cache.
:sdks:java:io:file-based-io-tests:compileTestJava (Thread[Execution worker for ':' Thread 9,5,main]) completed. Took 0.096 secs.
:sdks:java:io:file-based-io-tests:testClasses (Thread[Execution worker for ':' Thread 9,5,main]) started.
> Task :sdks:java:io:file-based-io-tests:testClasses UP-TO-DATE
Skipping task ':sdks:java:io:file-based-io-tests:testClasses' as it has no actions.
:sdks:java:io:file-based-io-tests:testClasses (Thread[Execution worker for ':' Thread 9,5,main]) completed. Took 0.0 secs.
> Task :sdks:java:harness:shadowJar
*******************
GRADLE SHADOW STATS
Total Jars: 49 (includes project)
Total Time: 7.143s [7143ms]
Average Time/Jar: 0.14577551020409998s [145.7755102041ms]
*******************
:sdks:java:harness:shadowJar (Thread[Execution worker for ':' Thread 4,5,main]) completed. Took 7.548 secs.
:runners:java-fn-execution:compileJava (Thread[Execution worker for ':' Thread 4,5,main]) started.
> Task :runners:java-fn-execution:compileJava
Invalidating in-memory cache of /home/jenkins/.gradle/caches/5.2.1/fileHashes/fileHashes.bin
Invalidating in-memory cache of /home/jenkins/.gradle/caches/5.2.1/fileHashes/resourceHashesCache.bin
Invalidating in-memory cache of /home/jenkins/.gradle/caches/5.2.1/fileHashes/fileHashes.bin
Invalidating in-memory cache of /home/jenkins/.gradle/caches/5.2.1/fileHashes/resourceHashesCache.bin
Build cache key for task ':runners:java-fn-execution:compileJava' is 7da468ab49e684ac20783c029a210a68
Task ':runners:java-fn-execution:compileJava' is not up-to-date because:
No history is available.
Invalidating in-memory cache of /home/jenkins/.gradle/caches/journal-1/file-access.bin
Origin for org.gradle.api.internal.tasks.execution.ExecuteActionsTaskExecuter$TaskExecution@554108a1: {executionTime=13210, hostName=apache-beam-jenkins-4, operatingSystem=Linux, buildInvocationId=f6327e26h5gnrf3sbfio7ydexm, creationTime=1571085125650, identity=:runners:java-fn-execution:compileJava, type=org.gradle.api.internal.tasks.execution.ExecuteActionsTaskExecuter.TaskExecution, userName=jenkins, gradleVersion=5.2.1, rootPath=/home/jenkins/jenkins-slave/workspace/beam_PreCommit_Python2_PVR_Flink_Commit/src}
Unpacked trees for task ':runners:java-fn-execution:compileJava' from cache.
> Task :runners:java-fn-execution:compileJava FROM-CACHE
:runners:java-fn-execution:compileJava (Thread[Execution worker for ':' Thread 4,5,main]) completed. Took 2.254 secs.
:runners:java-fn-execution:classes (Thread[Execution worker for ':' Thread 4,5,main]) started.
> Task :runners:java-fn-execution:classes UP-TO-DATE
Skipping task ':runners:java-fn-execution:classes' as it has no actions.
:runners:java-fn-execution:classes (Thread[Execution worker for ':' Thread 4,5,main]) completed. Took 0.0 secs.
:runners:java-fn-execution:jar (Thread[Execution worker for ':' Thread 2,5,main]) started.
> Task :runners:java-fn-execution:jar
Build cache key for task ':runners:java-fn-execution:jar' is 3135bf2885ba02b762ef47edf4552911
Caching disabled for task ':runners:java-fn-execution:jar': Caching has not been enabled for the task
Task ':runners:java-fn-execution:jar' is not up-to-date because:
No history is available.
:runners:java-fn-execution:jar (Thread[Execution worker for ':' Thread 2,5,main]) completed. Took 0.043 secs.
:runners:direct-java:compileJava (Thread[Execution worker for ':' Thread 2,5,main]) started.
:runners:google-cloud-dataflow-java:worker:legacy-worker:compileJava (Thread[Execution worker for ':' Thread 9,5,main]) started.
> Task :runners:direct-java:compileJava FROM-CACHE
Build cache key for task ':runners:direct-java:compileJava' is 0f85912b5256f6c7e7e19e17f45732da
Task ':runners:direct-java:compileJava' is not up-to-date because:
No history is available.
Origin for org.gradle.api.internal.tasks.execution.ExecuteActionsTaskExecuter$TaskExecution@4cf60b3e: {executionTime=9730, hostName=apache-beam-jenkins-4, operatingSystem=Linux, buildInvocationId=afstfwwshndudg2i6anydf7h5m, creationTime=1571086046086, identity=:runners:direct-java:compileJava, type=org.gradle.api.internal.tasks.execution.ExecuteActionsTaskExecuter.TaskExecution, userName=jenkins, gradleVersion=5.2.1, rootPath=/home/jenkins/jenkins-slave/workspace/beam_PostCommit_Java_PortabilityApi/src}
Unpacked trees for task ':runners:direct-java:compileJava' from cache.
:runners:direct-java:compileJava (Thread[Execution worker for ':' Thread 2,5,main]) completed. Took 0.086 secs.
:runners:direct-java:classes (Thread[Execution worker for ':' Thread 2,5,main]) started.
> Task :runners:direct-java:classes UP-TO-DATE
Skipping task ':runners:direct-java:classes' as it has no actions.
:runners:direct-java:classes (Thread[Execution worker for ':' Thread 2,5,main]) completed. Took 0.0 secs.
:runners:direct-java:shadowJar (Thread[Execution worker for ':' Thread 2,5,main]) started.
> Task :runners:google-cloud-dataflow-java:worker:legacy-worker:compileJava FROM-CACHE
file or directory '<https://builds.apache.org/job/beam_PerformanceTests_ManyFiles_TextIOIT/ws/src/runners/google-cloud-dataflow-java/worker/legacy-worker/src/main/java',> not found
Build cache key for task ':runners:google-cloud-dataflow-java:worker:legacy-worker:compileJava' is a98f80b5354bb650212cbab96d38f48e
Task ':runners:google-cloud-dataflow-java:worker:legacy-worker:compileJava' is not up-to-date because:
No history is available.
Origin for org.gradle.api.internal.tasks.execution.ExecuteActionsTaskExecuter$TaskExecution@6e129420: {executionTime=20677, hostName=apache-beam-jenkins-4, operatingSystem=Linux, buildInvocationId=cz2ovxj6rffs5pejvxxdea4ena, creationTime=1571099757715, identity=:runners:google-cloud-dataflow-java:worker:legacy-worker:compileJava, type=org.gradle.api.internal.tasks.execution.ExecuteActionsTaskExecuter.TaskExecution, userName=jenkins, gradleVersion=5.2.1, rootPath=/home/jenkins/jenkins-slave/workspace/beam_PerformanceTests_TextIOIT/src}
Unpacked trees for task ':runners:google-cloud-dataflow-java:worker:legacy-worker:compileJava' from cache.
:runners:google-cloud-dataflow-java:worker:legacy-worker:compileJava (Thread[Execution worker for ':' Thread 9,5,main]) completed. Took 0.303 secs.
:runners:google-cloud-dataflow-java:worker:legacy-worker:classes (Thread[Execution worker for ':' Thread 9,5,main]) started.
> Task :runners:google-cloud-dataflow-java:worker:legacy-worker:classes UP-TO-DATE
Skipping task ':runners:google-cloud-dataflow-java:worker:legacy-worker:classes' as it has no actions.
:runners:google-cloud-dataflow-java:worker:legacy-worker:classes (Thread[Execution worker for ':' Thread 9,5,main]) completed. Took 0.0 secs.
:runners:google-cloud-dataflow-java:worker:legacy-worker:shadowJar (Thread[Execution worker for ':' Thread 9,5,main]) started.
> Task :runners:direct-java:shadowJar
Build cache key for task ':runners:direct-java:shadowJar' is b37062fad818bd509e7d4a65cda55f88
Caching disabled for task ':runners:direct-java:shadowJar': Caching has not been enabled for the task
Task ':runners:direct-java:shadowJar' is not up-to-date because:
No history is available.
Custom actions are attached to task ':runners:direct-java:shadowJar'.
*******************
GRADLE SHADOW STATS
Total Jars: 6 (includes project)
Total Time: 0.632s [632ms]
Average Time/Jar: 0.1053333333333s [105.3333333333ms]
*******************
:runners:direct-java:shadowJar (Thread[Execution worker for ':' Thread 2,5,main]) completed. Took 0.878 secs.
:sdks:java:io:google-cloud-platform:compileTestJava (Thread[Execution worker for ':' Thread 2,5,main]) started.
> Task :sdks:java:io:google-cloud-platform:compileTestJava FROM-CACHE
Invalidating in-memory cache of /home/jenkins/.gradle/caches/journal-1/file-access.bin
Invalidating in-memory cache of /home/jenkins/.gradle/caches/5.2.1/fileHashes/fileHashes.bin
Invalidating in-memory cache of /home/jenkins/.gradle/caches/5.2.1/fileHashes/resourceHashesCache.bin
Build cache key for task ':sdks:java:io:google-cloud-platform:compileTestJava' is 1c48cad2cd900ad87f03a717e45cf5d5
Task ':sdks:java:io:google-cloud-platform:compileTestJava' is not up-to-date because:
No history is available.
Origin for org.gradle.api.internal.tasks.execution.ExecuteActionsTaskExecuter$TaskExecution@5ce9c008: {executionTime=12401, hostName=apache-beam-jenkins-4, operatingSystem=Linux, buildInvocationId=afstfwwshndudg2i6anydf7h5m, creationTime=1571086059537, identity=:sdks:java:io:google-cloud-platform:compileTestJava, type=org.gradle.api.internal.tasks.execution.ExecuteActionsTaskExecuter.TaskExecution, userName=jenkins, gradleVersion=5.2.1, rootPath=/home/jenkins/jenkins-slave/workspace/beam_PostCommit_Java_PortabilityApi/src}
Unpacked trees for task ':sdks:java:io:google-cloud-platform:compileTestJava' from cache.
:sdks:java:io:google-cloud-platform:compileTestJava (Thread[Execution worker for ':' Thread 2,5,main]) completed. Took 0.305 secs.
:sdks:java:io:google-cloud-platform:testClasses (Thread[Execution worker for ':' Thread 2,5,main]) started.
> Task :sdks:java:io:google-cloud-platform:testClasses UP-TO-DATE
Skipping task ':sdks:java:io:google-cloud-platform:testClasses' as it has no actions.
:sdks:java:io:google-cloud-platform:testClasses (Thread[Execution worker for ':' Thread 2,5,main]) completed. Took 0.0 secs.
:sdks:java:io:google-cloud-platform:testJar (Thread[Execution worker for ':' Thread 2,5,main]) started.
> Task :sdks:java:io:google-cloud-platform:testJar
Build cache key for task ':sdks:java:io:google-cloud-platform:testJar' is e95ada9849b02e400e7f63862d37d014
Caching disabled for task ':sdks:java:io:google-cloud-platform:testJar': Caching has not been enabled for the task
Task ':sdks:java:io:google-cloud-platform:testJar' is not up-to-date because:
No history is available.
:sdks:java:io:google-cloud-platform:testJar (Thread[Execution worker for ':' Thread 2,5,main]) completed. Took 0.054 secs.
:runners:google-cloud-dataflow-java:compileTestJava (Thread[Execution worker for ':' Thread 2,5,main]) started.
> Task :runners:google-cloud-dataflow-java:compileTestJava FROM-CACHE
Build cache key for task ':runners:google-cloud-dataflow-java:compileTestJava' is a23b8606bf927376a88f6b82cd321e15
Task ':runners:google-cloud-dataflow-java:compileTestJava' is not up-to-date because:
No history is available.
Origin for org.gradle.api.internal.tasks.execution.ExecuteActionsTaskExecuter$TaskExecution@65457e0e: {executionTime=13299, hostName=apache-beam-jenkins-4, operatingSystem=Linux, buildInvocationId=cz2ovxj6rffs5pejvxxdea4ena, creationTime=1571099752377, identity=:runners:google-cloud-dataflow-java:compileTestJava, type=org.gradle.api.internal.tasks.execution.ExecuteActionsTaskExecuter.TaskExecution, userName=jenkins, gradleVersion=5.2.1, rootPath=/home/jenkins/jenkins-slave/workspace/beam_PerformanceTests_TextIOIT/src}
Unpacked trees for task ':runners:google-cloud-dataflow-java:compileTestJava' from cache.
:runners:google-cloud-dataflow-java:compileTestJava (Thread[Execution worker for ':' Thread 2,5,main]) completed. Took 0.129 secs.
:runners:google-cloud-dataflow-java:testClasses (Thread[Execution worker for ':' Thread 2,5,main]) started.
> Task :runners:google-cloud-dataflow-java:testClasses UP-TO-DATE
Skipping task ':runners:google-cloud-dataflow-java:testClasses' as it has no actions.
:runners:google-cloud-dataflow-java:testClasses (Thread[Execution worker for ':' Thread 2,5,main]) completed. Took 0.0 secs.
:runners:google-cloud-dataflow-java:testJar (Thread[Execution worker for ':' Thread 2,5,main]) started.
> Task :runners:google-cloud-dataflow-java:testJar
Build cache key for task ':runners:google-cloud-dataflow-java:testJar' is f1fc7f80f9f70219397bf88edc5dd6aa
Caching disabled for task ':runners:google-cloud-dataflow-java:testJar': Caching has not been enabled for the task
Task ':runners:google-cloud-dataflow-java:testJar' is not up-to-date because:
No history is available.
:runners:google-cloud-dataflow-java:testJar (Thread[Execution worker for ':' Thread 2,5,main]) completed. Took 0.024 secs.
> Task :runners:google-cloud-dataflow-java:worker:legacy-worker:shadowJar
Build cache key for task ':runners:google-cloud-dataflow-java:worker:legacy-worker:shadowJar' is c415c0e1b50b0912df7521a1876e28d1
Caching disabled for task ':runners:google-cloud-dataflow-java:worker:legacy-worker:shadowJar': Caching has not been enabled for the task
Task ':runners:google-cloud-dataflow-java:worker:legacy-worker:shadowJar' is not up-to-date because:
No history is available.
Custom actions are attached to task ':runners:google-cloud-dataflow-java:worker:legacy-worker:shadowJar'.
*******************
GRADLE SHADOW STATS
Total Jars: 16 (includes project)
Total Time: 3.232s [3232ms]
Average Time/Jar: 0.202s [202.0ms]
*******************
:runners:google-cloud-dataflow-java:worker:legacy-worker:shadowJar (Thread[Execution worker for ':' Thread 9,5,main]) completed. Took 4.105 secs.
:sdks:java:io:file-based-io-tests:integrationTest (Thread[Execution worker for ':' Thread 9,5,main]) started.
Gradle Test Executor 1 started executing tests.
> Task :sdks:java:io:file-based-io-tests:integrationTest
Invalidating in-memory cache of /home/jenkins/.gradle/caches/journal-1/file-access.bin
Invalidating in-memory cache of /home/jenkins/.gradle/caches/5.2.1/fileHashes/fileHashes.bin
Invalidating in-memory cache of /home/jenkins/.gradle/caches/5.2.1/fileHashes/resourceHashesCache.bin
Build cache key for task ':sdks:java:io:file-based-io-tests:integrationTest' is 7eb7aefb62d1591f49935939e99f6eab
Task ':sdks:java:io:file-based-io-tests:integrationTest' is not up-to-date because:
Task.upToDateWhen is false.
Custom actions are attached to task ':sdks:java:io:file-based-io-tests:integrationTest'.
Starting process 'Gradle Test Executor 1'. Working directory: <https://builds.apache.org/job/beam_PerformanceTests_ManyFiles_TextIOIT/ws/src/sdks/java/io/file-based-io-tests> Command: /usr/lib/jvm/java-8-openjdk-amd64/bin/java -DbeamTestPipelineOptions=["--runner=DataflowRunner","--project=apache-beam-testing","--tempRoot=gs://temp-storage-for-perf-tests","--filenamePrefix=gs://temp-storage-for-perf-tests/beam_PerformanceTests_ManyFiles_TextIOIT/1110/","--bigQueryDataset=beam_performance","--bigQueryTable=many_files_textioit_results","--reportGcsPerformanceMetrics=true","--gcsPerformanceMetrics=true","--numberOfRecords=1000000","--numberOfShards=1000","--numWorkers=5","--autoscalingAlgorithm=NONE","--workerHarnessContainerImage=","--dataflowWorkerJar=${dataflowWorkerJar}"] -Djava.security.manager=worker.org.gradle.process.internal.worker.child.BootstrapSecurityManager -Dorg.gradle.native=false -Xmx2g -Dfile.encoding=UTF-8 -Duser.country=US -Duser.language=en -Duser.variant -ea -cp /home/jenkins/.gradle/caches/5.2.1/workerMain/gradle-worker.jar worker.org.gradle.process.internal.worker.GradleWorkerMain 'Gradle Test Executor 1'
Successfully started process 'Gradle Test Executor 1'
org.apache.beam.sdk.io.text.TextIOIT STANDARD_ERROR
SLF4J: Class path contains multiple SLF4J bindings.
SLF4J: Found binding in [jar:<https://builds.apache.org/job/beam_PerformanceTests_ManyFiles_TextIOIT/ws/src/runners/google-cloud-dataflow-java/worker/legacy-worker/build/libs/beam-runners-google-cloud-dataflow-java-legacy-worker-2.17.0-SNAPSHOT.jar!/org/slf4j/impl/StaticLoggerBinder.class]>
SLF4J: Found binding in [jar:file:/home/jenkins/.gradle/caches/modules-2/files-2.1/org.slf4j/slf4j-jdk14/1.7.25/bccda40ebc8067491b32a88f49615a747d20082d/slf4j-jdk14-1.7.25.jar!/org/slf4j/impl/StaticLoggerBinder.class]
SLF4J: Found binding in [jar:file:/home/jenkins/.gradle/caches/modules-2/files-2.1/org.slf4j/slf4j-log4j12/1.7.25/110cefe2df103412849d72ef7a67e4e91e4266b4/slf4j-log4j12-1.7.25.jar!/org/slf4j/impl/StaticLoggerBinder.class]
SLF4J: See http://www.slf4j.org/codes.html#multiple_bindings for an explanation.
SLF4J: Actual binding is of type [org.slf4j.impl.JDK14LoggerFactory]
Gradle Test Executor 1 finished executing tests.
> Task :sdks:java:io:file-based-io-tests:integrationTest FAILED
org.apache.beam.sdk.io.text.TextIOIT > classMethod FAILED
java.lang.IllegalArgumentException: Missing required value for [public abstract java.lang.String org.apache.beam.sdk.io.common.FileBasedIOTestPipelineOptions.getExpectedHash(), "Precomputed hashcode to assert IO test pipeline content identity after writing and reading back the dataset"].
at org.apache.beam.vendor.guava.v26_0_jre.com.google.common.base.Preconditions.checkArgument(Preconditions.java:440)
at org.apache.beam.sdk.options.PipelineOptionsValidator.validate(PipelineOptionsValidator.java:96)
at org.apache.beam.sdk.options.PipelineOptionsValidator.validate(PipelineOptionsValidator.java:47)
at org.apache.beam.sdk.io.common.IOITHelper.readIOTestPipelineOptions(IOITHelper.java:50)
at org.apache.beam.sdk.io.common.FileBasedIOITHelper.readFileBasedIOITPipelineOptions(FileBasedIOITHelper.java:37)
at org.apache.beam.sdk.io.text.TextIOIT.setup(TextIOIT.java:97)
1 test completed, 1 failed
Finished generating test XML results (0.018 secs) into: <https://builds.apache.org/job/beam_PerformanceTests_ManyFiles_TextIOIT/ws/src/sdks/java/io/file-based-io-tests/build/test-results/integrationTest>
Generating HTML test report...
Finished generating test html results (0.029 secs) into: <https://builds.apache.org/job/beam_PerformanceTests_ManyFiles_TextIOIT/ws/src/sdks/java/io/file-based-io-tests/build/reports/tests/integrationTest>
:sdks:java:io:file-based-io-tests:integrationTest (Thread[Execution worker for ':' Thread 9,5,main]) completed. Took 3.572 secs.
FAILURE: Build failed with an exception.
* What went wrong:
Execution failed for task ':sdks:java:io:file-based-io-tests:integrationTest'.
> There were failing tests. See the report at: file://<https://builds.apache.org/job/beam_PerformanceTests_ManyFiles_TextIOIT/ws/src/sdks/java/io/file-based-io-tests/build/reports/tests/integrationTest/index.html>
* Try:
Run with --stacktrace option to get the stack trace. Run with --debug option to get more log output. Run with --scan to get full insights.
* Get more help at https://help.gradle.org
Deprecated Gradle features were used in this build, making it incompatible with Gradle 6.0.
Use '--warning-mode all' to show the individual deprecation warnings.
See https://docs.gradle.org/5.2.1/userguide/command_line_interface.html#sec:command_line_warnings
BUILD FAILED in 51s
86 actionable tasks: 55 executed, 31 from cache
Publishing build scan...
https://gradle.com/s/7qomegkqnnukk
Build step 'Invoke Gradle script' changed build result to FAILURE
Build step 'Invoke Gradle script' marked build as failure
---------------------------------------------------------------------
To unsubscribe, e-mail: builds-unsubscribe@beam.apache.org
For additional commands, e-mail: builds-help@beam.apache.org