You are viewing a plain text version of this content. The canonical link for it is here.
Posted to issues@camel.apache.org by "Claus Ibsen (JIRA)" <ji...@apache.org> on 2012/11/08 10:34:12 UTC
[jira] [Created] (CAMEL-5779) Fix the tests/camel-itest-karaf -
Which has a number of features not installing correctly in the new Karaf
2.3.0 container
Claus Ibsen created CAMEL-5779:
----------------------------------
Summary: Fix the tests/camel-itest-karaf - Which has a number of features not installing correctly in the new Karaf 2.3.0 container
Key: CAMEL-5779
URL: https://issues.apache.org/jira/browse/CAMEL-5779
Project: Camel
Issue Type: Test
Components: osgi, tests
Affects Versions: 2.11.0
Reporter: Claus Ibsen
Assignee: Claus Ibsen
Fix For: 2.11.0
Running org.apache.camel.itest.karaf.CamelCryptoTest
Tests run: 1, Failures: 0, Errors: 1, Skipped: 0, Time elapsed: 181.314 sec <<< FAILURE!
Running org.apache.camel.itest.karaf.CamelHbaseTest
Tests run: 1, Failures: 1, Errors: 0, Skipped: 0, Time elapsed: 19.865 sec <<< FAILURE!
Running org.apache.camel.itest.karaf.CamelJcloudsTest
Tests run: 1, Failures: 0, Errors: 1, Skipped: 0, Time elapsed: 181.895 sec <<< FAILURE!
--
This message is automatically generated by JIRA.
If you think it was sent incorrectly, please contact your JIRA administrators
For more information on JIRA, see: http://www.atlassian.com/software/jira
[jira] [Commented] (CAMEL-5779) Fix the tests/camel-itest-karaf -
Which has a number of features not installing correctly in the new Karaf
2.3.0 container
Posted by "Claus Ibsen (JIRA)" <ji...@apache.org>.
[ https://issues.apache.org/jira/browse/CAMEL-5779?page=com.atlassian.jira.plugin.system.issuetabpanels:comment-tabpanel&focusedCommentId=13493072#comment-13493072 ]
Claus Ibsen commented on CAMEL-5779:
------------------------------------
Running org.apache.camel.itest.karaf.CamelXmppTest
Tests run: 1, Failures: 0, Errors: 1, Skipped: 0, Time elapsed: 181.378 sec <<< FAILURE!
> Fix the tests/camel-itest-karaf - Which has a number of features not installing correctly in the new Karaf 2.3.0 container
> --------------------------------------------------------------------------------------------------------------------------
>
> Key: CAMEL-5779
> URL: https://issues.apache.org/jira/browse/CAMEL-5779
> Project: Camel
> Issue Type: Test
> Components: osgi, tests
> Affects Versions: 2.11.0
> Reporter: Claus Ibsen
> Assignee: Claus Ibsen
> Fix For: 2.11.0
>
>
> Running org.apache.camel.itest.karaf.CamelCryptoTest
> Tests run: 1, Failures: 0, Errors: 1, Skipped: 0, Time elapsed: 181.314 sec <<< FAILURE!
> Running org.apache.camel.itest.karaf.CamelHbaseTest
> Tests run: 1, Failures: 1, Errors: 0, Skipped: 0, Time elapsed: 19.865 sec <<< FAILURE!
> Running org.apache.camel.itest.karaf.CamelJcloudsTest
> Tests run: 1, Failures: 0, Errors: 1, Skipped: 0, Time elapsed: 181.895 sec <<< FAILURE!
--
This message is automatically generated by JIRA.
If you think it was sent incorrectly, please contact your JIRA administrators
For more information on JIRA, see: http://www.atlassian.com/software/jira
[jira] [Commented] (CAMEL-5779) Fix the tests/camel-itest-karaf -
Which has a number of features not installing correctly in the new Karaf
2.3.0 container
Posted by "Claus Ibsen (JIRA)" <ji...@apache.org>.
[ https://issues.apache.org/jira/browse/CAMEL-5779?page=com.atlassian.jira.plugin.system.issuetabpanels:comment-tabpanel&focusedCommentId=13493235#comment-13493235 ]
Claus Ibsen commented on CAMEL-5779:
------------------------------------
Fixed the hbase test
> Fix the tests/camel-itest-karaf - Which has a number of features not installing correctly in the new Karaf 2.3.0 container
> --------------------------------------------------------------------------------------------------------------------------
>
> Key: CAMEL-5779
> URL: https://issues.apache.org/jira/browse/CAMEL-5779
> Project: Camel
> Issue Type: Test
> Components: osgi, tests
> Affects Versions: 2.11.0
> Reporter: Claus Ibsen
> Fix For: 2.11.0
>
>
> Running org.apache.camel.itest.karaf.CamelCryptoTest
> Tests run: 1, Failures: 0, Errors: 1, Skipped: 0, Time elapsed: 181.314 sec <<< FAILURE!
> Running org.apache.camel.itest.karaf.CamelHbaseTest
> Tests run: 1, Failures: 1, Errors: 0, Skipped: 0, Time elapsed: 19.865 sec <<< FAILURE!
> Running org.apache.camel.itest.karaf.CamelJcloudsTest
> Tests run: 1, Failures: 0, Errors: 1, Skipped: 0, Time elapsed: 181.895 sec <<< FAILURE!
--
This message is automatically generated by JIRA.
If you think it was sent incorrectly, please contact your JIRA administrators
For more information on JIRA, see: http://www.atlassian.com/software/jira
[jira] [Assigned] (CAMEL-5779) Fix the tests/camel-itest-karaf -
Which has a number of features not installing correctly in the new Karaf
2.3.0 container
Posted by "Claus Ibsen (JIRA)" <ji...@apache.org>.
[ https://issues.apache.org/jira/browse/CAMEL-5779?page=com.atlassian.jira.plugin.system.issuetabpanels:all-tabpanel ]
Claus Ibsen reassigned CAMEL-5779:
----------------------------------
Assignee: (was: Claus Ibsen)
> Fix the tests/camel-itest-karaf - Which has a number of features not installing correctly in the new Karaf 2.3.0 container
> --------------------------------------------------------------------------------------------------------------------------
>
> Key: CAMEL-5779
> URL: https://issues.apache.org/jira/browse/CAMEL-5779
> Project: Camel
> Issue Type: Test
> Components: osgi, tests
> Affects Versions: 2.11.0
> Reporter: Claus Ibsen
> Fix For: 2.11.0
>
>
> Running org.apache.camel.itest.karaf.CamelCryptoTest
> Tests run: 1, Failures: 0, Errors: 1, Skipped: 0, Time elapsed: 181.314 sec <<< FAILURE!
> Running org.apache.camel.itest.karaf.CamelHbaseTest
> Tests run: 1, Failures: 1, Errors: 0, Skipped: 0, Time elapsed: 19.865 sec <<< FAILURE!
> Running org.apache.camel.itest.karaf.CamelJcloudsTest
> Tests run: 1, Failures: 0, Errors: 1, Skipped: 0, Time elapsed: 181.895 sec <<< FAILURE!
--
This message is automatically generated by JIRA.
If you think it was sent incorrectly, please contact your JIRA administrators
For more information on JIRA, see: http://www.atlassian.com/software/jira
[jira] [Commented] (CAMEL-5779) Fix the tests/camel-itest-karaf -
Which has a number of features not installing correctly in the new Karaf
2.3.0 container
Posted by "Claus Ibsen (JIRA)" <ji...@apache.org>.
[ https://issues.apache.org/jira/browse/CAMEL-5779?page=com.atlassian.jira.plugin.system.issuetabpanels:comment-tabpanel&focusedCommentId=13493159#comment-13493159 ]
Claus Ibsen commented on CAMEL-5779:
------------------------------------
Nothing obvious in the logs why these tests fails.
> Fix the tests/camel-itest-karaf - Which has a number of features not installing correctly in the new Karaf 2.3.0 container
> --------------------------------------------------------------------------------------------------------------------------
>
> Key: CAMEL-5779
> URL: https://issues.apache.org/jira/browse/CAMEL-5779
> Project: Camel
> Issue Type: Test
> Components: osgi, tests
> Affects Versions: 2.11.0
> Reporter: Claus Ibsen
> Assignee: Claus Ibsen
> Fix For: 2.11.0
>
>
> Running org.apache.camel.itest.karaf.CamelCryptoTest
> Tests run: 1, Failures: 0, Errors: 1, Skipped: 0, Time elapsed: 181.314 sec <<< FAILURE!
> Running org.apache.camel.itest.karaf.CamelHbaseTest
> Tests run: 1, Failures: 1, Errors: 0, Skipped: 0, Time elapsed: 19.865 sec <<< FAILURE!
> Running org.apache.camel.itest.karaf.CamelJcloudsTest
> Tests run: 1, Failures: 0, Errors: 1, Skipped: 0, Time elapsed: 181.895 sec <<< FAILURE!
--
This message is automatically generated by JIRA.
If you think it was sent incorrectly, please contact your JIRA administrators
For more information on JIRA, see: http://www.atlassian.com/software/jira