You are viewing a plain text version of this content. The canonical link for it is here.
Posted to builds@beam.apache.org by Apache Jenkins Server <je...@builds.apache.org> on 2023/08/29 05:12:45 UTC
Build failed in Jenkins: beam_PostCommit_XVR_Direct #4532
See <https://ci-beam.apache.org/job/beam_PostCommit_XVR_Direct/4532/display/redirect>
Changes:
------------------------------------------
[...truncated 175.00 KB...]
Created wheel for apache-beam: filename=apache_beam-2.51.0.dev0-py3-none-any.whl size=3282927 sha256=7bc7dec69e6cc1520bd4a086949bc58e3130ab871c72e578a6cbacd46aaed4f2
Stored in directory: /home/jenkins/.cache/pip/wheels/c0/01/10/5a028b724cdf5b5d2643067a82afc4660de8e5639d060da291
Successfully built apache-beam
Installing collected packages: sortedcontainers, pytz, docopt, crcmod, zstandard, wrapt, websocket-client, urllib3, threadpoolctl, tenacity, sqlparse, six, shapely, scipy, regex, pyyaml, pyparsing, pymysql, PyJWT, pyhamcrest, pycparser, pyasn1, pyarrow, psycopg2-binary, protobuf, portalocker, parameterized, overrides, orjson, objsize, mock, joblib, jmespath, iniconfig, idna, greenlet, google-crc32c, fasteners, fastavro, execnet, exceptiongroup, dnspython, dill, deprecation, cloudpickle, charset-normalizer, certifi, attrs, sqlalchemy, scikit-learn, rsa, requests, python-dateutil, pytest, pymongo, pydot, pyasn1-modules, proto-plus, isodate, hypothesis, httplib2, googleapis-common-protos, google-resumable-media, cffi, requests_mock, pytest-xdist, pytest-timeout, pandas, oauth2client, hdfs, grpcio-status, google-auth, freezegun, docker, cryptography, botocore, azure-core, testcontainers, s3transfer, grpc-google-iam-v1, google-auth-httplib2, google-apitools, google-api-core, azure-storage-blob, apache-beam, msal, google-cloud-core, boto3, msal-extensions, google-cloud-vision, google-cloud-videointelligence, google-cloud-storage, google-cloud-spanner, google-cloud-resource-manager, google-cloud-recommendations-ai, google-cloud-pubsub, google-cloud-language, google-cloud-dlp, google-cloud-datastore, google-cloud-bigtable, google-cloud-bigquery-storage, google-cloud-bigquery, google-cloud-pubsublite, google-cloud-aiplatform, azure-identity
> Task :release:go-licenses:go:createLicenses
> Task :sdks:go:container:copyGolangLicenses
> Task :sdks:go:container:dockerPrepare
> Task :sdks:java:container:java8:dockerPrepare
> Task :sdks:python:container:py38:docker
#1 [internal] load build definition from Dockerfile
#1 transferring dockerfile: 4.99kB done
#1 DONE 0.0s
#2 [internal] load .dockerignore
#2 transferring context: 2B done
#2 DONE 0.0s
#3 [internal] load metadata for docker.io/library/python:3.8-bullseye
#3 DONE 0.4s
#4 [beam 1/5] FROM docker.io/library/python:3.8-bullseye@sha256:7482ccf7b8ad5e5ada830a315d051b166d83f84c281e76508762505cf929c385
#4 CACHED
#5 [internal] load build context
#5 transferring context: 2.43MB 0.0s done
#5 DONE 0.0s
#6 [beam 3/5] COPY target/apache-beam.tar.gz /opt/apache/beam/tars/
#6 CACHED
#7 [beam 4/5] COPY target/launcher/linux_amd64/boot target/LICENSE target/NOTICE target/LICENSE.python /opt/apache/beam/
#7 ERROR: "/target/launcher/linux_amd64/boot" not found: not found
#8 [beam 2/5] COPY target/base_image_requirements.txt /tmp/base_image_requirements.txt
#8 CANCELED
------
> [beam 4/5] COPY target/launcher/linux_amd64/boot target/LICENSE target/NOTICE target/LICENSE.python /opt/apache/beam/:
------
ERROR: failed to solve: failed to compute cache key: "/target/launcher/linux_amd64/boot" not found: not found
> Task :sdks:python:container:py38:docker FAILED
> Task :sdks:go:container:docker
#1 [internal] load build definition from Dockerfile
#1 transferring dockerfile: 1.70kB done
#1 DONE 0.0s
#2 [internal] load .dockerignore
#2 transferring context: 2B done
#2 DONE 0.0s
#3 [internal] load metadata for docker.io/library/debian:bullseye
#3 DONE 1.4s
#4 [internal] load build context
#4 DONE 0.0s
#5 [1/7] FROM docker.io/library/debian:bullseye@sha256:1beb7cf458bdfe71b5220cb2069eb45e3fc7eb77a1ccfb169eaebf5f6c4809ab
#5 DONE 0.0s
#5 [1/7] FROM docker.io/library/debian:bullseye@sha256:1beb7cf458bdfe71b5220cb2069eb45e3fc7eb77a1ccfb169eaebf5f6c4809ab
#5 CACHED
#4 [internal] load build context
#4 transferring context: 24.28MB 0.2s done
#4 DONE 0.3s
#6 [2/7] RUN apt-get update && DEBIAN_FRONTEND=noninteractive apt-get install -y ca-certificates && rm -rf /var/lib/apt/lists/*
#6 0.538 Get:1 http://deb.debian.org/debian bullseye InRelease [116 kB]
#6 0.614 Get:2 http://deb.debian.org/debian-security bullseye-security InRelease [48.4 kB]
#6 0.648 Get:3 http://deb.debian.org/debian bullseye-updates InRelease [44.1 kB]
#6 0.902 Get:4 http://deb.debian.org/debian bullseye/main amd64 Packages [8183 kB]
#6 1.304 Get:5 http://deb.debian.org/debian-security bullseye-security/main amd64 Packages [245 kB]
#6 1.359 Get:6 http://deb.debian.org/debian bullseye-updates/main amd64 Packages [17.5 kB]
#6 2.855 Fetched 8653 kB in 2s (3623 kB/s)
#6 2.855 Reading package lists...
#6 3.612 Reading package lists...
#6 4.292 Building dependency tree...
#6 4.462 Reading state information...
#6 4.619 The following additional packages will be installed:
#6 4.619 openssl
#6 4.646 The following NEW packages will be installed:
#6 4.648 ca-certificates openssl
#6 4.724 0 upgraded, 2 newly installed, 0 to remove and 0 not upgraded.
#6 4.724 Need to get 1012 kB of archives.
#6 4.724 After this operation, 1892 kB of additional disk space will be used.
#6 4.724 Get:1 http://deb.debian.org/debian-security bullseye-security/main amd64 openssl amd64 1.1.1n-0+deb11u5 [854 kB]
#6 4.935 Get:2 http://deb.debian.org/debian bullseye/main amd64 ca-certificates all 20210119 [158 kB]
> Task :sdks:java:container:java8:docker
#1 [internal] load .dockerignore
#1 transferring context:
#1 transferring context: 2B done
#1 ...
#2 [internal] load build definition from Dockerfile
#2 transferring dockerfile: 2.58kB done
#2 DONE 1.7s
#1 [internal] load .dockerignore
#1 DONE 2.4s
#3 [internal] load metadata for docker.io/library/eclipse-temurin:8
#3 DONE 0.3s
#4 [ 1/16] FROM docker.io/library/eclipse-temurin:8@sha256:2140fd8af96784eecdedaa72a18f5acb2b12359fb25db021cbdc3987a044466a
#4 resolve docker.io/library/eclipse-temurin:8@sha256:2140fd8af96784eecdedaa72a18f5acb2b12359fb25db021cbdc3987a044466a 0.0s done
#4 CACHED
#5 [internal] load build context
#5 transferring context: 47.19MB 0.4s done
#5 DONE 0.4s
#6 [ 2/16] ADD target/slf4j-api.jar /opt/apache/beam/jars/
#6 DONE 0.8s
#7 [ 3/16] ADD target/slf4j-jdk14.jar /opt/apache/beam/jars/
#7 DONE 0.1s
#8 [ 4/16] ADD target/jcl-over-slf4j.jar /opt/apache/beam/jars/
#8 DONE 0.1s
#9 [ 5/16] ADD target/log4j-over-slf4j.jar /opt/apache/beam/jars/
#9 DONE 0.1s
#10 [ 6/16] ADD target/log4j-to-slf4j.jar /opt/apache/beam/jars/
#10 DONE 0.1s
#11 [ 7/16] ADD target/beam-sdks-java-harness.jar /opt/apache/beam/jars/
#11 DONE 0.2s
#12 [ 8/16] COPY target/jamm.jar target/open-module-agent*.jar /opt/apache/beam/jars/
#12 DONE 1.1s
#13 [ 9/16] COPY target/linux_amd64/boot /opt/apache/beam/
#13 DONE 0.2s
#14 [10/16] COPY target/LICENSE /opt/apache/beam/
#14 DONE 0.1s
#15 [11/16] COPY target/NOTICE /opt/apache/beam/
#15 DONE 0.1s
#16 [12/16] ADD target/third_party_licenses /opt/apache/beam/third_party_licenses/
#16 DONE 0.3s
#17 [13/16] COPY target/LICENSE target/options/* /opt/apache/beam/options/
#17 DONE 0.1s
#18 [14/16] COPY target/go-licenses/* /opt/apache/beam/third_party_licenses/golang/
#18 DONE 0.1s
#19 [15/16] RUN if [ "true" = "false" ] ; then rm -rf /opt/apache/beam/third_party_licenses ; fi
#19 DONE 0.5s
#20 [16/16] COPY target/profiler/* /opt/google_cloud_profiler/
#20 DONE 0.2s
#21 exporting to image
#21 exporting layers
#21 exporting layers 0.2s done
#21 writing image sha256:7e0290f7e19d08f5d857590cde4d194e09c28fbe73ed02e8edc407868f5155bc done
#21 naming to docker.io/apache/beam_java8_sdk:2.51.0.dev done
#21 DONE 0.2s
> Task :sdks:go:container:docker
#6 5.398 debconf: delaying package configuration, since apt-utils is not installed
#6 5.431 Fetched 1012 kB in 0s (3598 kB/s)
#6 5.485 Selecting previously unselected package openssl.
#6 5.485 (Reading database ... (Reading database ... 5%(Reading database ... 10%(Reading database ... 15%(Reading database ... 20%(Reading database ... 25%(Reading database ... 30%(Reading database ... 35%(Reading database ... 40%(Reading database ... 45%(Reading database ... 50%(Reading database ... 55%(Reading database ... 60%(Reading database ... 65%(Reading database ... 70%(Reading database ... 75%(Reading database ... 80%(Reading database ... 85%(Reading database ... 90%(Reading database ... 95%(Reading database ... 100%(Reading database ... 6664 files and directories currently installed.)
#6 5.497 Preparing to unpack .../openssl_1.1.1n-0+deb11u5_amd64.deb ...
#6 5.502 Unpacking openssl (1.1.1n-0+deb11u5) ...
#6 5.626 Selecting previously unselected package ca-certificates.
#6 5.628 Preparing to unpack .../ca-certificates_20210119_all.deb ...
#6 5.632 Unpacking ca-certificates (20210119) ...
#6 5.696 Setting up openssl (1.1.1n-0+deb11u5) ...
#6 5.711 Setting up ca-certificates (20210119) ...
#6 6.396 Updating certificates in /etc/ssl/certs...
#6 7.163 129 added, 0 removed; done.
#6 7.207 Processing triggers for ca-certificates (20210119) ...
#6 7.216 Updating certificates in /etc/ssl/certs...
#6 7.733 0 added, 0 removed; done.
#6 7.733 Running hooks in /etc/ca-certificates/update.d...
#6 7.756 done.
#6 DONE 8.5s
#7 [3/7] ADD target/linux_amd64/boot /opt/apache/beam/
#7 DONE 0.3s
#8 [4/7] COPY target/LICENSE /opt/apache/beam/
#8 DONE 0.1s
#9 [5/7] COPY target/NOTICE /opt/apache/beam/
#9 DONE 0.1s
#10 [6/7] COPY target/go-licenses/* /opt/apache/beam/third_party_licenses/golang/
#10 DONE 0.1s
#11 [7/7] RUN if [ "true" = "false" ] ; then rm -rf /opt/apache/beam/third_party_licenses ; fi
#11 DONE 0.3s
#12 exporting to image
#12 exporting layers
#12 exporting layers 0.2s done
#12 writing image sha256:0361b2a1ab6e09f051da626d713d554f116f0817aaabb5eea45a3e67fcbaea39 done
#12 naming to docker.io/apache/beam_go_sdk:latest done
#12 DONE 0.2s
> Task :sdks:python:installGcpTest
Successfully installed PyJWT-2.8.0 apache-beam-2.51.0.dev0 attrs-23.1.0 azure-core-1.29.3 azure-identity-1.14.0 azure-storage-blob-12.18.0b1 boto3-1.28.36 botocore-1.31.36 certifi-2023.7.22 cffi-1.15.1 charset-normalizer-3.2.0 cloudpickle-2.2.1 crcmod-1.7 cryptography-41.0.3 deprecation-2.1.0 dill-0.3.1.1 dnspython-2.4.2 docker-6.1.3 docopt-0.6.2 exceptiongroup-1.1.3 execnet-2.0.2 fastavro-1.8.2 fasteners-0.18 freezegun-1.2.2 google-api-core-2.12.0.dev1 google-apitools-0.5.31 google-auth-2.22.0 google-auth-httplib2-0.1.0 google-cloud-aiplatform-1.31.1 google-cloud-bigquery-3.11.4 google-cloud-bigquery-storage-2.22.0 google-cloud-bigtable-2.21.0 google-cloud-core-2.3.3 google-cloud-datastore-2.17.0 google-cloud-dlp-3.12.2 google-cloud-language-2.11.0 google-cloud-pubsub-2.18.3 google-cloud-pubsublite-1.8.3 google-cloud-recommendations-ai-0.10.4 google-cloud-resource-manager-1.10.3 google-cloud-spanner-3.40.1 google-cloud-storage-2.10.0 google-cloud-videointelligence-2.11.3 google-cloud-vision-3.4.4 google-crc32c-1.5.0 google-resumable-media-2.5.0 googleapis-common-protos-1.60.0 greenlet-3.0.0a1 grpc-google-iam-v1-0.12.6 grpcio-status-1.58.0rc1 hdfs-2.7.2 httplib2-0.22.0 hypothesis-6.82.7 idna-3.4 iniconfig-2.0.0 isodate-0.6.1 jmespath-1.0.1 joblib-1.3.2 mock-5.1.0 msal-1.24.0b1 msal-extensions-1.0.0 oauth2client-4.1.3 objsize-0.6.1 orjson-3.9.5 overrides-6.5.0 pandas-1.5.3 parameterized-0.9.0 portalocker-2.7.0 proto-plus-1.22.3 protobuf-4.23.4 psycopg2-binary-2.9.7 pyarrow-11.0.0 pyasn1-0.5.0 pyasn1-modules-0.3.0 pycparser-2.21 pydot-1.4.2 pyhamcrest-2.0.4 pymongo-4.5.0 pymysql-1.1.0 pyparsing-3.1.1 pytest-7.4.0 pytest-timeout-2.1.0 pytest-xdist-3.3.1 python-dateutil-2.8.2 pytz-2023.3 pyyaml-6.0.1 regex-2023.8.8 requests-2.31.0 requests_mock-1.11.0 rsa-4.9 s3transfer-0.6.2 scikit-learn-1.3.0 scipy-1.10.1 shapely-1.8.5.post1 six-1.16.0 sortedcontainers-2.4.0 sqlalchemy-1.4.49 sqlparse-0.4.4 tenacity-8.2.3 testcontainers-3.7.1 threadpoolctl-3.2.0 urllib3-1.26.16 websocket-client-1.6.2 wrapt-1.15.0 zstandard-0.21.0
> Task :sdks:python:test-suites:direct:xlang:fnApiJobServerSetup
Waiting for server to start up...
Server started at port 43509
> Task :sdks:python:test-suites:direct:xlang:fnApiJobServerCleanup
Killing process at 1164040
FAILURE: Build failed with an exception.
* What went wrong:
Execution failed for task ':sdks:python:container:py38:docker'.
> Process 'command 'docker'' finished with non-zero exit value 1
* Try:
> Run with --stacktrace option to get the stack trace.
> Run with --info or --debug option to get more log output.
* Get more help at https://help.gradle.org
Deprecated Gradle features were used in this build, making it incompatible with Gradle 8.0.
You can use '--warning-mode all' to show the individual deprecation warnings and determine if they come from your own scripts or plugins.
See https://docs.gradle.org/7.6.2/userguide/command_line_interface.html#sec:command_line_warnings
Execution optimizations have been disabled for 1 invalid unit(s) of work during this build to ensure correctness.
Please consult deprecation warnings for more details.
BUILD FAILED in 2m 18s
251 actionable tasks: 162 executed, 77 from cache, 12 up-to-date
Publishing build scan...
https://ge.apache.org/s/iwcrdtkf6wgum
Build step 'Invoke Gradle script' changed build result to FAILURE
Build step 'Invoke Gradle script' marked build as failure
---------------------------------------------------------------------
To unsubscribe, e-mail: builds-unsubscribe@beam.apache.org
For additional commands, e-mail: builds-help@beam.apache.org
Jenkins build is back to normal : beam_PostCommit_XVR_Direct #4534
Posted by Apache Jenkins Server <je...@builds.apache.org>.
See <https://ci-beam.apache.org/job/beam_PostCommit_XVR_Direct/4534/display/redirect?page=changes>
---------------------------------------------------------------------
To unsubscribe, e-mail: builds-unsubscribe@beam.apache.org
For additional commands, e-mail: builds-help@beam.apache.org
Build failed in Jenkins: beam_PostCommit_XVR_Direct #4533
Posted by Apache Jenkins Server <je...@builds.apache.org>.
See <https://ci-beam.apache.org/job/beam_PostCommit_XVR_Direct/4533/display/redirect>
Changes:
------------------------------------------
[...truncated 178.18 KB...]
Using cached PyMySQL-1.1.0-py3-none-any.whl (44 kB)
Using cached websocket_client-1.6.2-py3-none-any.whl (57 kB)
Using cached PyJWT-2.8.0-py3-none-any.whl (22 kB)
Building wheels for collected packages: apache-beam
Building wheel for apache-beam (setup.py): started
Building wheel for apache-beam (setup.py): finished with status 'done'
Created wheel for apache-beam: filename=apache_beam-2.51.0.dev0-py3-none-any.whl size=3282927 sha256=a139d6ce5d3e8ee1eb45389816f655161781b0dd1f791b79570ced5b45777e3d
Stored in directory: /home/jenkins/.cache/pip/wheels/c0/01/10/5a028b724cdf5b5d2643067a82afc4660de8e5639d060da291
> Task :release:go-licenses:java:createLicenses
> Task :release:go-licenses:py:createLicenses
> Task :sdks:java:container:java8:copyGolangLicenses
> Task :sdks:python:container:py38:copyGolangLicenses
> Task :sdks:python:container:py38:dockerPrepare
> Task :release:go-licenses:go:createLicenses
> Task :sdks:go:container:copyGolangLicenses
> Task :sdks:go:container:dockerPrepare
> Task :sdks:java:container:java8:dockerPrepare
> Task :sdks:python:container:py38:docker
#1 [internal] load build definition from Dockerfile
#1 transferring dockerfile: 4.99kB done
#1 DONE 0.0s
#2 [internal] load .dockerignore
#2 transferring context: 2B done
#2 DONE 0.0s
#3 [internal] load metadata for docker.io/library/python:3.8-bullseye
#3 DONE 0.4s
#4 [beam 1/5] FROM docker.io/library/python:3.8-bullseye@sha256:7482ccf7b8ad5e5ada830a315d051b166d83f84c281e76508762505cf929c385
#4 resolve docker.io/library/python:3.8-bullseye@sha256:7482ccf7b8ad5e5ada830a315d051b166d83f84c281e76508762505cf929c385 0.0s done
#4 CACHED
#5 [internal] load build context
#5 transferring context: 2.43MB 0.0s done
#5 DONE 0.0s
#6 [beam 3/5] COPY target/apache-beam.tar.gz /opt/apache/beam/tars/
#6 CACHED
#7 [beam 4/5] COPY target/launcher/linux_amd64/boot target/LICENSE target/NOTICE target/LICENSE.python /opt/apache/beam/
#7 ERROR: "/target/launcher/linux_amd64/boot" not found: not found
#8 [beam 2/5] COPY target/base_image_requirements.txt /tmp/base_image_requirements.txt
#8 CANCELED
------
> [beam 4/5] COPY target/launcher/linux_amd64/boot target/LICENSE target/NOTICE target/LICENSE.python /opt/apache/beam/:
------
ERROR: failed to solve: failed to compute cache key: "/target/launcher/linux_amd64/boot" not found: not found
> Task :sdks:python:container:py38:docker FAILED
> Task :sdks:go:container:docker
#1 [internal] load build definition from Dockerfile
#1 transferring dockerfile: 1.70kB done
#1 DONE 1.0s
#2 [internal] load .dockerignore
#2 transferring context: 2B done
#2 DONE 1.2s
#3 [internal] load metadata for docker.io/library/debian:bullseye
#3 DONE 0.3s
#4 [1/7] FROM docker.io/library/debian:bullseye@sha256:1beb7cf458bdfe71b5220cb2069eb45e3fc7eb77a1ccfb169eaebf5f6c4809ab
#4 CACHED
#5 [internal] load build context
#5 transferring context: 24.28MB 0.2s done
#5 DONE 0.3s
#6 [2/7] RUN apt-get update && DEBIAN_FRONTEND=noninteractive apt-get install -y ca-certificates && rm -rf /var/lib/apt/lists/*
#6 2.137 Get:1 http://deb.debian.org/debian bullseye InRelease [116 kB]
#6 2.247 Get:2 http://deb.debian.org/debian-security bullseye-security InRelease [48.4 kB]
#6 2.299 Get:3 http://deb.debian.org/debian bullseye-updates InRelease [44.1 kB]
#6 2.825 Get:4 http://deb.debian.org/debian bullseye/main amd64 Packages [8183 kB]
#6 3.177 Get:5 http://deb.debian.org/debian-security bullseye-security/main amd64 Packages [245 kB]
#6 3.213 Get:6 http://deb.debian.org/debian bullseye-updates/main amd64 Packages [17.5 kB]
> Task :sdks:java:container:java8:docker
#1 [internal] load build definition from Dockerfile
#1 transferring dockerfile: 2.58kB done
#1 DONE 0.0s
#2 [internal] load .dockerignore
#2 transferring context: 2B done
#2 DONE 1.3s
#3 [internal] load metadata for docker.io/library/eclipse-temurin:8
#3 DONE 0.4s
#4 [ 1/16] FROM docker.io/library/eclipse-temurin:8@sha256:2140fd8af96784eecdedaa72a18f5acb2b12359fb25db021cbdc3987a044466a
#4 resolve docker.io/library/eclipse-temurin:8@sha256:2140fd8af96784eecdedaa72a18f5acb2b12359fb25db021cbdc3987a044466a 0.0s done
#4 CACHED
#5 [internal] load build context
#5 transferring context: 47.19MB 0.4s done
#5 DONE 0.4s
#6 [ 2/16] ADD target/slf4j-api.jar /opt/apache/beam/jars/
#6 DONE 1.6s
#7 [ 3/16] ADD target/slf4j-jdk14.jar /opt/apache/beam/jars/
#7 DONE 0.1s
#8 [ 4/16] ADD target/jcl-over-slf4j.jar /opt/apache/beam/jars/
#8 DONE 0.1s
#9 [ 5/16] ADD target/log4j-over-slf4j.jar /opt/apache/beam/jars/
#9 DONE 0.1s
#10 [ 6/16] ADD target/log4j-to-slf4j.jar /opt/apache/beam/jars/
#10 DONE 0.1s
#11 [ 7/16] ADD target/beam-sdks-java-harness.jar /opt/apache/beam/jars/
#11 DONE 0.1s
#12 [ 8/16] COPY target/jamm.jar target/open-module-agent*.jar /opt/apache/beam/jars/
#12 DONE 0.1s
#13 [ 9/16] COPY target/linux_amd64/boot /opt/apache/beam/
#13 DONE 0.2s
#14 [10/16] COPY target/LICENSE /opt/apache/beam/
#14 DONE 0.1s
#15 [11/16] COPY target/NOTICE /opt/apache/beam/
#15 DONE 0.1s
#16 [12/16] ADD target/third_party_licenses /opt/apache/beam/third_party_licenses/
#16 DONE 0.3s
#17 [13/16] COPY target/LICENSE target/options/* /opt/apache/beam/options/
#17 DONE 0.1s
#18 [14/16] COPY target/go-licenses/* /opt/apache/beam/third_party_licenses/golang/
#18 DONE 0.1s
#19 [15/16] RUN if [ "true" = "false" ] ; then rm -rf /opt/apache/beam/third_party_licenses ; fi
#19 DONE 0.3s
#20 [16/16] COPY target/profiler/* /opt/google_cloud_profiler/
#20 DONE 0.1s
#21 exporting to image
#21 exporting layers
#21 exporting layers 0.3s done
#21 writing image sha256:b04a23b65c433bfd8944eabcdbfa29b47a5fbdd9de3b5437d8e0c340ac77593e done
#21 naming to docker.io/apache/beam_java8_sdk:2.51.0.dev done
#21 DONE 0.3s
> Task :sdks:go:container:docker
#6 4.578 Fetched 8653 kB in 3s (3427 kB/s)
#6 4.578 Reading package lists...
#6 5.312 Reading package lists...
#6 5.992 Building dependency tree...
#6 6.185 Reading state information...
#6 6.421 The following additional packages will be installed:
#6 6.421 openssl
#6 6.453 The following NEW packages will be installed:
#6 6.455 ca-certificates openssl
#6 6.530 0 upgraded, 2 newly installed, 0 to remove and 0 not upgraded.
#6 6.530 Need to get 1012 kB of archives.
#6 6.530 After this operation, 1892 kB of additional disk space will be used.
#6 6.530 Get:1 http://deb.debian.org/debian-security bullseye-security/main amd64 openssl amd64 1.1.1n-0+deb11u5 [854 kB]
#6 6.668 Get:2 http://deb.debian.org/debian bullseye/main amd64 ca-certificates all 20210119 [158 kB]
#6 7.303 debconf: delaying package configuration, since apt-utils is not installed
#6 7.342 Fetched 1012 kB in 0s (4925 kB/s)
#6 7.420 Selecting previously unselected package openssl.
#6 7.420 (Reading database ... (Reading database ... 5%(Reading database ... 10%(Reading database ... 15%(Reading database ... 20%(Reading database ... 25%(Reading database ... 30%(Reading database ... 35%(Reading database ... 40%(Reading database ... 45%(Reading database ... 50%(Reading database ... 55%(Reading database ... 60%(Reading database ... 65%(Reading database ... 70%(Reading database ... 75%(Reading database ... 80%(Reading database ... 85%(Reading database ... 90%(Reading database ... 95%(Reading database ... 100%(Reading database ... 6664 files and directories currently installed.)
#6 7.512 Preparing to unpack .../openssl_1.1.1n-0+deb11u5_amd64.deb ...
#6 7.517 Unpacking openssl (1.1.1n-0+deb11u5) ...
#6 7.644 Selecting previously unselected package ca-certificates.
#6 7.645 Preparing to unpack .../ca-certificates_20210119_all.deb ...
#6 7.650 Unpacking ca-certificates (20210119) ...
#6 7.724 Setting up openssl (1.1.1n-0+deb11u5) ...
#6 7.748 Setting up ca-certificates (20210119) ...
#6 8.515 Updating certificates in /etc/ssl/certs...
#6 9.262 129 added, 0 removed; done.
#6 9.313 Processing triggers for ca-certificates (20210119) ...
#6 9.324 Updating certificates in /etc/ssl/certs...
#6 9.893 0 added, 0 removed; done.
#6 9.893 Running hooks in /etc/ca-certificates/update.d...
#6 9.913 done.
#6 DONE 11.8s
#7 [3/7] ADD target/linux_amd64/boot /opt/apache/beam/
#7 DONE 0.3s
#8 [4/7] COPY target/LICENSE /opt/apache/beam/
#8 DONE 0.1s
#9 [5/7] COPY target/NOTICE /opt/apache/beam/
#9 DONE 0.1s
#10 [6/7] COPY target/go-licenses/* /opt/apache/beam/third_party_licenses/golang/
#10 DONE 0.1s
#11 [7/7] RUN if [ "true" = "false" ] ; then rm -rf /opt/apache/beam/third_party_licenses ; fi
#11 DONE 0.3s
#12 exporting to image
#12 exporting layers
#12 exporting layers 0.2s done
#12 writing image sha256:cbd972be6182c40b4fe84357c236733a4e3d8fda0a5afee8e1416f821e4fde6d done
#12 naming to docker.io/apache/beam_go_sdk:latest done
#12 DONE 0.2s
> Task :sdks:python:installGcpTest
Successfully installed PyJWT-2.8.0 apache-beam-2.51.0.dev0 attrs-23.1.0 azure-core-1.29.3 azure-identity-1.14.0 azure-storage-blob-12.18.0b1 boto3-1.28.36 botocore-1.31.36 certifi-2023.7.22 cffi-1.15.1 charset-normalizer-3.2.0 cloudpickle-2.2.1 crcmod-1.7 cryptography-41.0.3 deprecation-2.1.0 dill-0.3.1.1 dnspython-2.4.2 docker-6.1.3 docopt-0.6.2 exceptiongroup-1.1.3 execnet-2.0.2 fastavro-1.8.2 fasteners-0.18 freezegun-1.2.2 google-api-core-2.12.0.dev1 google-apitools-0.5.31 google-auth-2.22.0 google-auth-httplib2-0.1.0 google-cloud-aiplatform-1.31.1 google-cloud-bigquery-3.11.4 google-cloud-bigquery-storage-2.22.0 google-cloud-bigtable-2.21.0 google-cloud-core-2.3.3 google-cloud-datastore-2.17.0 google-cloud-dlp-3.12.2 google-cloud-language-2.11.0 google-cloud-pubsub-2.18.3 google-cloud-pubsublite-1.8.3 google-cloud-recommendations-ai-0.10.4 google-cloud-resource-manager-1.10.3 google-cloud-spanner-3.40.1 google-cloud-storage-2.10.0 google-cloud-videointelligence-2.11.3 google-cloud-vision-3.4.4 google-crc32c-1.5.0 google-resumable-media-2.5.0 googleapis-common-protos-1.60.0 greenlet-3.0.0a1 grpc-google-iam-v1-0.12.6 grpcio-status-1.58.0rc1 hdfs-2.7.2 httplib2-0.22.0 hypothesis-6.82.7 idna-3.4 iniconfig-2.0.0 isodate-0.6.1 jmespath-1.0.1 joblib-1.3.2 mock-5.1.0 msal-1.24.0b1 msal-extensions-1.0.0 oauth2client-4.1.3 objsize-0.6.1 orjson-3.9.5 overrides-6.5.0 pandas-1.5.3 parameterized-0.9.0 portalocker-2.7.0 proto-plus-1.22.3 protobuf-4.23.4 psycopg2-binary-2.9.7 pyarrow-11.0.0 pyasn1-0.5.0 pyasn1-modules-0.3.0 pycparser-2.21 pydot-1.4.2 pyhamcrest-2.0.4 pymongo-4.5.0 pymysql-1.1.0 pyparsing-3.1.1 pytest-7.4.0 pytest-timeout-2.1.0 pytest-xdist-3.3.1 python-dateutil-2.8.2 pytz-2023.3 pyyaml-6.0.1 regex-2023.8.8 requests-2.31.0 requests_mock-1.11.0 rsa-4.9 s3transfer-0.6.2 scikit-learn-1.3.0 scipy-1.10.1 shapely-1.8.5.post1 six-1.16.0 sortedcontainers-2.4.0 sqlalchemy-1.4.49 sqlparse-0.4.4 tenacity-8.2.3 testcontainers-3.7.1 threadpoolctl-3.2.0 urllib3-1.26.16 websocket-client-1.6.2 wrapt-1.15.0 zstandard-0.21.0
> Task :sdks:python:test-suites:direct:xlang:fnApiJobServerSetup
Waiting for server to start up...
Server started at port 39245
> Task :sdks:python:test-suites:direct:xlang:fnApiJobServerCleanup
Killing process at 2927241
FAILURE: Build failed with an exception.
* What went wrong:
Execution failed for task ':sdks:python:container:py38:docker'.
> Process 'command 'docker'' finished with non-zero exit value 1
* Try:
> Run with --stacktrace option to get the stack trace.
> Run with --info or --debug option to get more log output.
* Get more help at https://help.gradle.org
Deprecated Gradle features were used in this build, making it incompatible with Gradle 8.0.
You can use '--warning-mode all' to show the individual deprecation warnings and determine if they come from your own scripts or plugins.
See https://docs.gradle.org/7.6.2/userguide/command_line_interface.html#sec:command_line_warnings
Execution optimizations have been disabled for 1 invalid unit(s) of work during this build to ensure correctness.
Please consult deprecation warnings for more details.
BUILD FAILED in 2m 17s
251 actionable tasks: 160 executed, 79 from cache, 12 up-to-date
Publishing build scan...
https://ge.apache.org/s/qx62kb4cagb2u
Build step 'Invoke Gradle script' changed build result to FAILURE
Build step 'Invoke Gradle script' marked build as failure
---------------------------------------------------------------------
To unsubscribe, e-mail: builds-unsubscribe@beam.apache.org
For additional commands, e-mail: builds-help@beam.apache.org