You are viewing a plain text version of this content. The canonical link for it is here.
Posted to dev@kafka.apache.org by Apache Jenkins Server <je...@builds.apache.org> on 2016/02/18 04:04:36 UTC
Build failed in Jenkins: kafka-trunk-jdk8 #375
See <https://builds.apache.org/job/kafka-trunk-jdk8/375/changes>
Changes:
[wangguoz] MINOR: remove streams config params from producer/consumer configs
------------------------------------------
[...truncated 1426 lines...]
kafka.log.FileMessageSetTest > testWriteTo PASSED
kafka.log.FileMessageSetTest > testPreallocateFalse PASSED
kafka.log.FileMessageSetTest > testPreallocateClearShutdown PASSED
kafka.log.FileMessageSetTest > testSearch PASSED
kafka.log.FileMessageSetTest > testSizeInBytes PASSED
kafka.log.OffsetMapTest > testClear PASSED
kafka.log.OffsetMapTest > testBasicValidation PASSED
kafka.log.OffsetIndexTest > lookupExtremeCases PASSED
kafka.log.OffsetIndexTest > appendTooMany PASSED
kafka.log.OffsetIndexTest > randomLookupTest PASSED
kafka.log.OffsetIndexTest > testReopen PASSED
kafka.log.OffsetIndexTest > appendOutOfOrder PASSED
kafka.log.OffsetIndexTest > truncate PASSED
kafka.log.BrokerCompressionTest > testBrokerSideCompression[0] PASSED
kafka.log.BrokerCompressionTest > testBrokerSideCompression[1] PASSED
kafka.log.BrokerCompressionTest > testBrokerSideCompression[2] PASSED
kafka.log.BrokerCompressionTest > testBrokerSideCompression[3] PASSED
kafka.log.BrokerCompressionTest > testBrokerSideCompression[4] PASSED
kafka.log.BrokerCompressionTest > testBrokerSideCompression[5] PASSED
kafka.log.BrokerCompressionTest > testBrokerSideCompression[6] PASSED
kafka.log.BrokerCompressionTest > testBrokerSideCompression[7] PASSED
kafka.log.BrokerCompressionTest > testBrokerSideCompression[8] PASSED
kafka.log.BrokerCompressionTest > testBrokerSideCompression[9] PASSED
kafka.log.BrokerCompressionTest > testBrokerSideCompression[10] PASSED
kafka.log.BrokerCompressionTest > testBrokerSideCompression[11] PASSED
kafka.log.BrokerCompressionTest > testBrokerSideCompression[12] PASSED
kafka.log.BrokerCompressionTest > testBrokerSideCompression[13] PASSED
kafka.log.BrokerCompressionTest > testBrokerSideCompression[14] PASSED
kafka.log.BrokerCompressionTest > testBrokerSideCompression[15] PASSED
kafka.log.BrokerCompressionTest > testBrokerSideCompression[16] PASSED
kafka.log.BrokerCompressionTest > testBrokerSideCompression[17] PASSED
kafka.log.BrokerCompressionTest > testBrokerSideCompression[18] PASSED
kafka.log.BrokerCompressionTest > testBrokerSideCompression[19] PASSED
kafka.log.LogManagerTest > testCleanupSegmentsToMaintainSize PASSED
kafka.log.LogManagerTest > testRecoveryDirectoryMappingWithRelativeDirectory PASSED
kafka.log.LogManagerTest > testGetNonExistentLog PASSED
kafka.log.LogManagerTest > testTwoLogManagersUsingSameDirFails PASSED
kafka.log.LogManagerTest > testLeastLoadedAssignment PASSED
kafka.log.LogManagerTest > testCleanupExpiredSegments PASSED
kafka.log.LogManagerTest > testCheckpointRecoveryPoints PASSED
kafka.log.LogManagerTest > testTimeBasedFlush PASSED
kafka.log.LogManagerTest > testCreateLog PASSED
kafka.log.LogManagerTest > testRecoveryDirectoryMappingWithTrailingSlash PASSED
kafka.log.LogCleanerIntegrationTest > cleanerTest[0] PASSED
kafka.log.LogCleanerIntegrationTest > cleanerTest[1] PASSED
kafka.log.LogCleanerIntegrationTest > cleanerTest[2] PASSED
kafka.log.LogCleanerIntegrationTest > cleanerTest[3] PASSED
kafka.security.auth.ZkAuthorizationTest > testIsZkSecurityEnabled PASSED
kafka.security.auth.ZkAuthorizationTest > testZkUtils PASSED
kafka.security.auth.ZkAuthorizationTest > testZkAntiMigration PASSED
kafka.security.auth.ZkAuthorizationTest > testZkMigration PASSED
kafka.security.auth.ZkAuthorizationTest > testChroot PASSED
kafka.security.auth.ZkAuthorizationTest > testDelete PASSED
kafka.security.auth.ZkAuthorizationTest > testDeleteRecursive PASSED
kafka.security.auth.AclTest > testAclJsonConversion PASSED
kafka.security.auth.ResourceTypeTest > testFromString PASSED
kafka.security.auth.SimpleAclAuthorizerTest > testAllowAllAccess PASSED
kafka.security.auth.SimpleAclAuthorizerTest > testNoAclFound PASSED
kafka.security.auth.SimpleAclAuthorizerTest > testAclManagementAPIs PASSED
kafka.security.auth.SimpleAclAuthorizerTest > testWildCardAcls PASSED
kafka.security.auth.SimpleAclAuthorizerTest > testTopicAcl PASSED
kafka.security.auth.SimpleAclAuthorizerTest > testSuperUserHasAccess PASSED
kafka.security.auth.SimpleAclAuthorizerTest > testDenyTakesPrecedence PASSED
kafka.security.auth.SimpleAclAuthorizerTest > testNoAclFoundOverride PASSED
kafka.security.auth.SimpleAclAuthorizerTest > testLoadCache PASSED
kafka.security.auth.PermissionTypeTest > testFromString PASSED
kafka.security.auth.OperationTest > testFromString PASSED
kafka.admin.AdminTest > testBasicPreferredReplicaElection PASSED
kafka.admin.AdminTest > testPreferredReplicaJsonData PASSED
kafka.admin.AdminTest > testReassigningNonExistingPartition PASSED
kafka.admin.AdminTest > testBootstrapClientIdConfig PASSED
kafka.admin.AdminTest > testPartitionReassignmentNonOverlappingReplicas PASSED
kafka.admin.AdminTest > testReplicaAssignment PASSED
kafka.admin.AdminTest > testPartitionReassignmentWithLeaderNotInNewReplicas PASSED
kafka.admin.AdminTest > testTopicConfigChange PASSED
kafka.admin.AdminTest > testResumePartitionReassignmentThatWasCompleted PASSED
kafka.admin.AdminTest > testManualReplicaAssignment PASSED
kafka.admin.AdminTest > testPartitionReassignmentWithLeaderInNewReplicas PASSED
kafka.admin.AdminTest > testShutdownBroker PASSED
kafka.admin.AdminTest > testTopicCreationWithCollision PASSED
kafka.admin.AdminTest > testTopicCreationInZK PASSED
kafka.admin.TopicCommandTest > testCreateIfNotExists PASSED
kafka.admin.TopicCommandTest > testTopicDeletion PASSED
kafka.admin.TopicCommandTest > testConfigPreservationAcrossPartitionAlteration PASSED
kafka.admin.TopicCommandTest > testAlterIfExists PASSED
kafka.admin.TopicCommandTest > testDeleteIfExists PASSED
kafka.admin.DeleteTopicTest > testDeleteTopicWithCleaner PASSED
kafka.admin.DeleteTopicTest > testResumeDeleteTopicOnControllerFailover PASSED
kafka.admin.DeleteTopicTest > testResumeDeleteTopicWithRecoveredFollower PASSED
kafka.admin.DeleteTopicTest > testDeleteTopicAlreadyMarkedAsDeleted PASSED
kafka.admin.DeleteTopicTest > testPartitionReassignmentDuringDeleteTopic PASSED
kafka.admin.DeleteTopicTest > testDeleteNonExistingTopic PASSED
kafka.admin.DeleteTopicTest > testRecreateTopicAfterDeletion PASSED
kafka.admin.DeleteTopicTest > testAddPartitionDuringDeleteTopic PASSED
kafka.admin.DeleteTopicTest > testDeleteTopicWithAllAliveReplicas PASSED
kafka.admin.DeleteTopicTest > testDeleteTopicDuringAddPartition PASSED
kafka.admin.DeleteConsumerGroupTest > testGroupWideDeleteInZKDoesNothingForActiveConsumerGroup PASSED
kafka.admin.DeleteConsumerGroupTest > testGroupTopicWideDeleteInZKDoesNothingForActiveGroupConsumingMultipleTopics PASSED
kafka.admin.DeleteConsumerGroupTest > testConsumptionOnRecreatedTopicAfterTopicWideDeleteInZK PASSED
kafka.admin.DeleteConsumerGroupTest > testTopicWideDeleteInZK PASSED
kafka.admin.DeleteConsumerGroupTest > testGroupTopicWideDeleteInZKForGroupConsumingOneTopic PASSED
kafka.admin.DeleteConsumerGroupTest > testGroupTopicWideDeleteInZKForGroupConsumingMultipleTopics PASSED
kafka.admin.DeleteConsumerGroupTest > testGroupWideDeleteInZK PASSED
kafka.admin.AddPartitionsTest > testReplicaPlacementAllServers PASSED
kafka.admin.AddPartitionsTest > testWrongReplicaCount PASSED
kafka.admin.AddPartitionsTest > testReplicaPlacementPartialServers PASSED
kafka.admin.AddPartitionsTest > testTopicDoesNotExist PASSED
kafka.admin.AddPartitionsTest > testIncrementPartitions PASSED
kafka.admin.AddPartitionsTest > testManualAssignmentOfReplicas PASSED
kafka.admin.ConfigCommandTest > testArgumentParse PASSED
kafka.admin.AclCommandTest > testInvalidAuthorizerProperty PASSED
kafka.admin.AclCommandTest > testAclCli PASSED
kafka.admin.AclCommandTest > testProducerConsumerCli PASSED
670 tests completed, 1 failed
:kafka-trunk-jdk8:core:test FAILED
:test_core_2_10 FAILED
FAILURE: Build failed with an exception.
* What went wrong:
Execution failed for task ':core:test'.
> There were failing tests. See the report at: file://<https://builds.apache.org/job/kafka-trunk-jdk8/ws/core/build/reports/tests/index.html>
* Try:
Run with --stacktrace option to get the stack trace. Run with --info or --debug option to get more log output.
BUILD FAILED
Total time: 36 mins 10.524 secs
Build step 'Execute shell' marked build as failure
Recording test results
Setting JDK1_8_0_45_HOME=/home/jenkins/jenkins-slave/tools/hudson.model.JDK/jdk1.8.0_45
Setting GRADLE_2_4_RC_2_HOME=/home/jenkins/jenkins-slave/tools/hudson.plugins.gradle.GradleInstallation/Gradle_2.4-rc-2
Setting JDK1_8_0_45_HOME=/home/jenkins/jenkins-slave/tools/hudson.model.JDK/jdk1.8.0_45
Setting GRADLE_2_4_RC_2_HOME=/home/jenkins/jenkins-slave/tools/hudson.plugins.gradle.GradleInstallation/Gradle_2.4-rc-2
Jenkins build is back to normal : kafka-trunk-jdk8 #376
Posted by Apache Jenkins Server <je...@builds.apache.org>.
See <https://builds.apache.org/job/kafka-trunk-jdk8/376/changes>