You are viewing a plain text version of this content. The canonical link for it is here.
Posted to dev@lucene.apache.org by Apache Hudson Server <hu...@hudson.apache.org> on 2010/11/16 14:59:28 UTC

Lucene-Solr-tests-only-trunk - Build # 1480 - Failure

Build: https://hudson.apache.org/hudson/job/Lucene-Solr-tests-only-trunk/1480/

4 tests failed.
FAILED:  junit.framework.TestSuite.org.apache.lucene.search.TestNumericRangeQuery64

Error Message:
background merge hit exception: _2y:c19521 _2r:c5416 _2k:c1451 _2z:c3612 into _30 [optimize] [mergeDocStores]

Stack Trace:
java.io.IOException: background merge hit exception: _2y:c19521 _2r:c5416 _2k:c1451 _2z:c3612 into _30 [optimize] [mergeDocStores]
	at org.apache.lucene.index.IndexWriter.optimize(IndexWriter.java:2415)
	at org.apache.lucene.index.IndexWriter.optimize(IndexWriter.java:2356)
	at org.apache.lucene.index.IndexWriter.optimize(IndexWriter.java:2326)
	at org.apache.lucene.index.RandomIndexWriter.getReader(RandomIndexWriter.java:129)
	at org.apache.lucene.search.TestNumericRangeQuery64.beforeClass(TestNumericRangeQuery64.java:90)
Caused by: java.lang.OutOfMemoryError: GC overhead limit exceeded
	at java.util.TreeMap.put(TreeMap.java:571)
	at org.apache.lucene.index.codecs.simpletext.SimpleTextFieldsReader$SimpleTextTerms.loadTerms(SimpleTextFieldsReader.java:547)
	at org.apache.lucene.index.codecs.simpletext.SimpleTextFieldsReader$SimpleTextTerms.<init>(SimpleTextFieldsReader.java:526)
	at org.apache.lucene.index.codecs.simpletext.SimpleTextFieldsReader.terms(SimpleTextFieldsReader.java:588)
	at org.apache.lucene.index.PerFieldCodecWrapper$FieldsReader$FieldsIterator.terms(PerFieldCodecWrapper.java:140)
	at org.apache.lucene.index.MultiFieldsEnum.terms(MultiFieldsEnum.java:103)
	at org.apache.lucene.index.codecs.FieldsConsumer.merge(FieldsConsumer.java:49)
	at org.apache.lucene.index.SegmentMerger.mergeTerms(SegmentMerger.java:658)
	at org.apache.lucene.index.SegmentMerger.merge(SegmentMerger.java:154)
	at org.apache.lucene.index.IndexWriter.mergeMiddle(IndexWriter.java:4108)
	at org.apache.lucene.index.IndexWriter.merge(IndexWriter.java:3685)
	at org.apache.lucene.index.ConcurrentMergeScheduler.doMerge(ConcurrentMergeScheduler.java:339)
	at org.apache.lucene.index.ConcurrentMergeScheduler$MergeThread.run(ConcurrentMergeScheduler.java:407)


FAILED:  junit.framework.TestSuite.org.apache.lucene.search.TestNumericRangeQuery64

Error Message:
null

Stack Trace:
java.lang.NullPointerException
	at org.apache.lucene.search.TestNumericRangeQuery64.afterClass(TestNumericRangeQuery64.java:97)


FAILED:  junit.framework.TestSuite.org.apache.lucene.search.TestNumericRangeQuery64

Error Message:
directory of test was not closed, opened from: org.apache.lucene.util.LuceneTestCase.newDirectory(LuceneTestCase.java:656)

Stack Trace:
junit.framework.AssertionFailedError: directory of test was not closed, opened from: org.apache.lucene.util.LuceneTestCase.newDirectory(LuceneTestCase.java:656)
	at org.apache.lucene.util.LuceneTestCase.afterClassLuceneTestCaseJ4(LuceneTestCase.java:334)


REGRESSION:  org.apache.lucene.search.TestPrefixRandom.testPrefixes

Error Message:
ConcurrentMergeScheduler hit unhandled exceptions

Stack Trace:
junit.framework.AssertionFailedError: ConcurrentMergeScheduler hit unhandled exceptions
	at org.apache.lucene.util.LuceneTestCase$LuceneTestCaseRunner.runChild(LuceneTestCase.java:881)
	at org.apache.lucene.util.LuceneTestCase$LuceneTestCaseRunner.runChild(LuceneTestCase.java:847)
	at org.apache.lucene.util.LuceneTestCase.tearDown(LuceneTestCase.java:461)
	at org.apache.lucene.search.TestPrefixRandom.tearDown(TestPrefixRandom.java:76)




Build Log (for compile errors):
[...truncated 3135 lines...]



---------------------------------------------------------------------
To unsubscribe, e-mail: dev-unsubscribe@lucene.apache.org
For additional commands, e-mail: dev-help@lucene.apache.org