You are viewing a plain text version of this content. The canonical link for it is here.
Posted to builds@beam.apache.org by Apache Jenkins Server <je...@builds.apache.org> on 2023/06/11 07:03:34 UTC
Build failed in Jenkins: beam_LoadTests_Java_CoGBK_Dataflow_V2_Batch_Java11 #722
See <https://ci-beam.apache.org/job/beam_LoadTests_Java_CoGBK_Dataflow_V2_Batch_Java11/722/display/redirect>
Changes:
------------------------------------------
[...truncated 130.50 KB...]
Jun 11, 2023 6:00:23 AM org.apache.beam.runners.dataflow.DataflowPipelineTranslator$Translator addStep
INFO: Adding CoGroupByKey/Flatten as step s9
Jun 11, 2023 6:00:23 AM org.apache.beam.runners.dataflow.DataflowPipelineTranslator$Translator addStep
INFO: Adding CoGroupByKey/GBK as step s10
Jun 11, 2023 6:00:23 AM org.apache.beam.runners.dataflow.DataflowPipelineTranslator$Translator addStep
INFO: Adding CoGroupByKey/ConstructCoGbkResultFn as step s11
Jun 11, 2023 6:00:23 AM org.apache.beam.runners.dataflow.DataflowPipelineTranslator$Translator addStep
INFO: Adding Ungroup and reiterate as step s12
Jun 11, 2023 6:00:23 AM org.apache.beam.runners.dataflow.DataflowPipelineTranslator$Translator addStep
INFO: Adding Collect total bytes as step s13
Jun 11, 2023 6:00:23 AM org.apache.beam.runners.dataflow.DataflowPipelineTranslator$Translator addStep
INFO: Adding Collect end time metrics as step s14
Jun 11, 2023 6:00:23 AM org.apache.beam.runners.dataflow.DataflowRunner run
INFO: Dataflow SDK version: 2.49.0-SNAPSHOT
Jun 11, 2023 6:00:23 AM org.apache.beam.runners.dataflow.DataflowRunner run
INFO: To access the Dataflow monitoring console, please navigate to https://console.cloud.google.com/dataflow/jobs/us-central1/2023-06-10_23_00_23-7294670457593342000?project=apache-beam-testing
Jun 11, 2023 6:00:23 AM org.apache.beam.runners.dataflow.DataflowRunner run
INFO: Submitted job: 2023-06-10_23_00_23-7294670457593342000
Jun 11, 2023 6:00:23 AM org.apache.beam.runners.dataflow.DataflowRunner run
INFO: To cancel the job using the 'gcloud' tool, run:
> gcloud dataflow jobs --project=apache-beam-testing cancel --region=us-central1 2023-06-10_23_00_23-7294670457593342000
Jun 11, 2023 6:00:26 AM org.apache.beam.runners.dataflow.util.MonitoringUtil$LoggingHandler process
WARNING: 2023-06-11T06:00:26.155Z: The workflow name is not a valid Cloud Label. Labels applied to Cloud resources (such as GCE Instances) for monitoring will be labeled with this modified job name: load0tests0java110dataflow0v20batch0cogbk02-jenkins-061106-g95f. For the best monitoring experience, please name your job with a valid Cloud Label. For details, see: https://cloud.google.com/compute/docs/labeling-resources#restrictions
Jun 11, 2023 6:00:31 AM org.apache.beam.runners.dataflow.util.MonitoringUtil$LoggingHandler process
INFO: 2023-06-11T06:00:31.403Z: Worker configuration: e2-standard-2 in us-central1-b.
Jun 11, 2023 6:00:34 AM org.apache.beam.runners.dataflow.util.MonitoringUtil$LoggingHandler process
INFO: 2023-06-11T06:00:32.541Z: Expanding SplittableParDo operations into optimizable parts.
Jun 11, 2023 6:00:34 AM org.apache.beam.runners.dataflow.util.MonitoringUtil$LoggingHandler process
INFO: 2023-06-11T06:00:32.576Z: Expanding CollectionToSingleton operations into optimizable parts.
Jun 11, 2023 6:00:34 AM org.apache.beam.runners.dataflow.util.MonitoringUtil$LoggingHandler process
INFO: 2023-06-11T06:00:32.621Z: Expanding CoGroupByKey operations into optimizable parts.
Jun 11, 2023 6:00:34 AM org.apache.beam.runners.dataflow.util.MonitoringUtil$LoggingHandler process
INFO: 2023-06-11T06:00:32.689Z: Expanding GroupByKey operations into optimizable parts.
Jun 11, 2023 6:00:34 AM org.apache.beam.runners.dataflow.util.MonitoringUtil$LoggingHandler process
INFO: 2023-06-11T06:00:32.759Z: Fusing adjacent ParDo, Read, Write, and Flatten operations
Jun 11, 2023 6:00:34 AM org.apache.beam.runners.dataflow.util.MonitoringUtil$LoggingHandler process
INFO: 2023-06-11T06:00:32.783Z: Unzipping flatten CoGroupByKey-Flatten for input CoGroupByKey-MakeUnionTable0-ParMultiDo-ConstructUnionTable-.output
Jun 11, 2023 6:00:34 AM org.apache.beam.runners.dataflow.util.MonitoringUtil$LoggingHandler process
INFO: 2023-06-11T06:00:32.815Z: Fusing unzipped copy of CoGroupByKey/GBK/Write, through flatten CoGroupByKey/Flatten, into producer CoGroupByKey/MakeUnionTable0/ParMultiDo(ConstructUnionTable)
Jun 11, 2023 6:00:34 AM org.apache.beam.runners.dataflow.util.MonitoringUtil$LoggingHandler process
INFO: 2023-06-11T06:00:32.849Z: Fusing consumer CoGroupByKey/ConstructCoGbkResultFn/ParMultiDo(ConstructCoGbkResult) into CoGroupByKey/GBK/Read
Jun 11, 2023 6:00:34 AM org.apache.beam.runners.dataflow.util.MonitoringUtil$LoggingHandler process
INFO: 2023-06-11T06:00:32.882Z: Fusing consumer Ungroup and reiterate/ParMultiDo(UngroupAndReiterate) into CoGroupByKey/ConstructCoGbkResultFn/ParMultiDo(ConstructCoGbkResult)
Jun 11, 2023 6:00:34 AM org.apache.beam.runners.dataflow.util.MonitoringUtil$LoggingHandler process
INFO: 2023-06-11T06:00:32.914Z: Fusing consumer Collect total bytes/ParMultiDo(ByteMonitor) into Ungroup and reiterate/ParMultiDo(UngroupAndReiterate)
Jun 11, 2023 6:00:34 AM org.apache.beam.runners.dataflow.util.MonitoringUtil$LoggingHandler process
INFO: 2023-06-11T06:00:32.946Z: Fusing consumer Collect end time metrics/ParMultiDo(TimeMonitor) into Collect total bytes/ParMultiDo(ByteMonitor)
Jun 11, 2023 6:00:34 AM org.apache.beam.runners.dataflow.util.MonitoringUtil$LoggingHandler process
INFO: 2023-06-11T06:00:32.978Z: Fusing consumer CoGroupByKey/GBK/Write into CoGroupByKey/MakeUnionTable1/ParMultiDo(ConstructUnionTable)
Jun 11, 2023 6:00:34 AM org.apache.beam.runners.dataflow.util.MonitoringUtil$LoggingHandler process
INFO: 2023-06-11T06:00:33.013Z: Fusing consumer Read input/ParDo(OutputSingleSource)/ParMultiDo(OutputSingleSource) into Read input/Impulse
Jun 11, 2023 6:00:34 AM org.apache.beam.runners.dataflow.util.MonitoringUtil$LoggingHandler process
INFO: 2023-06-11T06:00:33.046Z: Fusing consumer Read-input-ParDo-BoundedSourceAsSDFWrapper--ParMultiDo-BoundedSourceAsSDFWrapper-/PairWithRestriction into Read input/ParDo(OutputSingleSource)/ParMultiDo(OutputSingleSource)
Jun 11, 2023 6:00:34 AM org.apache.beam.runners.dataflow.util.MonitoringUtil$LoggingHandler process
INFO: 2023-06-11T06:00:33.070Z: Fusing consumer Read-input-ParDo-BoundedSourceAsSDFWrapper--ParMultiDo-BoundedSourceAsSDFWrapper-/SplitWithSizing into Read-input-ParDo-BoundedSourceAsSDFWrapper--ParMultiDo-BoundedSourceAsSDFWrapper-/PairWithRestriction
Jun 11, 2023 6:00:34 AM org.apache.beam.runners.dataflow.util.MonitoringUtil$LoggingHandler process
INFO: 2023-06-11T06:00:33.094Z: Fusing consumer Collect start time metrics (input)/ParMultiDo(TimeMonitor) into Read-input-ParDo-BoundedSourceAsSDFWrapper--ParMultiDo-BoundedSourceAsSDFWrapper-/ProcessElementAndRestrictionWithSizing
Jun 11, 2023 6:00:34 AM org.apache.beam.runners.dataflow.util.MonitoringUtil$LoggingHandler process
INFO: 2023-06-11T06:00:33.121Z: Fusing consumer Window.Into()/Window.Assign into Collect start time metrics (input)/ParMultiDo(TimeMonitor)
Jun 11, 2023 6:00:34 AM org.apache.beam.runners.dataflow.util.MonitoringUtil$LoggingHandler process
INFO: 2023-06-11T06:00:33.143Z: Fusing consumer CoGroupByKey/MakeUnionTable0/ParMultiDo(ConstructUnionTable) into Window.Into()/Window.Assign
Jun 11, 2023 6:00:34 AM org.apache.beam.runners.dataflow.util.MonitoringUtil$LoggingHandler process
INFO: 2023-06-11T06:00:33.173Z: Fusing consumer Read co-input/ParDo(OutputSingleSource)/ParMultiDo(OutputSingleSource) into Read co-input/Impulse
Jun 11, 2023 6:00:34 AM org.apache.beam.runners.dataflow.util.MonitoringUtil$LoggingHandler process
INFO: 2023-06-11T06:00:33.206Z: Fusing consumer Read-co-input-ParDo-BoundedSourceAsSDFWrapper--ParMultiDo-BoundedSourceAsSDFWrapper-/PairWithRestriction into Read co-input/ParDo(OutputSingleSource)/ParMultiDo(OutputSingleSource)
Jun 11, 2023 6:00:34 AM org.apache.beam.runners.dataflow.util.MonitoringUtil$LoggingHandler process
INFO: 2023-06-11T06:00:33.239Z: Fusing consumer Read-co-input-ParDo-BoundedSourceAsSDFWrapper--ParMultiDo-BoundedSourceAsSDFWrapper-/SplitWithSizing into Read-co-input-ParDo-BoundedSourceAsSDFWrapper--ParMultiDo-BoundedSourceAsSDFWrapper-/PairWithRestriction
Jun 11, 2023 6:00:34 AM org.apache.beam.runners.dataflow.util.MonitoringUtil$LoggingHandler process
INFO: 2023-06-11T06:00:33.272Z: Fusing consumer Collect start time metrics (co-input)/ParMultiDo(TimeMonitor) into Read-co-input-ParDo-BoundedSourceAsSDFWrapper--ParMultiDo-BoundedSourceAsSDFWrapper-/ProcessElementAndRestrictionWithSizing
Jun 11, 2023 6:00:34 AM org.apache.beam.runners.dataflow.util.MonitoringUtil$LoggingHandler process
INFO: 2023-06-11T06:00:33.303Z: Fusing consumer Window.Into()2/Window.Assign into Collect start time metrics (co-input)/ParMultiDo(TimeMonitor)
Jun 11, 2023 6:00:34 AM org.apache.beam.runners.dataflow.util.MonitoringUtil$LoggingHandler process
INFO: 2023-06-11T06:00:33.371Z: Fusing consumer CoGroupByKey/MakeUnionTable1/ParMultiDo(ConstructUnionTable) into Window.Into()2/Window.Assign
Jun 11, 2023 6:00:34 AM org.apache.beam.runners.dataflow.util.MonitoringUtil$LoggingHandler process
INFO: 2023-06-11T06:00:33.722Z: Executing operation Read co-input/Impulse+Read co-input/ParDo(OutputSingleSource)/ParMultiDo(OutputSingleSource)+Read-co-input-ParDo-BoundedSourceAsSDFWrapper--ParMultiDo-BoundedSourceAsSDFWrapper-/PairWithRestriction+Read-co-input-ParDo-BoundedSourceAsSDFWrapper--ParMultiDo-BoundedSourceAsSDFWrapper-/SplitWithSizing
Jun 11, 2023 6:00:34 AM org.apache.beam.runners.dataflow.util.MonitoringUtil$LoggingHandler process
INFO: 2023-06-11T06:00:33.755Z: Executing operation Read input/Impulse+Read input/ParDo(OutputSingleSource)/ParMultiDo(OutputSingleSource)+Read-input-ParDo-BoundedSourceAsSDFWrapper--ParMultiDo-BoundedSourceAsSDFWrapper-/PairWithRestriction+Read-input-ParDo-BoundedSourceAsSDFWrapper--ParMultiDo-BoundedSourceAsSDFWrapper-/SplitWithSizing
Jun 11, 2023 6:00:34 AM org.apache.beam.runners.dataflow.util.MonitoringUtil$LoggingHandler process
INFO: 2023-06-11T06:00:33.799Z: Starting 5 ****s in us-central1-b...
Jun 11, 2023 6:00:56 AM org.apache.beam.runners.dataflow.util.MonitoringUtil$LoggingHandler process
INFO: 2023-06-11T06:00:55.000Z: Your project already contains 100 Dataflow-created metric descriptors, so new user metrics of the form custom.googleapis.com/* will not be created. However, all user metrics are also available in the metric dataflow.googleapis.com/job/user_counter. If you rely on the custom metrics, you can delete old / unused metric descriptors. See https://developers.google.com/apis-explorer/#p/monitoring/v3/monitoring.projects.metricDescriptors.list and https://developers.google.com/apis-explorer/#p/monitoring/v3/monitoring.projects.metricDescriptors.delete
Jun 11, 2023 6:01:23 AM org.apache.beam.runners.dataflow.util.MonitoringUtil$LoggingHandler process
INFO: 2023-06-11T06:01:23.710Z: Autoscaling: Raised the number of ****s to 5 based on the rate of progress in the currently running stage(s).
Jun 11, 2023 6:02:23 AM org.apache.beam.runners.dataflow.util.MonitoringUtil$LoggingHandler process
INFO: 2023-06-11T06:02:22.084Z: Workers have started successfully.
Jun 11, 2023 6:03:36 AM org.apache.beam.runners.dataflow.util.MonitoringUtil$LoggingHandler process
SEVERE: 2023-06-11T06:03:34.617Z: Staged package bigtable-client-core-config-1.28.0-gd5UbZ9kD4Im6ocafMijlnmphZHwvlgUXM0aHqhKyTE.jar at location 'gs://temp-storage-for-perf-tests/loadtests/staging/bigtable-client-core-config-1.28.0-gd5UbZ9kD4Im6ocafMijlnmphZHwvlgUXM0aHqhKyTE.jar' is inaccessible.
Jun 11, 2023 6:03:36 AM org.apache.beam.runners.dataflow.util.MonitoringUtil$LoggingHandler process
SEVERE: 2023-06-11T06:03:34.735Z: Staged package checker-qual-3.27.0-Jf2m8-su4hOf9dfTmSZn1Sbr8bD7h982_HWqNWeebas.jar at location 'gs://temp-storage-for-perf-tests/loadtests/staging/checker-qual-3.27.0-Jf2m8-su4hOf9dfTmSZn1Sbr8bD7h982_HWqNWeebas.jar' is inaccessible.
Jun 11, 2023 6:03:38 AM org.apache.beam.runners.dataflow.util.MonitoringUtil$LoggingHandler process
WARNING: 2023-06-11T06:03:38.079Z: One or more access checks for temp location or staged files failed. Please refer to other error messages for details. For more information on security and permissions, please see https://cloud.google.com/dataflow/security-and-permissions.
Jun 11, 2023 6:06:40 AM org.apache.beam.runners.dataflow.util.MonitoringUtil$LoggingHandler process
WARNING: 2023-06-11T06:06:38.060Z: One or more access checks for temp location or staged files failed. Please refer to other error messages for details. For more information on security and permissions, please see https://cloud.google.com/dataflow/security-and-permissions.
Jun 11, 2023 6:09:35 AM org.apache.beam.runners.dataflow.util.MonitoringUtil$LoggingHandler process
SEVERE: 2023-06-11T06:09:34.563Z: Staged package bigtable-client-core-config-1.28.0-gd5UbZ9kD4Im6ocafMijlnmphZHwvlgUXM0aHqhKyTE.jar at location 'gs://temp-storage-for-perf-tests/loadtests/staging/bigtable-client-core-config-1.28.0-gd5UbZ9kD4Im6ocafMijlnmphZHwvlgUXM0aHqhKyTE.jar' is inaccessible.
Jun 11, 2023 6:09:35 AM org.apache.beam.runners.dataflow.util.MonitoringUtil$LoggingHandler process
SEVERE: 2023-06-11T06:09:34.632Z: Staged package checker-qual-3.27.0-Jf2m8-su4hOf9dfTmSZn1Sbr8bD7h982_HWqNWeebas.jar at location 'gs://temp-storage-for-perf-tests/loadtests/staging/checker-qual-3.27.0-Jf2m8-su4hOf9dfTmSZn1Sbr8bD7h982_HWqNWeebas.jar' is inaccessible.
Jun 11, 2023 6:09:38 AM org.apache.beam.runners.dataflow.util.MonitoringUtil$LoggingHandler process
WARNING: 2023-06-11T06:09:37.938Z: One or more access checks for temp location or staged files failed. Please refer to other error messages for details. For more information on security and permissions, please see https://cloud.google.com/dataflow/security-and-permissions.
Jun 11, 2023 6:12:39 AM org.apache.beam.runners.dataflow.util.MonitoringUtil$LoggingHandler process
WARNING: 2023-06-11T06:12:37.999Z: One or more access checks for temp location or staged files failed. Please refer to other error messages for details. For more information on security and permissions, please see https://cloud.google.com/dataflow/security-and-permissions.
Jun 11, 2023 6:15:35 AM org.apache.beam.runners.dataflow.util.MonitoringUtil$LoggingHandler process
SEVERE: 2023-06-11T06:15:34.584Z: Staged package bigtable-client-core-config-1.28.0-gd5UbZ9kD4Im6ocafMijlnmphZHwvlgUXM0aHqhKyTE.jar at location 'gs://temp-storage-for-perf-tests/loadtests/staging/bigtable-client-core-config-1.28.0-gd5UbZ9kD4Im6ocafMijlnmphZHwvlgUXM0aHqhKyTE.jar' is inaccessible.
Jun 11, 2023 6:15:35 AM org.apache.beam.runners.dataflow.util.MonitoringUtil$LoggingHandler process
SEVERE: 2023-06-11T06:15:34.809Z: Staged package checker-qual-3.27.0-Jf2m8-su4hOf9dfTmSZn1Sbr8bD7h982_HWqNWeebas.jar at location 'gs://temp-storage-for-perf-tests/loadtests/staging/checker-qual-3.27.0-Jf2m8-su4hOf9dfTmSZn1Sbr8bD7h982_HWqNWeebas.jar' is inaccessible.
Jun 11, 2023 6:15:38 AM org.apache.beam.runners.dataflow.util.MonitoringUtil$LoggingHandler process
WARNING: 2023-06-11T06:15:38.145Z: One or more access checks for temp location or staged files failed. Please refer to other error messages for details. For more information on security and permissions, please see https://cloud.google.com/dataflow/security-and-permissions.
Jun 11, 2023 6:18:39 AM org.apache.beam.runners.dataflow.util.MonitoringUtil$LoggingHandler process
WARNING: 2023-06-11T06:18:38.130Z: One or more access checks for temp location or staged files failed. Please refer to other error messages for details. For more information on security and permissions, please see https://cloud.google.com/dataflow/security-and-permissions.
Jun 11, 2023 6:21:36 AM org.apache.beam.runners.dataflow.util.MonitoringUtil$LoggingHandler process
SEVERE: 2023-06-11T06:21:34.613Z: Staged package bigtable-client-core-config-1.28.0-gd5UbZ9kD4Im6ocafMijlnmphZHwvlgUXM0aHqhKyTE.jar at location 'gs://temp-storage-for-perf-tests/loadtests/staging/bigtable-client-core-config-1.28.0-gd5UbZ9kD4Im6ocafMijlnmphZHwvlgUXM0aHqhKyTE.jar' is inaccessible.
Jun 11, 2023 6:21:36 AM org.apache.beam.runners.dataflow.util.MonitoringUtil$LoggingHandler process
SEVERE: 2023-06-11T06:21:34.684Z: Staged package checker-qual-3.27.0-Jf2m8-su4hOf9dfTmSZn1Sbr8bD7h982_HWqNWeebas.jar at location 'gs://temp-storage-for-perf-tests/loadtests/staging/checker-qual-3.27.0-Jf2m8-su4hOf9dfTmSZn1Sbr8bD7h982_HWqNWeebas.jar' is inaccessible.
Jun 11, 2023 6:21:39 AM org.apache.beam.runners.dataflow.util.MonitoringUtil$LoggingHandler process
WARNING: 2023-06-11T06:21:38.023Z: One or more access checks for temp location or staged files failed. Please refer to other error messages for details. For more information on security and permissions, please see https://cloud.google.com/dataflow/security-and-permissions.
Jun 11, 2023 6:24:38 AM org.apache.beam.runners.dataflow.util.MonitoringUtil$LoggingHandler process
WARNING: 2023-06-11T06:24:38.025Z: One or more access checks for temp location or staged files failed. Please refer to other error messages for details. For more information on security and permissions, please see https://cloud.google.com/dataflow/security-and-permissions.
Jun 11, 2023 6:27:35 AM org.apache.beam.runners.dataflow.util.MonitoringUtil$LoggingHandler process
SEVERE: 2023-06-11T06:27:34.551Z: Staged package bigtable-client-core-config-1.28.0-gd5UbZ9kD4Im6ocafMijlnmphZHwvlgUXM0aHqhKyTE.jar at location 'gs://temp-storage-for-perf-tests/loadtests/staging/bigtable-client-core-config-1.28.0-gd5UbZ9kD4Im6ocafMijlnmphZHwvlgUXM0aHqhKyTE.jar' is inaccessible.
Jun 11, 2023 6:27:35 AM org.apache.beam.runners.dataflow.util.MonitoringUtil$LoggingHandler process
SEVERE: 2023-06-11T06:27:34.627Z: Staged package checker-qual-3.27.0-Jf2m8-su4hOf9dfTmSZn1Sbr8bD7h982_HWqNWeebas.jar at location 'gs://temp-storage-for-perf-tests/loadtests/staging/checker-qual-3.27.0-Jf2m8-su4hOf9dfTmSZn1Sbr8bD7h982_HWqNWeebas.jar' is inaccessible.
Jun 11, 2023 6:27:38 AM org.apache.beam.runners.dataflow.util.MonitoringUtil$LoggingHandler process
WARNING: 2023-06-11T06:27:37.860Z: One or more access checks for temp location or staged files failed. Please refer to other error messages for details. For more information on security and permissions, please see https://cloud.google.com/dataflow/security-and-permissions.
Jun 11, 2023 6:30:40 AM org.apache.beam.runners.dataflow.util.MonitoringUtil$LoggingHandler process
WARNING: 2023-06-11T06:30:37.850Z: One or more access checks for temp location or staged files failed. Please refer to other error messages for details. For more information on security and permissions, please see https://cloud.google.com/dataflow/security-and-permissions.
Jun 11, 2023 6:33:35 AM org.apache.beam.runners.dataflow.util.MonitoringUtil$LoggingHandler process
SEVERE: 2023-06-11T06:33:34.572Z: Staged package bigtable-client-core-config-1.28.0-gd5UbZ9kD4Im6ocafMijlnmphZHwvlgUXM0aHqhKyTE.jar at location 'gs://temp-storage-for-perf-tests/loadtests/staging/bigtable-client-core-config-1.28.0-gd5UbZ9kD4Im6ocafMijlnmphZHwvlgUXM0aHqhKyTE.jar' is inaccessible.
Jun 11, 2023 6:33:35 AM org.apache.beam.runners.dataflow.util.MonitoringUtil$LoggingHandler process
SEVERE: 2023-06-11T06:33:34.652Z: Staged package checker-qual-3.27.0-Jf2m8-su4hOf9dfTmSZn1Sbr8bD7h982_HWqNWeebas.jar at location 'gs://temp-storage-for-perf-tests/loadtests/staging/checker-qual-3.27.0-Jf2m8-su4hOf9dfTmSZn1Sbr8bD7h982_HWqNWeebas.jar' is inaccessible.
Jun 11, 2023 6:33:40 AM org.apache.beam.runners.dataflow.util.MonitoringUtil$LoggingHandler process
WARNING: 2023-06-11T06:33:38.418Z: One or more access checks for temp location or staged files failed. Please refer to other error messages for details. For more information on security and permissions, please see https://cloud.google.com/dataflow/security-and-permissions.
Jun 11, 2023 6:36:38 AM org.apache.beam.runners.dataflow.util.MonitoringUtil$LoggingHandler process
WARNING: 2023-06-11T06:36:38.060Z: One or more access checks for temp location or staged files failed. Please refer to other error messages for details. For more information on security and permissions, please see https://cloud.google.com/dataflow/security-and-permissions.
Jun 11, 2023 6:39:35 AM org.apache.beam.runners.dataflow.util.MonitoringUtil$LoggingHandler process
SEVERE: 2023-06-11T06:39:34.547Z: Staged package bigtable-client-core-config-1.28.0-gd5UbZ9kD4Im6ocafMijlnmphZHwvlgUXM0aHqhKyTE.jar at location 'gs://temp-storage-for-perf-tests/loadtests/staging/bigtable-client-core-config-1.28.0-gd5UbZ9kD4Im6ocafMijlnmphZHwvlgUXM0aHqhKyTE.jar' is inaccessible.
Jun 11, 2023 6:39:35 AM org.apache.beam.runners.dataflow.util.MonitoringUtil$LoggingHandler process
SEVERE: 2023-06-11T06:39:34.623Z: Staged package checker-qual-3.27.0-Jf2m8-su4hOf9dfTmSZn1Sbr8bD7h982_HWqNWeebas.jar at location 'gs://temp-storage-for-perf-tests/loadtests/staging/checker-qual-3.27.0-Jf2m8-su4hOf9dfTmSZn1Sbr8bD7h982_HWqNWeebas.jar' is inaccessible.
Jun 11, 2023 6:39:40 AM org.apache.beam.runners.dataflow.util.MonitoringUtil$LoggingHandler process
WARNING: 2023-06-11T06:39:37.874Z: One or more access checks for temp location or staged files failed. Please refer to other error messages for details. For more information on security and permissions, please see https://cloud.google.com/dataflow/security-and-permissions.
Jun 11, 2023 6:42:40 AM org.apache.beam.runners.dataflow.util.MonitoringUtil$LoggingHandler process
WARNING: 2023-06-11T06:42:37.943Z: One or more access checks for temp location or staged files failed. Please refer to other error messages for details. For more information on security and permissions, please see https://cloud.google.com/dataflow/security-and-permissions.
Jun 11, 2023 6:45:34 AM org.apache.beam.runners.dataflow.util.MonitoringUtil$LoggingHandler process
SEVERE: 2023-06-11T06:45:34.601Z: Staged package bigtable-client-core-config-1.28.0-gd5UbZ9kD4Im6ocafMijlnmphZHwvlgUXM0aHqhKyTE.jar at location 'gs://temp-storage-for-perf-tests/loadtests/staging/bigtable-client-core-config-1.28.0-gd5UbZ9kD4Im6ocafMijlnmphZHwvlgUXM0aHqhKyTE.jar' is inaccessible.
Jun 11, 2023 6:45:34 AM org.apache.beam.runners.dataflow.util.MonitoringUtil$LoggingHandler process
SEVERE: 2023-06-11T06:45:34.683Z: Staged package checker-qual-3.27.0-Jf2m8-su4hOf9dfTmSZn1Sbr8bD7h982_HWqNWeebas.jar at location 'gs://temp-storage-for-perf-tests/loadtests/staging/checker-qual-3.27.0-Jf2m8-su4hOf9dfTmSZn1Sbr8bD7h982_HWqNWeebas.jar' is inaccessible.
Jun 11, 2023 6:45:38 AM org.apache.beam.runners.dataflow.util.MonitoringUtil$LoggingHandler process
WARNING: 2023-06-11T06:45:38.102Z: One or more access checks for temp location or staged files failed. Please refer to other error messages for details. For more information on security and permissions, please see https://cloud.google.com/dataflow/security-and-permissions.
Jun 11, 2023 6:48:38 AM org.apache.beam.runners.dataflow.util.MonitoringUtil$LoggingHandler process
WARNING: 2023-06-11T06:48:37.890Z: One or more access checks for temp location or staged files failed. Please refer to other error messages for details. For more information on security and permissions, please see https://cloud.google.com/dataflow/security-and-permissions.
Jun 11, 2023 6:51:35 AM org.apache.beam.runners.dataflow.util.MonitoringUtil$LoggingHandler process
SEVERE: 2023-06-11T06:51:34.650Z: Staged package bigtable-client-core-config-1.28.0-gd5UbZ9kD4Im6ocafMijlnmphZHwvlgUXM0aHqhKyTE.jar at location 'gs://temp-storage-for-perf-tests/loadtests/staging/bigtable-client-core-config-1.28.0-gd5UbZ9kD4Im6ocafMijlnmphZHwvlgUXM0aHqhKyTE.jar' is inaccessible.
Jun 11, 2023 6:51:35 AM org.apache.beam.runners.dataflow.util.MonitoringUtil$LoggingHandler process
SEVERE: 2023-06-11T06:51:34.725Z: Staged package checker-qual-3.27.0-Jf2m8-su4hOf9dfTmSZn1Sbr8bD7h982_HWqNWeebas.jar at location 'gs://temp-storage-for-perf-tests/loadtests/staging/checker-qual-3.27.0-Jf2m8-su4hOf9dfTmSZn1Sbr8bD7h982_HWqNWeebas.jar' is inaccessible.
Jun 11, 2023 6:51:38 AM org.apache.beam.runners.dataflow.util.MonitoringUtil$LoggingHandler process
WARNING: 2023-06-11T06:51:38.001Z: One or more access checks for temp location or staged files failed. Please refer to other error messages for details. For more information on security and permissions, please see https://cloud.google.com/dataflow/security-and-permissions.
Jun 11, 2023 6:54:39 AM org.apache.beam.runners.dataflow.util.MonitoringUtil$LoggingHandler process
WARNING: 2023-06-11T06:54:38.035Z: One or more access checks for temp location or staged files failed. Please refer to other error messages for details. For more information on security and permissions, please see https://cloud.google.com/dataflow/security-and-permissions.
Jun 11, 2023 6:57:36 AM org.apache.beam.runners.dataflow.util.MonitoringUtil$LoggingHandler process
SEVERE: 2023-06-11T06:57:34.577Z: Staged package bigtable-client-core-config-1.28.0-gd5UbZ9kD4Im6ocafMijlnmphZHwvlgUXM0aHqhKyTE.jar at location 'gs://temp-storage-for-perf-tests/loadtests/staging/bigtable-client-core-config-1.28.0-gd5UbZ9kD4Im6ocafMijlnmphZHwvlgUXM0aHqhKyTE.jar' is inaccessible.
Jun 11, 2023 6:57:36 AM org.apache.beam.runners.dataflow.util.MonitoringUtil$LoggingHandler process
SEVERE: 2023-06-11T06:57:34.643Z: Staged package checker-qual-3.27.0-Jf2m8-su4hOf9dfTmSZn1Sbr8bD7h982_HWqNWeebas.jar at location 'gs://temp-storage-for-perf-tests/loadtests/staging/checker-qual-3.27.0-Jf2m8-su4hOf9dfTmSZn1Sbr8bD7h982_HWqNWeebas.jar' is inaccessible.
Jun 11, 2023 6:57:38 AM org.apache.beam.runners.dataflow.util.MonitoringUtil$LoggingHandler process
WARNING: 2023-06-11T06:57:37.831Z: One or more access checks for temp location or staged files failed. Please refer to other error messages for details. For more information on security and permissions, please see https://cloud.google.com/dataflow/security-and-permissions.
Jun 11, 2023 7:00:36 AM org.apache.beam.runners.dataflow.util.MonitoringUtil$LoggingHandler process
SEVERE: 2023-06-11T07:00:34.301Z: Workflow failed. Causes: The Dataflow job appears to be stuck because no **** activity has been seen in the last 1h. Please check the **** logs in Stackdriver Logging. You can also get help with Cloud Dataflow at https://cloud.google.com/dataflow/support.
Jun 11, 2023 7:00:36 AM org.apache.beam.runners.dataflow.util.MonitoringUtil$LoggingHandler process
INFO: 2023-06-11T07:00:34.327Z: Cancel request is committed for workflow job: 2023-06-10_23_00_23-7294670457593342000.
Jun 11, 2023 7:00:36 AM org.apache.beam.runners.dataflow.util.MonitoringUtil$LoggingHandler process
SEVERE: 2023-06-11T07:00:34.344Z: The Dataflow job appears to be stuck because no **** activity has been seen in the last 1h. Please check the **** logs in Stackdriver Logging. You can also get help with Cloud Dataflow at https://cloud.google.com/dataflow/support.
Jun 11, 2023 7:00:36 AM org.apache.beam.runners.dataflow.util.MonitoringUtil$LoggingHandler process
WARNING: 2023-06-11T07:00:34.400Z: Unable to delete temp files: "gs://temp-storage-for-perf-tests/loadtests/dax-tmp-2023-06-10_23_00_23-7294670457593342000-S01-0-f68ec7c492070106/tmp-f68ec7c492070d9b@DAX.sdfmeta."
Jun 11, 2023 7:00:36 AM org.apache.beam.runners.dataflow.util.MonitoringUtil$LoggingHandler process
WARNING: 2023-06-11T07:00:34.401Z: Unable to delete temp files: "gs://temp-storage-for-perf-tests/loadtests/dax-tmp-2023-06-10_23_00_23-7294670457593342000-S02-0-72109a20aba8ae9b/tmp-72109a20aba8a0ee@DAX.sdfmeta."
Jun 11, 2023 7:00:36 AM org.apache.beam.runners.dataflow.util.MonitoringUtil$LoggingHandler process
WARNING: 2023-06-11T07:00:34.419Z: S02:Read input/Impulse+Read input/ParDo(OutputSingleSource)/ParMultiDo(OutputSingleSource)+Read-input-ParDo-BoundedSourceAsSDFWrapper--ParMultiDo-BoundedSourceAsSDFWrapper-/PairWithRestriction+Read-input-ParDo-BoundedSourceAsSDFWrapper--ParMultiDo-BoundedSourceAsSDFWrapper-/SplitWithSizing failed.
Jun 11, 2023 7:00:36 AM org.apache.beam.runners.dataflow.util.MonitoringUtil$LoggingHandler process
WARNING: 2023-06-11T07:00:34.419Z: S01:Read co-input/Impulse+Read co-input/ParDo(OutputSingleSource)/ParMultiDo(OutputSingleSource)+Read-co-input-ParDo-BoundedSourceAsSDFWrapper--ParMultiDo-BoundedSourceAsSDFWrapper-/PairWithRestriction+Read-co-input-ParDo-BoundedSourceAsSDFWrapper--ParMultiDo-BoundedSourceAsSDFWrapper-/SplitWithSizing failed.
Jun 11, 2023 7:00:36 AM org.apache.beam.runners.dataflow.util.MonitoringUtil$LoggingHandler process
INFO: 2023-06-11T07:00:34.442Z: Finished operation Read input/Impulse+Read input/ParDo(OutputSingleSource)/ParMultiDo(OutputSingleSource)+Read-input-ParDo-BoundedSourceAsSDFWrapper--ParMultiDo-BoundedSourceAsSDFWrapper-/PairWithRestriction+Read-input-ParDo-BoundedSourceAsSDFWrapper--ParMultiDo-BoundedSourceAsSDFWrapper-/SplitWithSizing
Jun 11, 2023 7:00:36 AM org.apache.beam.runners.dataflow.util.MonitoringUtil$LoggingHandler process
INFO: 2023-06-11T07:00:34.442Z: Finished operation Read co-input/Impulse+Read co-input/ParDo(OutputSingleSource)/ParMultiDo(OutputSingleSource)+Read-co-input-ParDo-BoundedSourceAsSDFWrapper--ParMultiDo-BoundedSourceAsSDFWrapper-/PairWithRestriction+Read-co-input-ParDo-BoundedSourceAsSDFWrapper--ParMultiDo-BoundedSourceAsSDFWrapper-/SplitWithSizing
Jun 11, 2023 7:00:39 AM org.apache.beam.runners.dataflow.util.MonitoringUtil$LoggingHandler process
WARNING: 2023-06-11T07:00:38.156Z: One or more access checks for temp location or staged files failed. Please refer to other error messages for details. For more information on security and permissions, please see https://cloud.google.com/dataflow/security-and-permissions.
Jun 11, 2023 7:00:39 AM org.apache.beam.runners.dataflow.util.MonitoringUtil$LoggingHandler process
INFO: 2023-06-11T07:00:38.178Z: Cleaning up.
Jun 11, 2023 7:00:39 AM org.apache.beam.runners.dataflow.util.MonitoringUtil$LoggingHandler process
INFO: 2023-06-11T07:00:38.240Z: Stopping **** pool...
Jun 11, 2023 7:02:50 AM org.apache.beam.runners.dataflow.util.MonitoringUtil$LoggingHandler process
INFO: 2023-06-11T07:02:49.611Z: Autoscaling: Resized **** pool from 5 to 0.
Jun 11, 2023 7:02:50 AM org.apache.beam.runners.dataflow.util.MonitoringUtil$LoggingHandler process
INFO: 2023-06-11T07:02:49.655Z: Worker pool stopped.
Jun 11, 2023 7:03:27 AM org.apache.beam.runners.dataflow.DataflowPipelineJob logTerminalState
INFO: Job 2023-06-10_23_00_23-7294670457593342000 failed with status FAILED.
Jun 11, 2023 7:03:27 AM org.apache.beam.sdk.testutils.metrics.MetricsReader getCounterMetric
SEVERE: Failed to get metric totalBytes.count, from namespace co_gbk
Load test results for test (ID): ccf2322e-58f2-42c0-b044-a77f3b5f8998 and timestamp: 2023-06-11T06:00:13.518000000Z:
Metric: Value:
dataflow_v2_java11_runtime_sec 0.0
dataflow_v2_java11_total_bytes_count -1.0
Exception in thread "main" java.lang.RuntimeException: Invalid job state: FAILED.
at org.apache.beam.sdk.loadtests.JobFailure.handleFailure(JobFailure.java:51)
at org.apache.beam.sdk.loadtests.LoadTest.run(LoadTest.java:139)
at org.apache.beam.sdk.loadtests.CoGroupByKeyLoadTest.run(CoGroupByKeyLoadTest.java:62)
at org.apache.beam.sdk.loadtests.CoGroupByKeyLoadTest.main(CoGroupByKeyLoadTest.java:157)
> Task :sdks:java:testing:load-tests:run FAILED
> Task :runners:google-cloud-dataflow-java:cleanUpDockerJavaImages
Untagged: us.gcr.io/apache-beam-testing/java-postcommit-it/java:20230611055951
Untagged: us.gcr.io/apache-beam-testing/java-postcommit-it/java@sha256:3a0dcc31f9167cf3a95285a2e04c9fc856738c7f76286265ad6b68f40fba0dd5
WARNING: Successfully resolved tag to sha256, but it is recommended to use sha256 directly.
Tag: [us.gcr.io/apache-beam-testing/java-postcommit-it/java:20230611055951]
- referencing digest: [us.gcr.io/apache-beam-testing/java-postcommit-it/java@sha256:3a0dcc31f9167cf3a95285a2e04c9fc856738c7f76286265ad6b68f40fba0dd5]
Deleted [[us.gcr.io/apache-beam-testing/java-postcommit-it/java:20230611055951] (referencing [us.gcr.io/apache-beam-testing/java-postcommit-it/java@sha256:3a0dcc31f9167cf3a95285a2e04c9fc856738c7f76286265ad6b68f40fba0dd5])].
Removing untagged image us.gcr.io/apache-beam-testing/java-postcommit-it/java@sha256:3a0dcc31f9167cf3a95285a2e04c9fc856738c7f76286265ad6b68f40fba0dd5
Digests:
- us.gcr.io/apache-beam-testing/java-postcommit-it/java@sha256:3a0dcc31f9167cf3a95285a2e04c9fc856738c7f76286265ad6b68f40fba0dd5
Deleted [us.gcr.io/apache-beam-testing/java-postcommit-it/java@sha256:3a0dcc31f9167cf3a95285a2e04c9fc856738c7f76286265ad6b68f40fba0dd5].
FAILURE: Build failed with an exception.
* What went wrong:
Execution failed for task ':sdks:java:testing:load-tests:run'.
> Process 'command '/usr/lib/jvm/java-8-openjdk-amd64/bin/java'' finished with non-zero exit value 1
* Try:
> Run with --stacktrace option to get the stack trace.
> Run with --info or --debug option to get more log output.
* Get more help at https://help.gradle.org
Deprecated Gradle features were used in this build, making it incompatible with Gradle 8.0.
You can use '--warning-mode all' to show the individual deprecation warnings and determine if they come from your own scripts or plugins.
See https://docs.gradle.org/7.5.1/userguide/command_line_interface.html#sec:command_line_warnings
Execution optimizations have been disabled for 1 invalid unit(s) of work during this build to ensure correctness.
Please consult deprecation warnings for more details.
BUILD FAILED in 1h 3m 56s
112 actionable tasks: 9 executed, 103 up-to-date
Publishing build scan...
https://ge.apache.org/s/njzhqzodsmphs
Build step 'Invoke Gradle script' changed build result to FAILURE
Build step 'Invoke Gradle script' marked build as failure
---------------------------------------------------------------------
To unsubscribe, e-mail: builds-unsubscribe@beam.apache.org
For additional commands, e-mail: builds-help@beam.apache.org
Jenkins build is back to normal : beam_LoadTests_Java_CoGBK_Dataflow_V2_Batch_Java11 #723
Posted by Apache Jenkins Server <je...@builds.apache.org>.
See <https://ci-beam.apache.org/job/beam_LoadTests_Java_CoGBK_Dataflow_V2_Batch_Java11/723/display/redirect?page=changes>
---------------------------------------------------------------------
To unsubscribe, e-mail: builds-unsubscribe@beam.apache.org
For additional commands, e-mail: builds-help@beam.apache.org