You are viewing a plain text version of this content. The canonical link for it is here.
Posted to commits@karaf.apache.org by Apache Jenkins Server <je...@builds.apache.org> on 2011/06/25 20:28:21 UTC

Jenkins build is still unstable: Karaf-2.2.x #146

See <https://builds.apache.org/job/Karaf-2.2.x/changes>



Jenkins build is back to stable : Karaf-2.2.x #153

Posted by Apache Jenkins Server <je...@builds.apache.org>.
See <https://builds.apache.org/job/Karaf-2.2.x/153/changes>



Jenkins build is still unstable: Karaf-2.2.x #152

Posted by Apache Jenkins Server <je...@builds.apache.org>.
See <https://builds.apache.org/job/Karaf-2.2.x/changes>



Jenkins build is unstable: Karaf-2.2.x #151

Posted by Apache Jenkins Server <je...@builds.apache.org>.
See <https://builds.apache.org/job/Karaf-2.2.x/151/changes>



Build failed in Jenkins: Karaf-2.2.x #150

Posted by Apache Jenkins Server <je...@builds.apache.org>.
See <https://builds.apache.org/job/Karaf-2.2.x/150/changes>

Changes:

[jgoodyear] [KARAF-685] Apache Karaf 2.2.2 Release

Update in kit release notes.

------------------------------------------
[...truncated 8548 lines...]
[INFO] [site:attach-descriptor {execution: default-attach-descriptor}]
[INFO] [install:install {execution: default-install}]
[INFO] Installing <https://builds.apache.org/job/Karaf-2.2.x/ws/karaf/demos/pom.xml> to <https://builds.apache.org/job/Karaf-2.2.x/ws/.repository/org/apache/karaf/demos/demos/2.2.2-SNAPSHOT/demos-2.2.2-SNAPSHOT.pom>
[JENKINS] Archiving <https://builds.apache.org/job/Karaf-2.2.x/ws/karaf/demos/pom.xml> to /home/hudson/hudson/jobs/Karaf-2.2.x/modules/org.apache.karaf.demos$demos/builds/2011-06-28_11-26-02/archive/org.apache.karaf.demos/demos/2.2.2-SNAPSHOT/demos-2.2.2-SNAPSHOT.pom
[INFO] ------------------------------------------------------------------------
[INFO] Building Apache Karaf :: Demos :: Web
[INFO]    task-segment: [clean, install]
[INFO] ------------------------------------------------------------------------
Downloading: http://repo1.maven.org/maven2/org/apache/maven/plugins/maven-war-plugin/2.1-beta-1/maven-war-plugin-2.1-beta-1.pom

Downloading: http://repo1.maven.org/maven2/org/apache/maven/plugins/maven-war-plugin/2.1-beta-1/maven-war-plugin-2.1-beta-1.jar

Downloading: http://repo1.maven.org/maven2/org/mortbay/jetty/maven-jetty-plugin/6.1.25/maven-jetty-plugin-6.1.25.pom

Downloading: http://repo1.maven.org/maven2/org/mortbay/jetty/project/6.1.25/project-6.1.25.pom

Downloading: http://repo1.maven.org/maven2/org/mortbay/jetty/jetty-parent/10/jetty-parent-10.pom

Downloading: http://repo1.maven.org/maven2/org/eclipse/jetty/jetty-parent/14/jetty-parent-14.pom

Downloading: http://repo1.maven.org/maven2/org/mortbay/jetty/maven-jetty-plugin/6.1.25/maven-jetty-plugin-6.1.25.jar

Downloading: http://repo1.maven.org/maven2/org/apache/maven/plugins/maven-dependency-plugin/2.0/maven-dependency-plugin-2.0.pom

Downloading: http://repo1.maven.org/maven2/org/apache/maven/plugins/maven-plugins/10/maven-plugins-10.pom

Downloading: http://repo1.maven.org/maven2/org/apache/maven/plugins/maven-dependency-plugin/2.0/maven-dependency-plugin-2.0.jar

[INFO] [clean:clean {execution: default-clean}]
[INFO] [enforcer:enforce {execution: enforce-versions}]
[INFO] [bundle:cleanVersions {execution: cleanVersions}]
[INFO] [remote-resources:process {execution: default}]
Downloading: http://svn.apache.org/repos/asf/servicemix/m2-repo/org/apache/maven/maven-settings/2.0.8/maven-settings-2.0.8.pom
[INFO] Unable to find resource 'org.apache.maven:maven-settings:pom:2.0.8' in repository servicemix (http://svn.apache.org/repos/asf/servicemix/m2-repo)
Downloading: http://repo1.maven.org/maven2/org/apache/maven/maven-settings/2.0.8/maven-settings-2.0.8.pom

Downloading: http://svn.apache.org/repos/asf/servicemix/m2-repo/org/apache/maven/maven-profile/2.0.8/maven-profile-2.0.8.pom
[INFO] Unable to find resource 'org.apache.maven:maven-profile:pom:2.0.8' in repository servicemix (http://svn.apache.org/repos/asf/servicemix/m2-repo)
Downloading: http://repo1.maven.org/maven2/org/apache/maven/maven-profile/2.0.8/maven-profile-2.0.8.pom

Downloading: http://svn.apache.org/repos/asf/servicemix/m2-repo/org/apache/maven/maven-artifact-manager/2.0.8/maven-artifact-manager-2.0.8.pom
[INFO] Unable to find resource 'org.apache.maven:maven-artifact-manager:pom:2.0.8' in repository servicemix (http://svn.apache.org/repos/asf/servicemix/m2-repo)
Downloading: http://repo1.maven.org/maven2/org/apache/maven/maven-artifact-manager/2.0.8/maven-artifact-manager-2.0.8.pom

Downloading: http://svn.apache.org/repos/asf/servicemix/m2-repo/org/apache/maven/maven-repository-metadata/2.0.8/maven-repository-metadata-2.0.8.pom
[INFO] Unable to find resource 'org.apache.maven:maven-repository-metadata:pom:2.0.8' in repository servicemix (http://svn.apache.org/repos/asf/servicemix/m2-repo)
Downloading: http://repo1.maven.org/maven2/org/apache/maven/maven-repository-metadata/2.0.8/maven-repository-metadata-2.0.8.pom

Downloading: http://svn.apache.org/repos/asf/servicemix/m2-repo/org/apache/maven/maven-plugin-registry/2.0.8/maven-plugin-registry-2.0.8.pom
[INFO] Unable to find resource 'org.apache.maven:maven-plugin-registry:pom:2.0.8' in repository servicemix (http://svn.apache.org/repos/asf/servicemix/m2-repo)
Downloading: http://repo1.maven.org/maven2/org/apache/maven/maven-plugin-registry/2.0.8/maven-plugin-registry-2.0.8.pom

Downloading: http://repo1.maven.org/maven2/org/apache/maven/maven-core/2.0.8/maven-core-2.0.8.pom

Downloading: http://svn.apache.org/repos/asf/servicemix/m2-repo/org/apache/maven/maven-plugin-parameter-documenter/2.0.8/maven-plugin-parameter-documenter-2.0.8.pom
[INFO] Unable to find resource 'org.apache.maven:maven-plugin-parameter-documenter:pom:2.0.8' in repository servicemix (http://svn.apache.org/repos/asf/servicemix/m2-repo)
Downloading: http://repo1.maven.org/maven2/org/apache/maven/maven-plugin-parameter-documenter/2.0.8/maven-plugin-parameter-documenter-2.0.8.pom

Downloading: http://svn.apache.org/repos/asf/servicemix/m2-repo/org/apache/maven/reporting/maven-reporting-api/2.0.8/maven-reporting-api-2.0.8.pom
[INFO] Unable to find resource 'org.apache.maven.reporting:maven-reporting-api:pom:2.0.8' in repository servicemix (http://svn.apache.org/repos/asf/servicemix/m2-repo)
Downloading: http://repo1.maven.org/maven2/org/apache/maven/reporting/maven-reporting-api/2.0.8/maven-reporting-api-2.0.8.pom

Downloading: http://svn.apache.org/repos/asf/servicemix/m2-repo/org/apache/maven/reporting/maven-reporting/2.0.8/maven-reporting-2.0.8.pom
[INFO] Unable to find resource 'org.apache.maven.reporting:maven-reporting:pom:2.0.8' in repository servicemix (http://svn.apache.org/repos/asf/servicemix/m2-repo)
Downloading: http://repo1.maven.org/maven2/org/apache/maven/reporting/maven-reporting/2.0.8/maven-reporting-2.0.8.pom

Downloading: http://svn.apache.org/repos/asf/servicemix/m2-repo/org/apache/maven/doxia/doxia-sink-api/1.0-alpha-9/doxia-sink-api-1.0-alpha-9.pom
[INFO] Unable to find resource 'org.apache.maven.doxia:doxia-sink-api:pom:1.0-alpha-9' in repository servicemix (http://svn.apache.org/repos/asf/servicemix/m2-repo)
Downloading: http://repo1.maven.org/maven2/org/apache/maven/doxia/doxia-sink-api/1.0-alpha-9/doxia-sink-api-1.0-alpha-9.pom

Downloading: http://svn.apache.org/repos/asf/servicemix/m2-repo/org/apache/maven/doxia/doxia/1.0-alpha-9/doxia-1.0-alpha-9.pom
[INFO] Unable to find resource 'org.apache.maven.doxia:doxia:pom:1.0-alpha-9' in repository servicemix (http://svn.apache.org/repos/asf/servicemix/m2-repo)
Downloading: http://repo1.maven.org/maven2/org/apache/maven/doxia/doxia/1.0-alpha-9/doxia-1.0-alpha-9.pom

Downloading: http://svn.apache.org/repos/asf/servicemix/m2-repo/org/apache/maven/maven-error-diagnostics/2.0.8/maven-error-diagnostics-2.0.8.pom
[INFO] Unable to find resource 'org.apache.maven:maven-error-diagnostics:pom:2.0.8' in repository servicemix (http://svn.apache.org/repos/asf/servicemix/m2-repo)
Downloading: http://repo1.maven.org/maven2/org/apache/maven/maven-error-diagnostics/2.0.8/maven-error-diagnostics-2.0.8.pom

Downloading: http://svn.apache.org/repos/asf/servicemix/m2-repo/org/apache/maven/maven-plugin-descriptor/2.0.8/maven-plugin-descriptor-2.0.8.pom
[INFO] Unable to find resource 'org.apache.maven:maven-plugin-descriptor:pom:2.0.8' in repository servicemix (http://svn.apache.org/repos/asf/servicemix/m2-repo)
Downloading: http://repo1.maven.org/maven2/org/apache/maven/maven-plugin-descriptor/2.0.8/maven-plugin-descriptor-2.0.8.pom

Downloading: http://svn.apache.org/repos/asf/servicemix/m2-repo/org/apache/maven/maven-monitor/2.0.8/maven-monitor-2.0.8.pom
[INFO] Unable to find resource 'org.apache.maven:maven-monitor:pom:2.0.8' in repository servicemix (http://svn.apache.org/repos/asf/servicemix/m2-repo)
Downloading: http://repo1.maven.org/maven2/org/apache/maven/maven-monitor/2.0.8/maven-monitor-2.0.8.pom

Downloading: http://repo1.maven.org/maven2/org/apache/maven/shared/maven-dependency-analyzer/1.0/maven-dependency-analyzer-1.0.pom

Downloading: http://repo1.maven.org/maven2/org/apache/maven/doxia/doxia-sink-api/1.0-alpha-8/doxia-sink-api-1.0-alpha-8.pom

Downloading: http://repo1.maven.org/maven2/org/apache/maven/doxia/doxia/1.0-alpha-8/doxia-1.0-alpha-8.pom

Downloading: http://repo1.maven.org/maven2/org/apache/maven/maven-parent/1/maven-parent-1.pom

Downloading: http://repo1.maven.org/maven2/org/apache/apache/1/apache-1.pom

Downloading: http://repo1.maven.org/maven2/org/apache/maven/doxia/doxia-site-renderer/1.0-alpha-8/doxia-site-renderer-1.0-alpha-8.pom

Downloading: http://svn.apache.org/repos/asf/servicemix/m2-repo/org/apache/maven/doxia/doxia-core/1.0-alpha-8/doxia-core-1.0-alpha-8.pom
[INFO] Unable to find resource 'org.apache.maven.doxia:doxia-core:pom:1.0-alpha-8' in repository servicemix (http://svn.apache.org/repos/asf/servicemix/m2-repo)
Downloading: http://repo1.maven.org/maven2/org/apache/maven/doxia/doxia-core/1.0-alpha-8/doxia-core-1.0-alpha-8.pom

Downloading: http://svn.apache.org/repos/asf/servicemix/m2-repo/org/apache/maven/doxia/doxia-decoration-model/1.0-alpha-8/doxia-decoration-model-1.0-alpha-8.pom
[INFO] Unable to find resource 'org.apache.maven.doxia:doxia-decoration-model:pom:1.0-alpha-8' in repository servicemix (http://svn.apache.org/repos/asf/servicemix/m2-repo)
Downloading: http://repo1.maven.org/maven2/org/apache/maven/doxia/doxia-decoration-model/1.0-alpha-8/doxia-decoration-model-1.0-alpha-8.pom

Downloading: http://repo1.maven.org/maven2/org/apache/maven/doxia/doxia-site-renderer/1.0-alpha-8/doxia-site-renderer-1.0-alpha-8.jar
Downloading: http://repo1.maven.org/maven2/org/apache/maven/shared/maven-dependency-analyzer/1.0/maven-dependency-analyzer-1.0.jar


Downloading: http://svn.apache.org/repos/asf/servicemix/m2-repo/org/apache/maven/doxia/doxia-decoration-model/1.0-alpha-8/doxia-decoration-model-1.0-alpha-8.jar
[INFO] Unable to find resource 'org.apache.maven.doxia:doxia-decoration-model:jar:1.0-alpha-8' in repository servicemix (http://svn.apache.org/repos/asf/servicemix/m2-repo)
Downloading: http://repo1.maven.org/maven2/org/apache/maven/doxia/doxia-decoration-model/1.0-alpha-8/doxia-decoration-model-1.0-alpha-8.jar

[INFO] [dependency:unpack {execution: unpack-unix}]
[INFO] Configured Artifact: org.apache.karaf:apache-karaf:?:zip
[INFO] snapshot org.apache.karaf:apache-karaf:2.2.2-SNAPSHOT: checking for updates from fusesource.snapshots
[INFO] snapshot org.apache.karaf:apache-karaf:2.2.2-SNAPSHOT: checking for updates from ops4j.sonatype.snapshots.deploy
[INFO] snapshot org.apache.karaf:apache-karaf:2.2.2-SNAPSHOT: checking for updates from apache.snapshots
Downloading: http://repository.apache.org/snapshots/org/apache/karaf/apache-karaf/2.2.2-SNAPSHOT/apache-karaf-2.2.2-20110628.113611-3.zip
[JENKINS] Archiving <https://builds.apache.org/job/Karaf-2.2.x/ws/karaf/demos/web/pom.xml> to /home/hudson/hudson/jobs/Karaf-2.2.x/modules/org.apache.karaf.demos$web/builds/2011-06-28_11-26-02/archive/org.apache.karaf.demos/web/2.2.2-SNAPSHOT/web-2.2.2-SNAPSHOT.pom
[INFO] ------------------------------------------------------------------------
[ERROR] BUILD ERROR
[INFO] ------------------------------------------------------------------------
[INFO] Failed to resolve artifact.

GroupId: org.apache.karaf
ArtifactId: apache-karaf
Version: 2.2.2-20110628.113611-3

Reason: Unable to locate resource in repository

Try downloading the file manually from the project website.

Then, install it using the command: 
    mvn install:install-file -DgroupId=org.apache.karaf -DartifactId=apache-karaf -Dversion=2.2.2-20110628.113611-3 -Dpackaging=zip -Dfile=/path/to/file

Alternatively, if you host your own repository you can deploy the file there: 
    mvn deploy:deploy-file -DgroupId=org.apache.karaf -DartifactId=apache-karaf -Dversion=2.2.2-20110628.113611-3 -Dpackaging=zip -Dfile=/path/to/file -Durl=[url] -DrepositoryId=[id]


  org.apache.karaf:apache-karaf:zip:2.2.2-20110628.113611-3

from the specified remote repositories:
  central (http://repo1.maven.org/maven2),
  fusesource.snapshots (http://repo.fusesource.com/nexus/content/repositories/snapshots),
  Nexus (http://repository.apache.org/snapshots),
  ops4j.sonatype.snapshots.deploy (https://oss.sonatype.org/content/repositories/ops4j-snapshots/),
  servicemix (http://svn.apache.org/repos/asf/servicemix/m2-repo)



[INFO] ------------------------------------------------------------------------
[INFO] Trace
org.apache.maven.lifecycle.LifecycleExecutionException: Unable to find artifact.
	at org.apache.maven.lifecycle.DefaultLifecycleExecutor.executeGoals(DefaultLifecycleExecutor.java:719)
	at org.apache.maven.lifecycle.DefaultLifecycleExecutor.executeGoalWithLifecycle(DefaultLifecycleExecutor.java:556)
	at org.apache.maven.lifecycle.DefaultLifecycleExecutor.executeGoal(DefaultLifecycleExecutor.java:535)
	at org.apache.maven.lifecycle.DefaultLifecycleExecutor.executeGoalAndHandleFailures(DefaultLifecycleExecutor.java:387)
	at org.apache.maven.lifecycle.DefaultLifecycleExecutor.executeTaskSegments(DefaultLifecycleExecutor.java:348)
	at org.apache.maven.lifecycle.DefaultLifecycleExecutor.execute(DefaultLifecycleExecutor.java:180)
	at org.apache.maven.lifecycle.LifecycleExecutorInterceptor.execute(LifecycleExecutorInterceptor.java:65)
	at org.apache.maven.DefaultMaven.doExecute(DefaultMaven.java:328)
	at org.apache.maven.DefaultMaven.execute(DefaultMaven.java:138)
	at org.apache.maven.cli.MavenCli.main(MavenCli.java:362)
	at sun.reflect.NativeMethodAccessorImpl.invoke0(Native Method)
	at sun.reflect.NativeMethodAccessorImpl.invoke(NativeMethodAccessorImpl.java:39)
	at sun.reflect.DelegatingMethodAccessorImpl.invoke(DelegatingMethodAccessorImpl.java:25)
	at java.lang.reflect.Method.invoke(Method.java:592)
	at org.codehaus.classworlds.Launcher.launchEnhanced(Launcher.java:315)
	at org.codehaus.classworlds.Launcher.launch(Launcher.java:255)
	at hudson.maven.agent.Main.launch(Main.java:185)
	at hudson.maven.MavenBuilder.call(MavenBuilder.java:164)
	at hudson.maven.MavenModuleSetBuild$Builder.call(MavenModuleSetBuild.java:987)
	at hudson.maven.MavenModuleSetBuild$Builder.call(MavenModuleSetBuild.java:918)
	at hudson.remoting.UserRequest.perform(UserRequest.java:118)
	at hudson.remoting.UserRequest.perform(UserRequest.java:48)
	at hudson.remoting.Request$2.run(Request.java:270)
	at java.util.concurrent.Executors$RunnableAdapter.call(Executors.java:417)
	at java.util.concurrent.FutureTask$Sync.innerRun(FutureTask.java:269)
	at java.util.concurrent.FutureTask.run(FutureTask.java:123)
	at java.util.concurrent.ThreadPoolExecutor$Worker.runTask(ThreadPoolExecutor.java:651)
	at java.util.concurrent.ThreadPoolExecutor$Worker.run(ThreadPoolExecutor.java:676)
	at java.lang.Thread.run(Thread.java:595)
Caused by: org.apache.maven.plugin.MojoExecutionException: Unable to find artifact.
	at org.apache.maven.plugin.dependency.fromConfiguration.AbstractFromConfigurationMojo.getArtifact(AbstractFromConfigurationMojo.java:250)
	at org.apache.maven.plugin.dependency.fromConfiguration.AbstractFromConfigurationMojo.getProcessedArtifactItems(AbstractFromConfigurationMojo.java:143)
	at org.apache.maven.plugin.dependency.fromConfiguration.UnpackMojo.getProcessedArtifactItems(UnpackMojo.java:138)
	at org.apache.maven.plugin.dependency.fromConfiguration.UnpackMojo.execute(UnpackMojo.java:88)
	at org.apache.maven.plugin.DefaultPluginManager.executeMojo(DefaultPluginManager.java:490)
	at hudson.maven.agent.PluginManagerInterceptor.executeMojo(PluginManagerInterceptor.java:182)
	at org.apache.maven.lifecycle.DefaultLifecycleExecutor.executeGoals(DefaultLifecycleExecutor.java:694)
	... 28 more
Caused by: org.apache.maven.artifact.resolver.ArtifactNotFoundException: Unable to locate resource in repository

Try downloading the file manually from the project website.

Then, install it using the command: 
    mvn install:install-file -DgroupId=org.apache.karaf -DartifactId=apache-karaf -Dversion=2.2.2-20110628.113611-3 -Dpackaging=zip -Dfile=/path/to/file

Alternatively, if you host your own repository you can deploy the file there: 
    mvn deploy:deploy-file -DgroupId=org.apache.karaf -DartifactId=apache-karaf -Dversion=2.2.2-20110628.113611-3 -Dpackaging=zip -Dfile=/path/to/file -Durl=[url] -DrepositoryId=[id]


  org.apache.karaf:apache-karaf:zip:2.2.2-20110628.113611-3

from the specified remote repositories:
  central (http://repo1.maven.org/maven2),
  fusesource.snapshots (http://repo.fusesource.com/nexus/content/repositories/snapshots),
  Nexus (http://repository.apache.org/snapshots),
  ops4j.sonatype.snapshots.deploy (https://oss.sonatype.org/content/repositories/ops4j-snapshots/),
  servicemix (http://svn.apache.org/repos/asf/servicemix/m2-repo)


	at org.apache.maven.artifact.resolver.DefaultArtifactResolver.resolve(DefaultArtifactResolver.java:228)
	at org.apache.maven.artifact.resolver.DefaultArtifactResolver.resolve(DefaultArtifactResolver.java:90)
	at org.apache.maven.plugin.dependency.fromConfiguration.AbstractFromConfigurationMojo.getArtifact(AbstractFromConfigurationMojo.java:242)
	... 34 more
Caused by: org.apache.maven.wagon.ResourceDoesNotExistException: Unable to locate resource in repository
	at org.apache.maven.wagon.providers.http.LightweightHttpWagon.fillInputData(LightweightHttpWagon.java:139)
	at org.apache.maven.wagon.StreamWagon.getInputStream(StreamWagon.java:116)
	at org.apache.maven.wagon.StreamWagon.getIfNewer(StreamWagon.java:88)
	at org.apache.maven.wagon.StreamWagon.get(StreamWagon.java:61)
	at org.apache.maven.artifact.manager.DefaultWagonManager.getRemoteFile(DefaultWagonManager.java:546)
	at org.apache.maven.artifact.manager.DefaultWagonManager.getArtifact(DefaultWagonManager.java:427)
	at org.apache.maven.artifact.resolver.DefaultArtifactResolver.resolve(DefaultArtifactResolver.java:212)
	... 36 more
Caused by: java.io.FileNotFoundException: http://repository.apache.org/snapshots/org/apache/karaf/apache-karaf/2.2.2-SNAPSHOT/apache-karaf-2.2.2-20110628.113611-3.zip
	at sun.reflect.GeneratedConstructorAccessor86.newInstance(Unknown Source)
	at sun.reflect.DelegatingConstructorAccessorImpl.newInstance(DelegatingConstructorAccessorImpl.java:27)
	at java.lang.reflect.Constructor.newInstance(Constructor.java:501)
	at sun.net.www.protocol.http.HttpURLConnection$6.run(HttpURLConnection.java:1250)
	at java.security.AccessController.doPrivileged(Native Method)
	at sun.net.www.protocol.http.HttpURLConnection.getChainedException(HttpURLConnection.java:1244)
	at sun.net.www.protocol.http.HttpURLConnection.getInputStream(HttpURLConnection.java:932)
	at org.apache.maven.wagon.providers.http.LightweightHttpWagon.fillInputData(LightweightHttpWagon.java:122)
	... 42 more
Caused by: java.io.FileNotFoundException: http://repository.apache.org/snapshots/org/apache/karaf/apache-karaf/2.2.2-SNAPSHOT/apache-karaf-2.2.2-20110628.113611-3.zip
	at sun.net.www.protocol.http.HttpURLConnection.getInputStream(HttpURLConnection.java:1194)
	at java.net.HttpURLConnection.getResponseCode(HttpURLConnection.java:367)
	at org.apache.maven.wagon.providers.http.LightweightHttpWagon.fillInputData(LightweightHttpWagon.java:115)
	... 42 more
[INFO] ------------------------------------------------------------------------
[INFO] Total time: 16 minutes 5 seconds
[INFO] Finished at: Tue Jun 28 11:42:36 UTC 2011
[INFO] Final Memory: 104M/312M
[INFO] ------------------------------------------------------------------------
Sending e-mails to: commits@karaf.apache.org
channel stopped


Build failed in Jenkins: Karaf-2.2.x #149

Posted by Apache Jenkins Server <je...@builds.apache.org>.
See <https://builds.apache.org/job/Karaf-2.2.x/149/changes>

Changes:

[ffang] [KARAF-690]install http feature will start both 8080 and 8181 jetty port

------------------------------------------
[...truncated 9050 lines...]

  Alternatively, if you host your own repository you can deploy the file there: 
      mvn deploy:deploy-file -DgroupId=org.ops4j.pax.exam -DartifactId=pax-exam-spi -Dversion=1.2.4 -Dpackaging=jar -Dfile=/path/to/file -Durl=[url] -DrepositoryId=[id]

  Path to dependency: 
  	1) org.apache.karaf.itests:dependencies:pom:2.2.2-SNAPSHOT
  	2) org.ops4j.pax.exam:pax-exam-container-default:jar:1.2.4
  	3) org.ops4j.pax.exam:pax-exam-spi:jar:1.2.4

----------
5 required artifacts are missing.

for artifact: 
  org.apache.karaf.itests:dependencies:pom:2.2.2-SNAPSHOT

from the specified remote repositories:
  central (http://repo1.maven.org/maven2),
  fusesource.snapshots (http://repo.fusesource.com/nexus/content/repositories/snapshots),
  Nexus (http://repository.apache.org/snapshots),
  ops4j.sonatype.snapshots.deploy (https://oss.sonatype.org/content/repositories/ops4j-snapshots/),
  servicemix (http://svn.apache.org/repos/asf/servicemix/m2-repo),
  pax-runner (http://osgi.sonatype.org/content/groups/pax-runner)



[INFO] ------------------------------------------------------------------------
[INFO] Trace
org.apache.maven.lifecycle.LifecycleExecutionException: Missing:
----------
1) commons-logging:commons-logging:jar:1.1

  Try downloading the file manually from the project website.

  Then, install it using the command: 
      mvn install:install-file -DgroupId=commons-logging -DartifactId=commons-logging -Dversion=1.1 -Dpackaging=jar -Dfile=/path/to/file

  Alternatively, if you host your own repository you can deploy the file there: 
      mvn deploy:deploy-file -DgroupId=commons-logging -DartifactId=commons-logging -Dversion=1.1 -Dpackaging=jar -Dfile=/path/to/file -Durl=[url] -DrepositoryId=[id]

  Path to dependency: 
  	1) org.apache.karaf.itests:dependencies:pom:2.2.2-SNAPSHOT
  	2) org.ops4j.pax.exam:pax-exam-container-default:jar:1.2.4
  	3) commons-logging:commons-logging:jar:1.1

2) org.ops4j.base:ops4j-base-net:jar:1.2.2

  Try downloading the file manually from the project website.

  Then, install it using the command: 
      mvn install:install-file -DgroupId=org.ops4j.base -DartifactId=ops4j-base-net -Dversion=1.2.2 -Dpackaging=jar -Dfile=/path/to/file

  Alternatively, if you host your own repository you can deploy the file there: 
      mvn deploy:deploy-file -DgroupId=org.ops4j.base -DartifactId=ops4j-base-net -Dversion=1.2.2 -Dpackaging=jar -Dfile=/path/to/file -Durl=[url] -DrepositoryId=[id]

  Path to dependency: 
  	1) org.apache.karaf.itests:dependencies:pom:2.2.2-SNAPSHOT
  	2) org.ops4j.pax.exam:pax-exam-container-default:jar:1.2.4
  	3) org.ops4j.base:ops4j-base-net:jar:1.2.2

3) org.apache.felix:org.apache.felix.main:jar:3.0.2

  Try downloading the file manually from the project website.

  Then, install it using the command: 
      mvn install:install-file -DgroupId=org.apache.felix -DartifactId=org.apache.felix.main -Dversion=3.0.2 -Dpackaging=jar -Dfile=/path/to/file

  Alternatively, if you host your own repository you can deploy the file there: 
      mvn deploy:deploy-file -DgroupId=org.apache.felix -DartifactId=org.apache.felix.main -Dversion=3.0.2 -Dpackaging=jar -Dfile=/path/to/file -Durl=[url] -DrepositoryId=[id]

  Path to dependency: 
  	1) org.apache.karaf.itests:dependencies:pom:2.2.2-SNAPSHOT
  	2) org.apache.felix:org.apache.felix.main:jar:3.0.2

4) org.ops4j.pax.exam:pax-exam-container-default:jar:1.2.4

  Try downloading the file manually from the project website.

  Then, install it using the command: 
      mvn install:install-file -DgroupId=org.ops4j.pax.exam -DartifactId=pax-exam-container-default -Dversion=1.2.4 -Dpackaging=jar -Dfile=/path/to/file

  Alternatively, if you host your own repository you can deploy the file there: 
      mvn deploy:deploy-file -DgroupId=org.ops4j.pax.exam -DartifactId=pax-exam-container-default -Dversion=1.2.4 -Dpackaging=jar -Dfile=/path/to/file -Durl=[url] -DrepositoryId=[id]

  Path to dependency: 
  	1) org.apache.karaf.itests:dependencies:pom:2.2.2-SNAPSHOT
  	2) org.ops4j.pax.exam:pax-exam-container-default:jar:1.2.4

5) org.ops4j.pax.exam:pax-exam-spi:jar:1.2.4

  Try downloading the file manually from the project website.

  Then, install it using the command: 
      mvn install:install-file -DgroupId=org.ops4j.pax.exam -DartifactId=pax-exam-spi -Dversion=1.2.4 -Dpackaging=jar -Dfile=/path/to/file

  Alternatively, if you host your own repository you can deploy the file there: 
      mvn deploy:deploy-file -DgroupId=org.ops4j.pax.exam -DartifactId=pax-exam-spi -Dversion=1.2.4 -Dpackaging=jar -Dfile=/path/to/file -Durl=[url] -DrepositoryId=[id]

  Path to dependency: 
  	1) org.apache.karaf.itests:dependencies:pom:2.2.2-SNAPSHOT
  	2) org.ops4j.pax.exam:pax-exam-container-default:jar:1.2.4
  	3) org.ops4j.pax.exam:pax-exam-spi:jar:1.2.4

----------
5 required artifacts are missing.

for artifact: 
  org.apache.karaf.itests:dependencies:pom:2.2.2-SNAPSHOT

from the specified remote repositories:
  central (http://repo1.maven.org/maven2),
  fusesource.snapshots (http://repo.fusesource.com/nexus/content/repositories/snapshots),
  Nexus (http://repository.apache.org/snapshots),
  ops4j.sonatype.snapshots.deploy (https://oss.sonatype.org/content/repositories/ops4j-snapshots/),
  servicemix (http://svn.apache.org/repos/asf/servicemix/m2-repo),
  pax-runner (http://osgi.sonatype.org/content/groups/pax-runner)


	at org.apache.maven.lifecycle.DefaultLifecycleExecutor.executeGoals(DefaultLifecycleExecutor.java:711)
	at org.apache.maven.lifecycle.DefaultLifecycleExecutor.executeGoalWithLifecycle(DefaultLifecycleExecutor.java:556)
	at org.apache.maven.lifecycle.DefaultLifecycleExecutor.executeGoal(DefaultLifecycleExecutor.java:535)
	at org.apache.maven.lifecycle.DefaultLifecycleExecutor.executeGoalAndHandleFailures(DefaultLifecycleExecutor.java:387)
	at org.apache.maven.lifecycle.DefaultLifecycleExecutor.executeTaskSegments(DefaultLifecycleExecutor.java:348)
	at org.apache.maven.lifecycle.DefaultLifecycleExecutor.execute(DefaultLifecycleExecutor.java:180)
	at org.apache.maven.lifecycle.LifecycleExecutorInterceptor.execute(LifecycleExecutorInterceptor.java:65)
	at org.apache.maven.DefaultMaven.doExecute(DefaultMaven.java:328)
	at org.apache.maven.DefaultMaven.execute(DefaultMaven.java:138)
	at org.apache.maven.cli.MavenCli.main(MavenCli.java:362)
	at sun.reflect.NativeMethodAccessorImpl.invoke0(Native Method)
	at sun.reflect.NativeMethodAccessorImpl.invoke(NativeMethodAccessorImpl.java:39)
	at sun.reflect.DelegatingMethodAccessorImpl.invoke(DelegatingMethodAccessorImpl.java:25)
	at java.lang.reflect.Method.invoke(Method.java:592)
	at org.codehaus.classworlds.Launcher.launchEnhanced(Launcher.java:315)
	at org.codehaus.classworlds.Launcher.launch(Launcher.java:255)
	at hudson.maven.agent.Main.launch(Main.java:185)
	at hudson.maven.MavenBuilder.call(MavenBuilder.java:164)
	at hudson.maven.MavenModuleSetBuild$Builder.call(MavenModuleSetBuild.java:987)
	at hudson.maven.MavenModuleSetBuild$Builder.call(MavenModuleSetBuild.java:918)
	at hudson.remoting.UserRequest.perform(UserRequest.java:118)
	at hudson.remoting.UserRequest.perform(UserRequest.java:48)
	at hudson.remoting.Request$2.run(Request.java:270)
	at java.util.concurrent.Executors$RunnableAdapter.call(Executors.java:417)
	at java.util.concurrent.FutureTask$Sync.innerRun(FutureTask.java:269)
	at java.util.concurrent.FutureTask.run(FutureTask.java:123)
	at java.util.concurrent.ThreadPoolExecutor$Worker.runTask(ThreadPoolExecutor.java:651)
	at java.util.concurrent.ThreadPoolExecutor$Worker.run(ThreadPoolExecutor.java:676)
	at java.lang.Thread.run(Thread.java:595)
Caused by: org.apache.maven.artifact.resolver.MultipleArtifactsNotFoundException: Missing:
----------
1) commons-logging:commons-logging:jar:1.1

  Try downloading the file manually from the project website.

  Then, install it using the command: 
      mvn install:install-file -DgroupId=commons-logging -DartifactId=commons-logging -Dversion=1.1 -Dpackaging=jar -Dfile=/path/to/file

  Alternatively, if you host your own repository you can deploy the file there: 
      mvn deploy:deploy-file -DgroupId=commons-logging -DartifactId=commons-logging -Dversion=1.1 -Dpackaging=jar -Dfile=/path/to/file -Durl=[url] -DrepositoryId=[id]

  Path to dependency: 
  	1) org.apache.karaf.itests:dependencies:pom:2.2.2-SNAPSHOT
  	2) org.ops4j.pax.exam:pax-exam-container-default:jar:1.2.4
  	3) commons-logging:commons-logging:jar:1.1

2) org.ops4j.base:ops4j-base-net:jar:1.2.2

  Try downloading the file manually from the project website.

  Then, install it using the command: 
      mvn install:install-file -DgroupId=org.ops4j.base -DartifactId=ops4j-base-net -Dversion=1.2.2 -Dpackaging=jar -Dfile=/path/to/file

  Alternatively, if you host your own repository you can deploy the file there: 
      mvn deploy:deploy-file -DgroupId=org.ops4j.base -DartifactId=ops4j-base-net -Dversion=1.2.2 -Dpackaging=jar -Dfile=/path/to/file -Durl=[url] -DrepositoryId=[id]

  Path to dependency: 
  	1) org.apache.karaf.itests:dependencies:pom:2.2.2-SNAPSHOT
  	2) org.ops4j.pax.exam:pax-exam-container-default:jar:1.2.4
  	3) org.ops4j.base:ops4j-base-net:jar:1.2.2

3) org.apache.felix:org.apache.felix.main:jar:3.0.2

  Try downloading the file manually from the project website.

  Then, install it using the command: 
      mvn install:install-file -DgroupId=org.apache.felix -DartifactId=org.apache.felix.main -Dversion=3.0.2 -Dpackaging=jar -Dfile=/path/to/file

  Alternatively, if you host your own repository you can deploy the file there: 
      mvn deploy:deploy-file -DgroupId=org.apache.felix -DartifactId=org.apache.felix.main -Dversion=3.0.2 -Dpackaging=jar -Dfile=/path/to/file -Durl=[url] -DrepositoryId=[id]

  Path to dependency: 
  	1) org.apache.karaf.itests:dependencies:pom:2.2.2-SNAPSHOT
  	2) org.apache.felix:org.apache.felix.main:jar:3.0.2

4) org.ops4j.pax.exam:pax-exam-container-default:jar:1.2.4

  Try downloading the file manually from the project website.

  Then, install it using the command: 
      mvn install:install-file -DgroupId=org.ops4j.pax.exam -DartifactId=pax-exam-container-default -Dversion=1.2.4 -Dpackaging=jar -Dfile=/path/to/file

  Alternatively, if you host your own repository you can deploy the file there: 
      mvn deploy:deploy-file -DgroupId=org.ops4j.pax.exam -DartifactId=pax-exam-container-default -Dversion=1.2.4 -Dpackaging=jar -Dfile=/path/to/file -Durl=[url] -DrepositoryId=[id]

  Path to dependency: 
  	1) org.apache.karaf.itests:dependencies:pom:2.2.2-SNAPSHOT
  	2) org.ops4j.pax.exam:pax-exam-container-default:jar:1.2.4

5) org.ops4j.pax.exam:pax-exam-spi:jar:1.2.4

  Try downloading the file manually from the project website.

  Then, install it using the command: 
      mvn install:install-file -DgroupId=org.ops4j.pax.exam -DartifactId=pax-exam-spi -Dversion=1.2.4 -Dpackaging=jar -Dfile=/path/to/file

  Alternatively, if you host your own repository you can deploy the file there: 
      mvn deploy:deploy-file -DgroupId=org.ops4j.pax.exam -DartifactId=pax-exam-spi -Dversion=1.2.4 -Dpackaging=jar -Dfile=/path/to/file -Durl=[url] -DrepositoryId=[id]

  Path to dependency: 
  	1) org.apache.karaf.itests:dependencies:pom:2.2.2-SNAPSHOT
  	2) org.ops4j.pax.exam:pax-exam-container-default:jar:1.2.4
  	3) org.ops4j.pax.exam:pax-exam-spi:jar:1.2.4

----------
5 required artifacts are missing.

for artifact: 
  org.apache.karaf.itests:dependencies:pom:2.2.2-SNAPSHOT

from the specified remote repositories:
  central (http://repo1.maven.org/maven2),
  fusesource.snapshots (http://repo.fusesource.com/nexus/content/repositories/snapshots),
  Nexus (http://repository.apache.org/snapshots),
  ops4j.sonatype.snapshots.deploy (https://oss.sonatype.org/content/repositories/ops4j-snapshots/),
  servicemix (http://svn.apache.org/repos/asf/servicemix/m2-repo),
  pax-runner (http://osgi.sonatype.org/content/groups/pax-runner)


	at org.apache.maven.artifact.resolver.DefaultArtifactResolver.resolveTransitively(DefaultArtifactResolver.java:360)
	at org.apache.maven.artifact.resolver.DefaultArtifactResolver.resolveTransitively(DefaultArtifactResolver.java:304)
	at org.apache.maven.plugin.DefaultPluginManager.resolveTransitiveDependencies(DefaultPluginManager.java:1499)
	at org.apache.maven.plugin.DefaultPluginManager.executeMojo(DefaultPluginManager.java:442)
	at hudson.maven.agent.PluginManagerInterceptor.executeMojo(PluginManagerInterceptor.java:182)
	at org.apache.maven.lifecycle.DefaultLifecycleExecutor.executeGoals(DefaultLifecycleExecutor.java:694)
	... 28 more
[INFO] ------------------------------------------------------------------------
[INFO] Total time: 25 minutes 33 seconds
[INFO] Finished at: Tue Jun 28 09:46:32 UTC 2011
[INFO] Final Memory: 102M/343M
[INFO] ------------------------------------------------------------------------
channel stopped


Jenkins build is unstable: Karaf-2.2.x #148

Posted by Apache Jenkins Server <je...@builds.apache.org>.
See <https://builds.apache.org/job/Karaf-2.2.x/148/>



Build failed in Jenkins: Karaf-2.2.x #147

Posted by Apache Jenkins Server <je...@builds.apache.org>.
See <https://builds.apache.org/job/Karaf-2.2.x/147/>

------------------------------------------
Started by an SCM change
Building remotely on ubuntu1
hudson.util.IOException2: remote file operation failed: <https://builds.apache.org/job/Karaf-2.2.x/ws/> at hudson.remoting.Channel@5a139925:ubuntu1
	at hudson.FilePath.act(FilePath.java:754)
	at hudson.FilePath.act(FilePath.java:740)
	at hudson.scm.SubversionSCM.checkout(SubversionSCM.java:684)
	at hudson.scm.SubversionSCM.checkout(SubversionSCM.java:633)
	at hudson.model.AbstractProject.checkout(AbstractProject.java:1181)
	at hudson.model.AbstractBuild$AbstractRunner.checkout(AbstractBuild.java:536)
	at hudson.model.AbstractBuild$AbstractRunner.run(AbstractBuild.java:424)
	at hudson.model.Run.run(Run.java:1374)
	at hudson.maven.MavenModuleSetBuild.run(MavenModuleSetBuild.java:467)
	at hudson.model.ResourceController.execute(ResourceController.java:88)
	at hudson.model.Executor.run(Executor.java:145)
Caused by: java.io.IOException: Remote call on ubuntu1 failed
	at hudson.remoting.Channel.call(Channel.java:670)
	at hudson.FilePath.act(FilePath.java:747)
	... 10 more
Caused by: java.lang.LinkageError: loader (instance of  hudson/remoting/RemoteClassLoader): attempted  duplicate class definition for name: "hudson/model/Descriptor"
	at java.lang.ClassLoader.defineClass1(Native Method)
	at java.lang.ClassLoader.defineClass(ClassLoader.java:634)
	at java.lang.ClassLoader.defineClass(ClassLoader.java:480)
	at hudson.remoting.RemoteClassLoader.loadClassFile(RemoteClassLoader.java:151)
	at hudson.remoting.RemoteClassLoader.findClass(RemoteClassLoader.java:131)
	at java.lang.ClassLoader.loadClass(ClassLoader.java:321)
	at java.lang.ClassLoader.loadClass(ClassLoader.java:266)
	at java.lang.Class.getDeclaredFields0(Native Method)
	at java.lang.Class.privateGetDeclaredFields(Class.java:2308)
	at java.lang.Class.getDeclaredField(Class.java:1897)
	at java.io.ObjectStreamClass.getDeclaredSUID(ObjectStreamClass.java:1627)
	at java.io.ObjectStreamClass.access$700(ObjectStreamClass.java:69)
	at java.io.ObjectStreamClass$2.run(ObjectStreamClass.java:442)
	at java.security.AccessController.doPrivileged(Native Method)
	at java.io.ObjectStreamClass.<init>(ObjectStreamClass.java:430)
	at java.io.ObjectStreamClass.lookup(ObjectStreamClass.java:327)
	at java.io.ObjectStreamClass.initNonProxy(ObjectStreamClass.java:564)
	at java.io.ObjectInputStream.readNonProxyDesc(ObjectInputStream.java:1600)
	at java.io.ObjectInputStream.readClassDesc(ObjectInputStream.java:1513)
	at java.io.ObjectInputStream.readNonProxyDesc(ObjectInputStream.java:1600)
	at java.io.ObjectInputStream.readClassDesc(ObjectInputStream.java:1513)
	at java.io.ObjectInputStream.readOrdinaryObject(ObjectInputStream.java:1749)
	at java.io.ObjectInputStream.readObject0(ObjectInputStream.java:1346)
	at java.io.ObjectInputStream.defaultReadFields(ObjectInputStream.java:1963)
	at java.io.ObjectInputStream.readSerialData(ObjectInputStream.java:1887)
	at java.io.ObjectInputStream.readOrdinaryObject(ObjectInputStream.java:1770)
	at java.io.ObjectInputStream.readObject0(ObjectInputStream.java:1346)
	at java.io.ObjectInputStream.defaultReadFields(ObjectInputStream.java:1963)
	at java.io.ObjectInputStream.readSerialData(ObjectInputStream.java:1887)
	at java.io.ObjectInputStream.readOrdinaryObject(ObjectInputStream.java:1770)
	at java.io.ObjectInputStream.readObject0(ObjectInputStream.java:1346)
	at java.io.ObjectInputStream.defaultReadFields(ObjectInputStream.java:1963)
	at java.io.ObjectInputStream.readSerialData(ObjectInputStream.java:1887)
	at java.io.ObjectInputStream.readOrdinaryObject(ObjectInputStream.java:1770)
	at java.io.ObjectInputStream.readObject0(ObjectInputStream.java:1346)
	at java.io.ObjectInputStream.readObject(ObjectInputStream.java:368)
	at hudson.remoting.UserRequest.deserialize(UserRequest.java:182)
	at hudson.remoting.UserRequest.perform(UserRequest.java:98)
	at hudson.remoting.UserRequest.perform(UserRequest.java:48)
	at hudson.remoting.Request$2.run(Request.java:270)
	at java.util.concurrent.Executors$RunnableAdapter.call(Executors.java:471)
	at java.util.concurrent.FutureTask$Sync.innerRun(FutureTask.java:334)
	at java.util.concurrent.FutureTask.run(FutureTask.java:166)
	at java.util.concurrent.ThreadPoolExecutor.runWorker(ThreadPoolExecutor.java:1110)
	at java.util.concurrent.ThreadPoolExecutor$Worker.run(ThreadPoolExecutor.java:603)
	at java.lang.Thread.run(Thread.java:636)