You are viewing a plain text version of this content. The canonical link for it is here.
Posted to notifications@qpid.apache.org by Apache Jenkins Server <je...@builds.apache.org> on 2026/03/25 03:46:05 UTC

Build failed in Jenkins: Qpid » Qpid-ProtonJ2-Deploy #69

See <https://ci-builds.apache.org/job/Qpid/job/Qpid-ProtonJ2-Deploy/69/display/redirect?page=changes>

Changes:

[tabish121] PROTON-2924 Move to Java 17 as minimum version

[tabish121] PROTON-2923 Move to Netty 4.2.x as base Netty version

[tabish121] PROTON-2925 Update instanceof checks to use patterns


------------------------------------------
[...truncated 10.22 KiB...]
[INFO] --- remote-resources:3.3.0:process (process-resource-bundles) @ protonj2-parent ---
[INFO] Preparing remote bundle org.apache.apache.resources:apache-jar-resource-bundle:1.7
[INFO] Copying 3 resources from 1 bundle.
[INFO] 
[INFO] --- assembly:3.8.0:single (source-release-assembly) @ protonj2-parent ---
[INFO] Assemblies have been skipped per configuration of the skipAssembly parameter.
[INFO] 
[INFO] --- source:3.4.0:jar-no-fork (attach-sources) @ protonj2-parent ---
[INFO] 
[INFO] --- javadoc:3.12.0:jar (attach-javadocs) @ protonj2-parent ---
[INFO] Not executing Javadoc as the project is not a Java classpath-capable package
[INFO] 
[INFO] --- checksum:1.11:artifacts (source-release-checksum) @ protonj2-parent ---
[INFO] 
[INFO] --- gpg:3.2.8:sign (sign-release-artifacts) @ protonj2-parent ---
[INFO] Downloading from central: https://repo.maven.apache.org/maven2/org/bouncycastle/bcprov-jdk18on/maven-metadata.xml
[INFO] Downloaded from central: https://repo.maven.apache.org/maven2/org/bouncycastle/bcprov-jdk18on/maven-metadata.xml (758 B at 1.4 kB/s)
[INFO] Downloading from central: https://repo.maven.apache.org/maven2/org/bouncycastle/bcutil-jdk18on/maven-metadata.xml
[INFO] Downloaded from central: https://repo.maven.apache.org/maven2/org/bouncycastle/bcutil-jdk18on/maven-metadata.xml (758 B at 24 kB/s)
[INFO] 
[INFO] --- install:3.1.4:install (default-install) @ protonj2-parent ---
[INFO] Installing <https://ci-builds.apache.org/job/Qpid/job/Qpid-ProtonJ2-Deploy/ws/pom.xml> to /home/jenkins/.m2/repository/org/apache/qpid/protonj2-parent/2.0.0-SNAPSHOT/protonj2-parent-2.0.0-SNAPSHOT.pom
[INFO] 
[INFO] --- deploy:3.1.4:deploy (default-deploy) @ protonj2-parent ---
[INFO] Downloading from apache.snapshots.https: https://repository.apache.org/content/repositories/snapshots/org/apache/qpid/protonj2-parent/2.0.0-SNAPSHOT/maven-metadata.xml
[INFO] Uploading to apache.snapshots.https: https://repository.apache.org/content/repositories/snapshots/org/apache/qpid/protonj2-parent/2.0.0-SNAPSHOT/protonj2-parent-2.0.0-20260325.034458-1.pom
[INFO] Uploaded to apache.snapshots.https: https://repository.apache.org/content/repositories/snapshots/org/apache/qpid/protonj2-parent/2.0.0-SNAPSHOT/protonj2-parent-2.0.0-20260325.034458-1.pom (13 kB at 12 kB/s)
[INFO] Downloading from apache.snapshots.https: https://repository.apache.org/content/repositories/snapshots/org/apache/qpid/protonj2-parent/maven-metadata.xml
[INFO] Downloaded from apache.snapshots.https: https://repository.apache.org/content/repositories/snapshots/org/apache/qpid/protonj2-parent/maven-metadata.xml (434 B at 2.4 kB/s)
[INFO] Uploading to apache.snapshots.https: https://repository.apache.org/content/repositories/snapshots/org/apache/qpid/protonj2-parent/2.0.0-SNAPSHOT/maven-metadata.xml
[INFO] Uploaded to apache.snapshots.https: https://repository.apache.org/content/repositories/snapshots/org/apache/qpid/protonj2-parent/2.0.0-SNAPSHOT/maven-metadata.xml (607 B at 572 B/s)
[INFO] Uploading to apache.snapshots.https: https://repository.apache.org/content/repositories/snapshots/org/apache/qpid/protonj2-parent/maven-metadata.xml
[INFO] Uploaded to apache.snapshots.https: https://repository.apache.org/content/repositories/snapshots/org/apache/qpid/protonj2-parent/maven-metadata.xml (474 B at 448 B/s)
[WARNING] Attempt to (de-)serialize anonymous class org.jfrog.hudson.maven2.MavenDependenciesRecorder$1; see: https://jenkins.io/redirect/serialization-of-anonymous-classes/
[INFO] 
[INFO] ----------------< org.apache.qpid:protonj2-test-driver >----------------
[INFO] Building Qpid ProtonJ2 AMQP Test Driver 2.0.0-SNAPSHOT             [2/8]
[INFO]   from protonj2-test-driver/pom.xml
[INFO] --------------------------------[ jar ]---------------------------------
[INFO] 
[INFO] --- clean:3.5.0:clean (default-clean) @ protonj2-test-driver ---
[INFO] 
[INFO] --- enforcer:3.6.2:enforce (enforce-maven-version) @ protonj2-test-driver ---
[INFO] 
[INFO] --- enforcer:3.6.2:enforce (enforce-java-version) @ protonj2-test-driver ---
[INFO] 
[INFO] --- jacoco:0.8.14:prepare-agent (default) @ protonj2-test-driver ---
[INFO] jacoco-config set to -javaagent:/home/jenkins/.m2/repository/org/jacoco/org.jacoco.agent/0.8.14/org.jacoco.agent-0.8.14-runtime.jar=destfile=<https://ci-builds.apache.org/job/Qpid/job/Qpid-ProtonJ2-Deploy/ws/protonj2-test-driver/target/jacoco.exec>
[INFO] 
[INFO] --- remote-resources:3.3.0:process (process-resource-bundles) @ protonj2-test-driver ---
[INFO] Preparing remote bundle org.apache.apache.resources:apache-jar-resource-bundle:1.7
[INFO] Copying 3 resources from 1 bundle.
[INFO] 
[INFO] --- resources:3.4.0:resources (default-resources) @ protonj2-test-driver ---
[INFO] skip non existing resourceDirectory <https://ci-builds.apache.org/job/Qpid/job/Qpid-ProtonJ2-Deploy/ws/protonj2-test-driver/src/main/resources>
[INFO] Copying 3 resources from target/maven-shared-archive-resources to target/classes
[INFO] 
[INFO] --- compiler:3.14.1:compile (default-compile) @ protonj2-test-driver ---
[INFO] Recompiling the module because of changed source code.
[INFO] Compiling 239 source files with javac [forked debug deprecation release 17] to target/classes
[INFO] -------------------------------------------------------------
[ERROR] COMPILATION ERROR : 
[INFO] -------------------------------------------------------------
[ERROR] error: release version 17 not supported
[INFO] 1 error
[INFO] -------------------------------------------------------------
[INFO] 
[INFO] ------------------------------------------------------------------------
[INFO] Skipping Qpid ProtonJ2 AMQP Protocol Library
[INFO] This project has been banned from the build due to previous failures.
[INFO] ------------------------------------------------------------------------
[INFO] 
[INFO] ------------------------------------------------------------------------
[INFO] Skipping Qpid ProtonJ2 Client Library
[INFO] This project has been banned from the build due to previous failures.
[INFO] ------------------------------------------------------------------------
[INFO] 
[INFO] ------------------------------------------------------------------------
[INFO] Skipping Qpid ProtonJ2 Client Examples
[INFO] This project has been banned from the build due to previous failures.
[INFO] ------------------------------------------------------------------------
[INFO] 
[INFO] ----------------< org.apache.qpid:protonj2-client-docs >----------------
[INFO] Building Qpid ProtonJ2 Client Documentation 2.0.0-SNAPSHOT         [3/8]
[INFO]   from protonj2-client-docs/pom.xml
[INFO] --------------------------------[ pom ]---------------------------------
[INFO] 
[INFO] --- clean:3.5.0:clean (default-clean) @ protonj2-client-docs ---
[INFO] 
[INFO] --- enforcer:3.6.2:enforce (enforce-maven-version) @ protonj2-client-docs ---
[INFO] 
[INFO] --- enforcer:3.6.2:enforce (enforce-java-version) @ protonj2-client-docs ---
[INFO] 
[INFO] --- jacoco:0.8.14:prepare-agent (default) @ protonj2-client-docs ---
[INFO] Skipping JaCoCo execution because property jacoco.skip is set.
[INFO] 
[INFO] --- remote-resources:3.3.0:process (process-resource-bundles) @ protonj2-client-docs ---
[INFO] Preparing remote bundle org.apache.apache.resources:apache-jar-resource-bundle:1.7
[INFO] Copying 3 resources from 1 bundle.
[INFO] 
[INFO] --- assembly:3.8.0:single (source-release-assembly) @ protonj2-client-docs ---
[INFO] Assemblies have been skipped per configuration of the skipAssembly parameter.
[INFO] 
[INFO] --- source:3.4.0:jar-no-fork (attach-sources) @ protonj2-client-docs ---
[INFO] 
[INFO] --- javadoc:3.12.0:jar (attach-javadocs) @ protonj2-client-docs ---
[INFO] Not executing Javadoc as the project is not a Java classpath-capable package
[INFO] 
[INFO] --- checksum:1.11:artifacts (source-release-checksum) @ protonj2-client-docs ---
[INFO] 
[INFO] --- gpg:3.2.8:sign (sign-release-artifacts) @ protonj2-client-docs ---
[INFO] 
[INFO] --- install:3.1.4:install (default-install) @ protonj2-client-docs ---
[INFO] Installing <https://ci-builds.apache.org/job/Qpid/job/Qpid-ProtonJ2-Deploy/ws/protonj2-client-docs/pom.xml> to /home/jenkins/.m2/repository/org/apache/qpid/protonj2-client-docs/2.0.0-SNAPSHOT/protonj2-client-docs-2.0.0-SNAPSHOT.pom
[INFO] 
[INFO] --- deploy:3.1.4:deploy (default-deploy) @ protonj2-client-docs ---
[INFO] Skipping artifact deployment
[INFO] 
[INFO] ------------------------------------------------------------------------
[INFO] Skipping Apache Qpid ProtonJ2
[INFO] This project has been banned from the build due to previous failures.
[INFO] ------------------------------------------------------------------------
[INFO] 
[INFO] ------------------------------------------------------------------------
[INFO] Skipping Qpid ProtonJ2 JMH Performance Tests
[INFO] This project has been banned from the build due to previous failures.
[INFO] ------------------------------------------------------------------------
[INFO] ------------------------------------------------------------------------
[INFO] Reactor Summary for Qpid ProtonJ2 Parent 2.0.0-SNAPSHOT:
[INFO] 
[INFO] Qpid ProtonJ2 Parent ............................... SUCCESS [ 21.657 s]
[INFO] Qpid ProtonJ2 AMQP Test Driver ..................... FAILURE [  5.183 s]
[INFO] Qpid ProtonJ2 AMQP Protocol Library ................ SKIPPED
[INFO] Qpid ProtonJ2 Client Library ....................... SKIPPED
[INFO] Qpid ProtonJ2 Client Examples ...................... SKIPPED
[INFO] Qpid ProtonJ2 Client Documentation ................. SUCCESS [  4.626 s]
[INFO] Apache Qpid ProtonJ2 ............................... SKIPPED
[INFO] Qpid ProtonJ2 JMH Performance Tests ................ SKIPPED
[INFO] ------------------------------------------------------------------------
[INFO] BUILD FAILURE
[INFO] ------------------------------------------------------------------------
[INFO] Total time:  50.732 s
[INFO] Finished at: 2026-03-25T03:45:49Z
[INFO] ------------------------------------------------------------------------
Waiting for Jenkins to finish collecting data
[ERROR] Failed to execute goal org.apache.maven.plugins:maven-compiler-plugin:3.14.1:compile (default-compile) on project protonj2-test-driver: Compilation failure
[ERROR] error: release version 17 not supported
[ERROR] -> [Help 1]
org.apache.maven.lifecycle.LifecycleExecutionException: Failed to execute goal org.apache.maven.plugins:maven-compiler-plugin:3.14.1:compile (default-compile) on project protonj2-test-driver: Compilation failure
error: release version 17 not supported

    at org.apache.maven.lifecycle.internal.MojoExecutor.doExecute2 (MojoExecutor.java:333)
    at org.apache.maven.lifecycle.internal.MojoExecutor.doExecute (MojoExecutor.java:316)
    at org.apache.maven.lifecycle.internal.MojoExecutor.execute (MojoExecutor.java:212)
    at org.apache.maven.lifecycle.internal.MojoExecutor.execute (MojoExecutor.java:174)
    at org.apache.maven.lifecycle.internal.MojoExecutor.access$000 (MojoExecutor.java:75)
    at org.apache.maven.lifecycle.internal.MojoExecutor$1.run (MojoExecutor.java:162)
    at org.apache.maven.plugin.DefaultMojosExecutionStrategy.execute (DefaultMojosExecutionStrategy.java:39)
    at org.apache.maven.lifecycle.internal.MojoExecutor.execute (MojoExecutor.java:159)
    at org.apache.maven.lifecycle.internal.LifecycleModuleBuilder.buildProject (LifecycleModuleBuilder.java:105)
    at org.apache.maven.lifecycle.internal.LifecycleModuleBuilder.buildProject (LifecycleModuleBuilder.java:73)
    at org.apache.maven.lifecycle.internal.builder.singlethreaded.SingleThreadedBuilder.build (SingleThreadedBuilder.java:53)
    at org.apache.maven.lifecycle.internal.LifecycleStarter.execute (LifecycleStarter.java:118)
    at org.apache.maven.DefaultMaven.doExecute (DefaultMaven.java:261)
    at org.apache.maven.DefaultMaven.doExecute (DefaultMaven.java:173)
    at org.apache.maven.DefaultMaven.execute (DefaultMaven.java:101)
    at org.jvnet.hudson.maven3.launcher.Maven35Launcher.main (Maven35Launcher.java:138)
    at jdk.internal.reflect.NativeMethodAccessorImpl.invoke0 (Native Method)
    at jdk.internal.reflect.NativeMethodAccessorImpl.invoke (NativeMethodAccessorImpl.java:77)
    at jdk.internal.reflect.DelegatingMethodAccessorImpl.invoke (DelegatingMethodAccessorImpl.java:43)
    at java.lang.reflect.Method.invoke (Method.java:569)
    at org.codehaus.plexus.classworlds.launcher.Launcher.launchEnhanced (Launcher.java:255)
    at org.codehaus.plexus.classworlds.launcher.Launcher.launch (Launcher.java:201)
    at jenkins.maven3.agent.Maven35Main.launch (Maven35Main.java:179)
    at jdk.internal.reflect.NativeMethodAccessorImpl.invoke0 (Native Method)
    at jdk.internal.reflect.NativeMethodAccessorImpl.invoke (NativeMethodAccessorImpl.java:77)
    at jdk.internal.reflect.DelegatingMethodAccessorImpl.invoke (DelegatingMethodAccessorImpl.java:43)
    at java.lang.reflect.Method.invoke (Method.java:569)
    at hudson.maven.Maven3Builder.call (Maven3Builder.java:140)
    at hudson.maven.Maven3Builder.call (Maven3Builder.java:71)
    at hudson.remoting.UserRequest.perform (UserRequest.java:225)
    at hudson.remoting.UserRequest.perform (UserRequest.java:50)
    at hudson.remoting.Request$2.run (Request.java:391)
    at hudson.remoting.InterceptingExecutorService.lambda$wrap$0 (InterceptingExecutorService.java:81)
    at java.util.concurrent.FutureTask.run (FutureTask.java:264)
    at java.util.concurrent.ThreadPoolExecutor.runWorker (ThreadPoolExecutor.java:1136)
    at java.util.concurrent.ThreadPoolExecutor$Worker.run (ThreadPoolExecutor.java:635)
    at java.lang.Thread.run (Thread.java:840)
Caused by: org.apache.maven.plugin.compiler.CompilationFailureException: Compilation failure
error: release version 17 not supported

    at org.apache.maven.plugin.compiler.AbstractCompilerMojo.executeReal (AbstractCompilerMojo.java:1318)
    at org.apache.maven.plugin.compiler.AbstractCompilerMojo.execute (AbstractCompilerMojo.java:708)
    at org.apache.maven.plugin.compiler.CompilerMojo.execute (CompilerMojo.java:235)
    at org.apache.maven.plugin.DefaultBuildPluginManager.executeMojo (DefaultBuildPluginManager.java:126)
    at org.apache.maven.lifecycle.internal.MojoExecutor.doExecute2 (MojoExecutor.java:328)
    at org.apache.maven.lifecycle.internal.MojoExecutor.doExecute (MojoExecutor.java:316)
    at org.apache.maven.lifecycle.internal.MojoExecutor.execute (MojoExecutor.java:212)
    at org.apache.maven.lifecycle.internal.MojoExecutor.execute (MojoExecutor.java:174)
    at org.apache.maven.lifecycle.internal.MojoExecutor.access$000 (MojoExecutor.java:75)
    at org.apache.maven.lifecycle.internal.MojoExecutor$1.run (MojoExecutor.java:162)
    at org.apache.maven.plugin.DefaultMojosExecutionStrategy.execute (DefaultMojosExecutionStrategy.java:39)
    at org.apache.maven.lifecycle.internal.MojoExecutor.execute (MojoExecutor.java:159)
    at org.apache.maven.lifecycle.internal.LifecycleModuleBuilder.buildProject (LifecycleModuleBuilder.java:105)
    at org.apache.maven.lifecycle.internal.LifecycleModuleBuilder.buildProject (LifecycleModuleBuilder.java:73)
    at org.apache.maven.lifecycle.internal.builder.singlethreaded.SingleThreadedBuilder.build (SingleThreadedBuilder.java:53)
    at org.apache.maven.lifecycle.internal.LifecycleStarter.execute (LifecycleStarter.java:118)
    at org.apache.maven.DefaultMaven.doExecute (DefaultMaven.java:261)
    at org.apache.maven.DefaultMaven.doExecute (DefaultMaven.java:173)
    at org.apache.maven.DefaultMaven.execute (DefaultMaven.java:101)
    at org.jvnet.hudson.maven3.launcher.Maven35Launcher.main (Maven35Launcher.java:138)
    at jdk.internal.reflect.NativeMethodAccessorImpl.invoke0 (Native Method)
    at jdk.internal.reflect.NativeMethodAccessorImpl.invoke (NativeMethodAccessorImpl.java:77)
    at jdk.internal.reflect.DelegatingMethodAccessorImpl.invoke (DelegatingMethodAccessorImpl.java:43)
    at java.lang.reflect.Method.invoke (Method.java:569)
    at org.codehaus.plexus.classworlds.launcher.Launcher.launchEnhanced (Launcher.java:255)
    at org.codehaus.plexus.classworlds.launcher.Launcher.launch (Launcher.java:201)
    at jenkins.maven3.agent.Maven35Main.launch (Maven35Main.java:179)
    at jdk.internal.reflect.NativeMethodAccessorImpl.invoke0 (Native Method)
    at jdk.internal.reflect.NativeMethodAccessorImpl.invoke (NativeMethodAccessorImpl.java:77)
    at jdk.internal.reflect.DelegatingMethodAccessorImpl.invoke (DelegatingMethodAccessorImpl.java:43)
    at java.lang.reflect.Method.invoke (Method.java:569)
    at hudson.maven.Maven3Builder.call (Maven3Builder.java:140)
    at hudson.maven.Maven3Builder.call (Maven3Builder.java:71)
    at hudson.remoting.UserRequest.perform (UserRequest.java:225)
    at hudson.remoting.UserRequest.perform (UserRequest.java:50)
    at hudson.remoting.Request$2.run (Request.java:391)
    at hudson.remoting.InterceptingExecutorService.lambda$wrap$0 (InterceptingExecutorService.java:81)
    at java.util.concurrent.FutureTask.run (FutureTask.java:264)
    at java.util.concurrent.ThreadPoolExecutor.runWorker (ThreadPoolExecutor.java:1136)
    at java.util.concurrent.ThreadPoolExecutor$Worker.run (ThreadPoolExecutor.java:635)
    at java.lang.Thread.run (Thread.java:840)
[ERROR] 
[ERROR] Re-run Maven using the -X switch to enable full debug logging.
[ERROR] 
[ERROR] For more information about the errors and possible solutions, please read the following articles:
[ERROR] [Help 1] http://cwiki.apache.org/confluence/display/MAVEN/MojoFailureException
[ERROR] 
[ERROR] After correcting the problems, you can resume the build with the command
[ERROR]   mvn <goals> -rf :protonj2-test-driver
[JENKINS] Archiving <https://ci-builds.apache.org/job/Qpid/job/Qpid-ProtonJ2-Deploy/ws/apache-qpid-protonj2/pom.xml> to org.apache.qpid/apache-qpid-protonj2/2.0.0-SNAPSHOT/apache-qpid-protonj2-2.0.0-SNAPSHOT.pom
[JENKINS] Archiving <https://ci-builds.apache.org/job/Qpid/job/Qpid-ProtonJ2-Deploy/ws/pom.xml> to org.apache.qpid/protonj2-parent/2.0.0-SNAPSHOT/protonj2-parent-2.0.0-SNAPSHOT.pom
[JENKINS] Archiving <https://ci-builds.apache.org/job/Qpid/job/Qpid-ProtonJ2-Deploy/ws/protonj2/pom.xml> to org.apache.qpid/protonj2/2.0.0-SNAPSHOT/protonj2-2.0.0-SNAPSHOT.pom
[JENKINS] Archiving <https://ci-builds.apache.org/job/Qpid/job/Qpid-ProtonJ2-Deploy/ws/protonj2-client-examples/pom.xml> to org.apache.qpid/protonj2-client-examples/2.0.0-SNAPSHOT/protonj2-client-examples-2.0.0-SNAPSHOT.pom
[JENKINS] Archiving <https://ci-builds.apache.org/job/Qpid/job/Qpid-ProtonJ2-Deploy/ws/protonj2-performance-tests/pom.xml> to org.apache.qpid/protonj2-performance-tests/2.0.0-SNAPSHOT/protonj2-performance-tests-2.0.0-SNAPSHOT.pom
[JENKINS] Archiving <https://ci-builds.apache.org/job/Qpid/job/Qpid-ProtonJ2-Deploy/ws/protonj2-client-docs/pom.xml> to org.apache.qpid/protonj2-client-docs/2.0.0-SNAPSHOT/protonj2-client-docs-2.0.0-SNAPSHOT.pom
[JENKINS] Archiving <https://ci-builds.apache.org/job/Qpid/job/Qpid-ProtonJ2-Deploy/ws/protonj2-test-driver/pom.xml> to org.apache.qpid/protonj2-test-driver/2.0.0-SNAPSHOT/protonj2-test-driver-2.0.0-SNAPSHOT.pom
[JENKINS] Archiving <https://ci-builds.apache.org/job/Qpid/job/Qpid-ProtonJ2-Deploy/ws/protonj2-client/pom.xml> to org.apache.qpid/protonj2-client/2.0.0-SNAPSHOT/protonj2-client-2.0.0-SNAPSHOT.pom
channel stopped

Build failed in Jenkins: Qpid » Qpid-ProtonJ2-Deploy #71

Posted by Apache Jenkins Server <je...@builds.apache.org>.
See <https://ci-builds.apache.org/job/Qpid/job/Qpid-ProtonJ2-Deploy/71/display/redirect?page=changes>

Changes:

[tabish121] PROTON-2927 Add SASL mechanism support for OAUTHBEARER


------------------------------------------
[...truncated 10.04 KiB...]
[INFO] Preparing remote bundle org.apache.apache.resources:apache-jar-resource-bundle:1.7
[INFO] Copying 3 resources from 1 bundle.
[INFO] 
[INFO] --- assembly:3.8.0:single (source-release-assembly) @ protonj2-parent ---
[INFO] Assemblies have been skipped per configuration of the skipAssembly parameter.
[INFO] 
[INFO] --- source:3.4.0:jar-no-fork (attach-sources) @ protonj2-parent ---
[INFO] 
[INFO] --- javadoc:3.12.0:jar (attach-javadocs) @ protonj2-parent ---
[INFO] Not executing Javadoc as the project is not a Java classpath-capable package
[INFO] 
[INFO] --- checksum:1.11:artifacts (source-release-checksum) @ protonj2-parent ---
[INFO] 
[INFO] --- gpg:3.2.8:sign (sign-release-artifacts) @ protonj2-parent ---
[INFO] Downloading from central: https://repo.maven.apache.org/maven2/org/bouncycastle/bcprov-jdk18on/maven-metadata.xml
[INFO] Downloaded from central: https://repo.maven.apache.org/maven2/org/bouncycastle/bcprov-jdk18on/maven-metadata.xml (758 B at 1.4 kB/s)
[INFO] Downloading from central: https://repo.maven.apache.org/maven2/org/bouncycastle/bcutil-jdk18on/maven-metadata.xml
[INFO] Downloaded from central: https://repo.maven.apache.org/maven2/org/bouncycastle/bcutil-jdk18on/maven-metadata.xml (758 B at 32 kB/s)
[INFO] 
[INFO] --- install:3.1.4:install (default-install) @ protonj2-parent ---
[INFO] Installing <https://ci-builds.apache.org/job/Qpid/job/Qpid-ProtonJ2-Deploy/ws/pom.xml> to /home/jenkins/.m2/repository/org/apache/qpid/protonj2-parent/2.0.0-SNAPSHOT/protonj2-parent-2.0.0-SNAPSHOT.pom
[INFO] 
[INFO] --- deploy:3.1.4:deploy (default-deploy) @ protonj2-parent ---
[INFO] Downloading from apache.snapshots.https: https://repository.apache.org/content/repositories/snapshots/org/apache/qpid/protonj2-parent/2.0.0-SNAPSHOT/maven-metadata.xml
[INFO] Downloaded from apache.snapshots.https: https://repository.apache.org/content/repositories/snapshots/org/apache/qpid/protonj2-parent/2.0.0-SNAPSHOT/maven-metadata.xml (607 B at 1.0 kB/s)
[INFO] Uploading to apache.snapshots.https: https://repository.apache.org/content/repositories/snapshots/org/apache/qpid/protonj2-parent/2.0.0-SNAPSHOT/protonj2-parent-2.0.0-20260331.034458-3.pom
[INFO] Uploaded to apache.snapshots.https: https://repository.apache.org/content/repositories/snapshots/org/apache/qpid/protonj2-parent/2.0.0-SNAPSHOT/protonj2-parent-2.0.0-20260331.034458-3.pom (13 kB at 12 kB/s)
[INFO] Downloading from apache.snapshots.https: https://repository.apache.org/content/repositories/snapshots/org/apache/qpid/protonj2-parent/maven-metadata.xml
[INFO] Downloaded from apache.snapshots.https: https://repository.apache.org/content/repositories/snapshots/org/apache/qpid/protonj2-parent/maven-metadata.xml (495 B at 2.5 kB/s)
[INFO] Uploading to apache.snapshots.https: https://repository.apache.org/content/repositories/snapshots/org/apache/qpid/protonj2-parent/2.0.0-SNAPSHOT/maven-metadata.xml
[INFO] Uploaded to apache.snapshots.https: https://repository.apache.org/content/repositories/snapshots/org/apache/qpid/protonj2-parent/2.0.0-SNAPSHOT/maven-metadata.xml (607 B at 590 B/s)
[INFO] Uploading to apache.snapshots.https: https://repository.apache.org/content/repositories/snapshots/org/apache/qpid/protonj2-parent/maven-metadata.xml
[INFO] Uploaded to apache.snapshots.https: https://repository.apache.org/content/repositories/snapshots/org/apache/qpid/protonj2-parent/maven-metadata.xml (474 B at 461 B/s)
[WARNING] Attempt to (de-)serialize anonymous class org.jfrog.hudson.maven2.MavenDependenciesRecorder$1; see: https://jenkins.io/redirect/serialization-of-anonymous-classes/
[INFO] 
[INFO] ----------------< org.apache.qpid:protonj2-test-driver >----------------
[INFO] Building Qpid ProtonJ2 AMQP Test Driver 2.0.0-SNAPSHOT             [2/8]
[INFO]   from protonj2-test-driver/pom.xml
[INFO] --------------------------------[ jar ]---------------------------------
[INFO] 
[INFO] --- clean:3.5.0:clean (default-clean) @ protonj2-test-driver ---
[INFO] 
[INFO] --- enforcer:3.6.2:enforce (enforce-maven-version) @ protonj2-test-driver ---
[INFO] 
[INFO] --- enforcer:3.6.2:enforce (enforce-java-version) @ protonj2-test-driver ---
[INFO] 
[INFO] --- jacoco:0.8.14:prepare-agent (default) @ protonj2-test-driver ---
[INFO] jacoco-config set to -javaagent:/home/jenkins/.m2/repository/org/jacoco/org.jacoco.agent/0.8.14/org.jacoco.agent-0.8.14-runtime.jar=destfile=<https://ci-builds.apache.org/job/Qpid/job/Qpid-ProtonJ2-Deploy/ws/protonj2-test-driver/target/jacoco.exec>
[INFO] 
[INFO] --- remote-resources:3.3.0:process (process-resource-bundles) @ protonj2-test-driver ---
[INFO] Preparing remote bundle org.apache.apache.resources:apache-jar-resource-bundle:1.7
[INFO] Copying 3 resources from 1 bundle.
[INFO] 
[INFO] --- resources:3.4.0:resources (default-resources) @ protonj2-test-driver ---
[INFO] skip non existing resourceDirectory <https://ci-builds.apache.org/job/Qpid/job/Qpid-ProtonJ2-Deploy/ws/protonj2-test-driver/src/main/resources>
[INFO] Copying 3 resources from target/maven-shared-archive-resources to target/classes
[INFO] 
[INFO] --- compiler:3.14.1:compile (default-compile) @ protonj2-test-driver ---
[INFO] Recompiling the module because of changed source code.
[INFO] Compiling 239 source files with javac [forked debug deprecation release 17] to target/classes
[INFO] -------------------------------------------------------------
[ERROR] COMPILATION ERROR : 
[INFO] -------------------------------------------------------------
[ERROR] error: release version 17 not supported
[INFO] 1 error
[INFO] -------------------------------------------------------------
[INFO] 
[INFO] ------------------------------------------------------------------------
[INFO] Skipping Qpid ProtonJ2 AMQP Protocol Library
[INFO] This project has been banned from the build due to previous failures.
[INFO] ------------------------------------------------------------------------
[INFO] 
[INFO] ------------------------------------------------------------------------
[INFO] Skipping Qpid ProtonJ2 Client Library
[INFO] This project has been banned from the build due to previous failures.
[INFO] ------------------------------------------------------------------------
[INFO] 
[INFO] ------------------------------------------------------------------------
[INFO] Skipping Qpid ProtonJ2 Client Examples
[INFO] This project has been banned from the build due to previous failures.
[INFO] ------------------------------------------------------------------------
[INFO] 
[INFO] ----------------< org.apache.qpid:protonj2-client-docs >----------------
[INFO] Building Qpid ProtonJ2 Client Documentation 2.0.0-SNAPSHOT         [3/8]
[INFO]   from protonj2-client-docs/pom.xml
[INFO] --------------------------------[ pom ]---------------------------------
[INFO] 
[INFO] --- clean:3.5.0:clean (default-clean) @ protonj2-client-docs ---
[INFO] 
[INFO] --- enforcer:3.6.2:enforce (enforce-maven-version) @ protonj2-client-docs ---
[INFO] 
[INFO] --- enforcer:3.6.2:enforce (enforce-java-version) @ protonj2-client-docs ---
[INFO] 
[INFO] --- jacoco:0.8.14:prepare-agent (default) @ protonj2-client-docs ---
[INFO] Skipping JaCoCo execution because property jacoco.skip is set.
[INFO] 
[INFO] --- remote-resources:3.3.0:process (process-resource-bundles) @ protonj2-client-docs ---
[INFO] Preparing remote bundle org.apache.apache.resources:apache-jar-resource-bundle:1.7
[INFO] Copying 3 resources from 1 bundle.
[INFO] 
[INFO] --- assembly:3.8.0:single (source-release-assembly) @ protonj2-client-docs ---
[INFO] Assemblies have been skipped per configuration of the skipAssembly parameter.
[INFO] 
[INFO] --- source:3.4.0:jar-no-fork (attach-sources) @ protonj2-client-docs ---
[INFO] 
[INFO] --- javadoc:3.12.0:jar (attach-javadocs) @ protonj2-client-docs ---
[INFO] Not executing Javadoc as the project is not a Java classpath-capable package
[INFO] 
[INFO] --- checksum:1.11:artifacts (source-release-checksum) @ protonj2-client-docs ---
[INFO] 
[INFO] --- gpg:3.2.8:sign (sign-release-artifacts) @ protonj2-client-docs ---
[INFO] 
[INFO] --- install:3.1.4:install (default-install) @ protonj2-client-docs ---
[INFO] Installing <https://ci-builds.apache.org/job/Qpid/job/Qpid-ProtonJ2-Deploy/ws/protonj2-client-docs/pom.xml> to /home/jenkins/.m2/repository/org/apache/qpid/protonj2-client-docs/2.0.0-SNAPSHOT/protonj2-client-docs-2.0.0-SNAPSHOT.pom
[INFO] 
[INFO] --- deploy:3.1.4:deploy (default-deploy) @ protonj2-client-docs ---
[INFO] Skipping artifact deployment
[INFO] 
[INFO] ------------------------------------------------------------------------
[INFO] Skipping Apache Qpid ProtonJ2
[INFO] This project has been banned from the build due to previous failures.
[INFO] ------------------------------------------------------------------------
[INFO] 
[INFO] ------------------------------------------------------------------------
[INFO] Skipping Qpid ProtonJ2 JMH Performance Tests
[INFO] This project has been banned from the build due to previous failures.
[INFO] ------------------------------------------------------------------------
[INFO] ------------------------------------------------------------------------
[INFO] Reactor Summary for Qpid ProtonJ2 Parent 2.0.0-SNAPSHOT:
[INFO] 
[INFO] Qpid ProtonJ2 Parent ............................... SUCCESS [ 24.353 s]
[INFO] Qpid ProtonJ2 AMQP Test Driver ..................... FAILURE [  5.329 s]
[INFO] Qpid ProtonJ2 AMQP Protocol Library ................ SKIPPED
[INFO] Qpid ProtonJ2 Client Library ....................... SKIPPED
[INFO] Qpid ProtonJ2 Client Examples ...................... SKIPPED
[INFO] Qpid ProtonJ2 Client Documentation ................. SUCCESS [  4.625 s]
[INFO] Apache Qpid ProtonJ2 ............................... SKIPPED
[INFO] Qpid ProtonJ2 JMH Performance Tests ................ SKIPPED
[INFO] ------------------------------------------------------------------------
[INFO] BUILD FAILURE
[INFO] ------------------------------------------------------------------------
[INFO] Total time:  53.646 s
[INFO] Finished at: 2026-03-31T03:45:52Z
[INFO] ------------------------------------------------------------------------
Waiting for Jenkins to finish collecting data
[ERROR] Failed to execute goal org.apache.maven.plugins:maven-compiler-plugin:3.14.1:compile (default-compile) on project protonj2-test-driver: Compilation failure
[ERROR] error: release version 17 not supported
[ERROR] -> [Help 1]
org.apache.maven.lifecycle.LifecycleExecutionException: Failed to execute goal org.apache.maven.plugins:maven-compiler-plugin:3.14.1:compile (default-compile) on project protonj2-test-driver: Compilation failure
error: release version 17 not supported

    at org.apache.maven.lifecycle.internal.MojoExecutor.doExecute2 (MojoExecutor.java:333)
    at org.apache.maven.lifecycle.internal.MojoExecutor.doExecute (MojoExecutor.java:316)
    at org.apache.maven.lifecycle.internal.MojoExecutor.execute (MojoExecutor.java:212)
    at org.apache.maven.lifecycle.internal.MojoExecutor.execute (MojoExecutor.java:174)
    at org.apache.maven.lifecycle.internal.MojoExecutor.access$000 (MojoExecutor.java:75)
    at org.apache.maven.lifecycle.internal.MojoExecutor$1.run (MojoExecutor.java:162)
    at org.apache.maven.plugin.DefaultMojosExecutionStrategy.execute (DefaultMojosExecutionStrategy.java:39)
    at org.apache.maven.lifecycle.internal.MojoExecutor.execute (MojoExecutor.java:159)
    at org.apache.maven.lifecycle.internal.LifecycleModuleBuilder.buildProject (LifecycleModuleBuilder.java:105)
    at org.apache.maven.lifecycle.internal.LifecycleModuleBuilder.buildProject (LifecycleModuleBuilder.java:73)
    at org.apache.maven.lifecycle.internal.builder.singlethreaded.SingleThreadedBuilder.build (SingleThreadedBuilder.java:53)
    at org.apache.maven.lifecycle.internal.LifecycleStarter.execute (LifecycleStarter.java:118)
    at org.apache.maven.DefaultMaven.doExecute (DefaultMaven.java:261)
    at org.apache.maven.DefaultMaven.doExecute (DefaultMaven.java:173)
    at org.apache.maven.DefaultMaven.execute (DefaultMaven.java:101)
    at org.jvnet.hudson.maven3.launcher.Maven35Launcher.main (Maven35Launcher.java:138)
    at jdk.internal.reflect.NativeMethodAccessorImpl.invoke0 (Native Method)
    at jdk.internal.reflect.NativeMethodAccessorImpl.invoke (NativeMethodAccessorImpl.java:77)
    at jdk.internal.reflect.DelegatingMethodAccessorImpl.invoke (DelegatingMethodAccessorImpl.java:43)
    at java.lang.reflect.Method.invoke (Method.java:569)
    at org.codehaus.plexus.classworlds.launcher.Launcher.launchEnhanced (Launcher.java:255)
    at org.codehaus.plexus.classworlds.launcher.Launcher.launch (Launcher.java:201)
    at jenkins.maven3.agent.Maven35Main.launch (Maven35Main.java:179)
    at jdk.internal.reflect.NativeMethodAccessorImpl.invoke0 (Native Method)
    at jdk.internal.reflect.NativeMethodAccessorImpl.invoke (NativeMethodAccessorImpl.java:77)
    at jdk.internal.reflect.DelegatingMethodAccessorImpl.invoke (DelegatingMethodAccessorImpl.java:43)
    at java.lang.reflect.Method.invoke (Method.java:569)
    at hudson.maven.Maven3Builder.call (Maven3Builder.java:140)
    at hudson.maven.Maven3Builder.call (Maven3Builder.java:71)
    at hudson.remoting.UserRequest.perform (UserRequest.java:225)
    at hudson.remoting.UserRequest.perform (UserRequest.java:50)
    at hudson.remoting.Request$2.run (Request.java:391)
    at hudson.remoting.InterceptingExecutorService.lambda$wrap$0 (InterceptingExecutorService.java:81)
    at java.util.concurrent.FutureTask.run (FutureTask.java:264)
    at java.util.concurrent.ThreadPoolExecutor.runWorker (ThreadPoolExecutor.java:1136)
    at java.util.concurrent.ThreadPoolExecutor$Worker.run (ThreadPoolExecutor.java:635)
    at java.lang.Thread.run (Thread.java:840)
Caused by: org.apache.maven.plugin.compiler.CompilationFailureException: Compilation failure
error: release version 17 not supported

    at org.apache.maven.plugin.compiler.AbstractCompilerMojo.executeReal (AbstractCompilerMojo.java:1318)
    at org.apache.maven.plugin.compiler.AbstractCompilerMojo.execute (AbstractCompilerMojo.java:708)
    at org.apache.maven.plugin.compiler.CompilerMojo.execute (CompilerMojo.java:235)
    at org.apache.maven.plugin.DefaultBuildPluginManager.executeMojo (DefaultBuildPluginManager.java:126)
    at org.apache.maven.lifecycle.internal.MojoExecutor.doExecute2 (MojoExecutor.java:328)
    at org.apache.maven.lifecycle.internal.MojoExecutor.doExecute (MojoExecutor.java:316)
    at org.apache.maven.lifecycle.internal.MojoExecutor.execute (MojoExecutor.java:212)
    at org.apache.maven.lifecycle.internal.MojoExecutor.execute (MojoExecutor.java:174)
    at org.apache.maven.lifecycle.internal.MojoExecutor.access$000 (MojoExecutor.java:75)
    at org.apache.maven.lifecycle.internal.MojoExecutor$1.run (MojoExecutor.java:162)
    at org.apache.maven.plugin.DefaultMojosExecutionStrategy.execute (DefaultMojosExecutionStrategy.java:39)
    at org.apache.maven.lifecycle.internal.MojoExecutor.execute (MojoExecutor.java:159)
    at org.apache.maven.lifecycle.internal.LifecycleModuleBuilder.buildProject (LifecycleModuleBuilder.java:105)
    at org.apache.maven.lifecycle.internal.LifecycleModuleBuilder.buildProject (LifecycleModuleBuilder.java:73)
    at org.apache.maven.lifecycle.internal.builder.singlethreaded.SingleThreadedBuilder.build (SingleThreadedBuilder.java:53)
    at org.apache.maven.lifecycle.internal.LifecycleStarter.execute (LifecycleStarter.java:118)
    at org.apache.maven.DefaultMaven.doExecute (DefaultMaven.java:261)
    at org.apache.maven.DefaultMaven.doExecute (DefaultMaven.java:173)
    at org.apache.maven.DefaultMaven.execute (DefaultMaven.java:101)
    at org.jvnet.hudson.maven3.launcher.Maven35Launcher.main (Maven35Launcher.java:138)
    at jdk.internal.reflect.NativeMethodAccessorImpl.invoke0 (Native Method)
    at jdk.internal.reflect.NativeMethodAccessorImpl.invoke (NativeMethodAccessorImpl.java:77)
    at jdk.internal.reflect.DelegatingMethodAccessorImpl.invoke (DelegatingMethodAccessorImpl.java:43)
    at java.lang.reflect.Method.invoke (Method.java:569)
    at org.codehaus.plexus.classworlds.launcher.Launcher.launchEnhanced (Launcher.java:255)
    at org.codehaus.plexus.classworlds.launcher.Launcher.launch (Launcher.java:201)
    at jenkins.maven3.agent.Maven35Main.launch (Maven35Main.java:179)
    at jdk.internal.reflect.NativeMethodAccessorImpl.invoke0 (Native Method)
    at jdk.internal.reflect.NativeMethodAccessorImpl.invoke (NativeMethodAccessorImpl.java:77)
    at jdk.internal.reflect.DelegatingMethodAccessorImpl.invoke (DelegatingMethodAccessorImpl.java:43)
    at java.lang.reflect.Method.invoke (Method.java:569)
    at hudson.maven.Maven3Builder.call (Maven3Builder.java:140)
    at hudson.maven.Maven3Builder.call (Maven3Builder.java:71)
    at hudson.remoting.UserRequest.perform (UserRequest.java:225)
    at hudson.remoting.UserRequest.perform (UserRequest.java:50)
    at hudson.remoting.Request$2.run (Request.java:391)
    at hudson.remoting.InterceptingExecutorService.lambda$wrap$0 (InterceptingExecutorService.java:81)
    at java.util.concurrent.FutureTask.run (FutureTask.java:264)
    at java.util.concurrent.ThreadPoolExecutor.runWorker (ThreadPoolExecutor.java:1136)
    at java.util.concurrent.ThreadPoolExecutor$Worker.run (ThreadPoolExecutor.java:635)
    at java.lang.Thread.run (Thread.java:840)
[ERROR] 
[ERROR] Re-run Maven using the -X switch to enable full debug logging.
[ERROR] 
[ERROR] For more information about the errors and possible solutions, please read the following articles:
[ERROR] [Help 1] http://cwiki.apache.org/confluence/display/MAVEN/MojoFailureException
[ERROR] 
[ERROR] After correcting the problems, you can resume the build with the command
[ERROR]   mvn <goals> -rf :protonj2-test-driver
[JENKINS] Archiving <https://ci-builds.apache.org/job/Qpid/job/Qpid-ProtonJ2-Deploy/ws/apache-qpid-protonj2/pom.xml> to org.apache.qpid/apache-qpid-protonj2/2.0.0-SNAPSHOT/apache-qpid-protonj2-2.0.0-SNAPSHOT.pom
[JENKINS] Archiving <https://ci-builds.apache.org/job/Qpid/job/Qpid-ProtonJ2-Deploy/ws/pom.xml> to org.apache.qpid/protonj2-parent/2.0.0-SNAPSHOT/protonj2-parent-2.0.0-SNAPSHOT.pom
[JENKINS] Archiving <https://ci-builds.apache.org/job/Qpid/job/Qpid-ProtonJ2-Deploy/ws/protonj2/pom.xml> to org.apache.qpid/protonj2/2.0.0-SNAPSHOT/protonj2-2.0.0-SNAPSHOT.pom
[JENKINS] Archiving <https://ci-builds.apache.org/job/Qpid/job/Qpid-ProtonJ2-Deploy/ws/protonj2-client-examples/pom.xml> to org.apache.qpid/protonj2-client-examples/2.0.0-SNAPSHOT/protonj2-client-examples-2.0.0-SNAPSHOT.pom
[JENKINS] Archiving <https://ci-builds.apache.org/job/Qpid/job/Qpid-ProtonJ2-Deploy/ws/protonj2-performance-tests/pom.xml> to org.apache.qpid/protonj2-performance-tests/2.0.0-SNAPSHOT/protonj2-performance-tests-2.0.0-SNAPSHOT.pom
[JENKINS] Archiving <https://ci-builds.apache.org/job/Qpid/job/Qpid-ProtonJ2-Deploy/ws/protonj2-client-docs/pom.xml> to org.apache.qpid/protonj2-client-docs/2.0.0-SNAPSHOT/protonj2-client-docs-2.0.0-SNAPSHOT.pom
[JENKINS] Archiving <https://ci-builds.apache.org/job/Qpid/job/Qpid-ProtonJ2-Deploy/ws/protonj2-test-driver/pom.xml> to org.apache.qpid/protonj2-test-driver/2.0.0-SNAPSHOT/protonj2-test-driver-2.0.0-SNAPSHOT.pom
[JENKINS] Archiving <https://ci-builds.apache.org/job/Qpid/job/Qpid-ProtonJ2-Deploy/ws/protonj2-client/pom.xml> to org.apache.qpid/protonj2-client/2.0.0-SNAPSHOT/protonj2-client-2.0.0-SNAPSHOT.pom
channel stopped

Build failed in Jenkins: Qpid » Qpid-ProtonJ2-Deploy #70

Posted by Apache Jenkins Server <je...@builds.apache.org>.
See <https://ci-builds.apache.org/job/Qpid/job/Qpid-ProtonJ2-Deploy/70/display/redirect?page=changes>

Changes:

[tabish121] PROTON-2923 Update to Netty 4.2.11.Final release

[tabish121] PROTON-2925 Clean up some code using new switch expressions

[tabish121] PROTON-2923 Update to Netty 4.2.12.Final release


------------------------------------------
[...truncated 14.19 KiB...]
[INFO] --------------------------------[ jar ]---------------------------------
[INFO] Downloading from central: https://repo.maven.apache.org/maven2/io/netty/netty-buffer/4.2.12.Final/netty-buffer-4.2.12.Final.pom
[INFO] Downloaded from central: https://repo.maven.apache.org/maven2/io/netty/netty-buffer/4.2.12.Final/netty-buffer-4.2.12.Final.pom (5.5 kB at 178 kB/s)
[INFO] Downloading from central: https://repo.maven.apache.org/maven2/io/netty/netty-parent/4.2.12.Final/netty-parent-4.2.12.Final.pom
[INFO] Downloaded from central: https://repo.maven.apache.org/maven2/io/netty/netty-parent/4.2.12.Final/netty-parent-4.2.12.Final.pom (83 kB at 2.1 MB/s)
[INFO] Downloading from central: https://repo.maven.apache.org/maven2/io/netty/netty-common/4.2.12.Final/netty-common-4.2.12.Final.pom
[INFO] Downloaded from central: https://repo.maven.apache.org/maven2/io/netty/netty-common/4.2.12.Final/netty-common-4.2.12.Final.pom (12 kB at 474 kB/s)
[INFO] Downloading from central: https://repo.maven.apache.org/maven2/io/netty/netty-handler/4.2.12.Final/netty-handler-4.2.12.Final.pom
[INFO] Downloaded from central: https://repo.maven.apache.org/maven2/io/netty/netty-handler/4.2.12.Final/netty-handler-4.2.12.Final.pom (7.0 kB at 249 kB/s)
[INFO] Downloading from central: https://repo.maven.apache.org/maven2/io/netty/netty-resolver/4.2.12.Final/netty-resolver-4.2.12.Final.pom
[INFO] Downloaded from central: https://repo.maven.apache.org/maven2/io/netty/netty-resolver/4.2.12.Final/netty-resolver-4.2.12.Final.pom (2.7 kB at 113 kB/s)
[INFO] Downloading from central: https://repo.maven.apache.org/maven2/io/netty/netty-transport/4.2.12.Final/netty-transport-4.2.12.Final.pom
[INFO] Downloaded from central: https://repo.maven.apache.org/maven2/io/netty/netty-transport/4.2.12.Final/netty-transport-4.2.12.Final.pom (3.4 kB at 127 kB/s)
[INFO] Downloading from central: https://repo.maven.apache.org/maven2/io/netty/netty-transport-native-unix-common/4.2.12.Final/netty-transport-native-unix-common-4.2.12.Final.pom
[INFO] Downloaded from central: https://repo.maven.apache.org/maven2/io/netty/netty-transport-native-unix-common/4.2.12.Final/netty-transport-native-unix-common-4.2.12.Final.pom (34 kB at 1.2 MB/s)
[INFO] Downloading from central: https://repo.maven.apache.org/maven2/io/netty/netty-codec-base/4.2.12.Final/netty-codec-base-4.2.12.Final.pom
[INFO] Downloaded from central: https://repo.maven.apache.org/maven2/io/netty/netty-codec-base/4.2.12.Final/netty-codec-base-4.2.12.Final.pom (3.6 kB at 129 kB/s)
[INFO] Downloading from central: https://repo.maven.apache.org/maven2/io/netty/netty-codec-http/4.2.12.Final/netty-codec-http-4.2.12.Final.pom
[INFO] Downloaded from central: https://repo.maven.apache.org/maven2/io/netty/netty-codec-http/4.2.12.Final/netty-codec-http-4.2.12.Final.pom (5.7 kB at 227 kB/s)
[INFO] Downloading from central: https://repo.maven.apache.org/maven2/io/netty/netty-codec-compression/4.2.12.Final/netty-codec-compression-4.2.12.Final.pom
[INFO] Downloaded from central: https://repo.maven.apache.org/maven2/io/netty/netty-codec-compression/4.2.12.Final/netty-codec-compression-4.2.12.Final.pom (5.9 kB at 237 kB/s)
[INFO] Downloading from central: https://repo.maven.apache.org/maven2/io/netty/netty-buffer/4.2.12.Final/netty-buffer-4.2.12.Final.jar
[INFO] Downloaded from central: https://repo.maven.apache.org/maven2/io/netty/netty-buffer/4.2.12.Final/netty-buffer-4.2.12.Final.jar (371 kB at 8.6 MB/s)
[INFO] Downloading from central: https://repo.maven.apache.org/maven2/io/netty/netty-common/4.2.12.Final/netty-common-4.2.12.Final.jar
[INFO] Downloading from central: https://repo.maven.apache.org/maven2/io/netty/netty-handler/4.2.12.Final/netty-handler-4.2.12.Final.jar
[INFO] Downloading from central: https://repo.maven.apache.org/maven2/io/netty/netty-resolver/4.2.12.Final/netty-resolver-4.2.12.Final.jar
[INFO] Downloading from central: https://repo.maven.apache.org/maven2/io/netty/netty-transport-native-unix-common/4.2.12.Final/netty-transport-native-unix-common-4.2.12.Final.jar
[INFO] Downloading from central: https://repo.maven.apache.org/maven2/io/netty/netty-codec-base/4.2.12.Final/netty-codec-base-4.2.12.Final.jar
[INFO] Downloaded from central: https://repo.maven.apache.org/maven2/io/netty/netty-common/4.2.12.Final/netty-common-4.2.12.Final.jar (813 kB at 15 MB/s)
[INFO] Downloading from central: https://repo.maven.apache.org/maven2/io/netty/netty-transport/4.2.12.Final/netty-transport-4.2.12.Final.jar
[INFO] Downloaded from central: https://repo.maven.apache.org/maven2/io/netty/netty-resolver/4.2.12.Final/netty-resolver-4.2.12.Final.jar (33 kB at 464 kB/s)
[INFO] Downloading from central: https://repo.maven.apache.org/maven2/io/netty/netty-codec-http/4.2.12.Final/netty-codec-http-4.2.12.Final.jar
[INFO] Downloaded from central: https://repo.maven.apache.org/maven2/io/netty/netty-transport-native-unix-common/4.2.12.Final/netty-transport-native-unix-common-4.2.12.Final.jar (47 kB at 660 kB/s)
[INFO] Downloading from central: https://repo.maven.apache.org/maven2/io/netty/netty-codec-compression/4.2.12.Final/netty-codec-compression-4.2.12.Final.jar
[INFO] Downloaded from central: https://repo.maven.apache.org/maven2/io/netty/netty-codec-base/4.2.12.Final/netty-codec-base-4.2.12.Final.jar (153 kB at 1.7 MB/s)
[INFO] Downloaded from central: https://repo.maven.apache.org/maven2/io/netty/netty-transport/4.2.12.Final/netty-transport-4.2.12.Final.jar (550 kB at 6.0 MB/s)
[INFO] Downloaded from central: https://repo.maven.apache.org/maven2/io/netty/netty-handler/4.2.12.Final/netty-handler-4.2.12.Final.jar (579 kB at 5.9 MB/s)
[INFO] Downloaded from central: https://repo.maven.apache.org/maven2/io/netty/netty-codec-compression/4.2.12.Final/netty-codec-compression-4.2.12.Final.jar (182 kB at 1.6 MB/s)
[INFO] Downloaded from central: https://repo.maven.apache.org/maven2/io/netty/netty-codec-http/4.2.12.Final/netty-codec-http-4.2.12.Final.jar (670 kB at 5.2 MB/s)
[INFO] 
[INFO] --- clean:3.5.0:clean (default-clean) @ protonj2-test-driver ---
[INFO] 
[INFO] --- enforcer:3.6.2:enforce (enforce-maven-version) @ protonj2-test-driver ---
[INFO] 
[INFO] --- enforcer:3.6.2:enforce (enforce-java-version) @ protonj2-test-driver ---
[INFO] 
[INFO] --- jacoco:0.8.14:prepare-agent (default) @ protonj2-test-driver ---
[INFO] jacoco-config set to -javaagent:/home/jenkins/.m2/repository/org/jacoco/org.jacoco.agent/0.8.14/org.jacoco.agent-0.8.14-runtime.jar=destfile=<https://ci-builds.apache.org/job/Qpid/job/Qpid-ProtonJ2-Deploy/ws/protonj2-test-driver/target/jacoco.exec>
[INFO] 
[INFO] --- remote-resources:3.3.0:process (process-resource-bundles) @ protonj2-test-driver ---
[INFO] Preparing remote bundle org.apache.apache.resources:apache-jar-resource-bundle:1.7
[INFO] Copying 3 resources from 1 bundle.
[INFO] 
[INFO] --- resources:3.4.0:resources (default-resources) @ protonj2-test-driver ---
[INFO] skip non existing resourceDirectory <https://ci-builds.apache.org/job/Qpid/job/Qpid-ProtonJ2-Deploy/ws/protonj2-test-driver/src/main/resources>
[INFO] Copying 3 resources from target/maven-shared-archive-resources to target/classes
[INFO] 
[INFO] --- compiler:3.14.1:compile (default-compile) @ protonj2-test-driver ---
[INFO] Recompiling the module because of changed source code.
[INFO] Compiling 239 source files with javac [forked debug deprecation release 17] to target/classes
[INFO] -------------------------------------------------------------
[ERROR] COMPILATION ERROR : 
[INFO] -------------------------------------------------------------
[ERROR] error: release version 17 not supported
[INFO] 1 error
[INFO] -------------------------------------------------------------
[INFO] 
[INFO] ------------------------------------------------------------------------
[INFO] Skipping Qpid ProtonJ2 AMQP Protocol Library
[INFO] This project has been banned from the build due to previous failures.
[INFO] ------------------------------------------------------------------------
[INFO] 
[INFO] ------------------------------------------------------------------------
[INFO] Skipping Qpid ProtonJ2 Client Library
[INFO] This project has been banned from the build due to previous failures.
[INFO] ------------------------------------------------------------------------
[INFO] 
[INFO] ------------------------------------------------------------------------
[INFO] Skipping Qpid ProtonJ2 Client Examples
[INFO] This project has been banned from the build due to previous failures.
[INFO] ------------------------------------------------------------------------
[INFO] 
[INFO] ----------------< org.apache.qpid:protonj2-client-docs >----------------
[INFO] Building Qpid ProtonJ2 Client Documentation 2.0.0-SNAPSHOT         [3/8]
[INFO]   from protonj2-client-docs/pom.xml
[INFO] --------------------------------[ pom ]---------------------------------
[INFO] 
[INFO] --- clean:3.5.0:clean (default-clean) @ protonj2-client-docs ---
[INFO] 
[INFO] --- enforcer:3.6.2:enforce (enforce-maven-version) @ protonj2-client-docs ---
[INFO] 
[INFO] --- enforcer:3.6.2:enforce (enforce-java-version) @ protonj2-client-docs ---
[INFO] 
[INFO] --- jacoco:0.8.14:prepare-agent (default) @ protonj2-client-docs ---
[INFO] Skipping JaCoCo execution because property jacoco.skip is set.
[INFO] 
[INFO] --- remote-resources:3.3.0:process (process-resource-bundles) @ protonj2-client-docs ---
[INFO] Preparing remote bundle org.apache.apache.resources:apache-jar-resource-bundle:1.7
[INFO] Copying 3 resources from 1 bundle.
[INFO] 
[INFO] --- assembly:3.8.0:single (source-release-assembly) @ protonj2-client-docs ---
[INFO] Assemblies have been skipped per configuration of the skipAssembly parameter.
[INFO] 
[INFO] --- source:3.4.0:jar-no-fork (attach-sources) @ protonj2-client-docs ---
[INFO] 
[INFO] --- javadoc:3.12.0:jar (attach-javadocs) @ protonj2-client-docs ---
[INFO] Not executing Javadoc as the project is not a Java classpath-capable package
[INFO] 
[INFO] --- checksum:1.11:artifacts (source-release-checksum) @ protonj2-client-docs ---
[INFO] 
[INFO] --- gpg:3.2.8:sign (sign-release-artifacts) @ protonj2-client-docs ---
[INFO] 
[INFO] --- install:3.1.4:install (default-install) @ protonj2-client-docs ---
[INFO] Installing <https://ci-builds.apache.org/job/Qpid/job/Qpid-ProtonJ2-Deploy/ws/protonj2-client-docs/pom.xml> to /home/jenkins/.m2/repository/org/apache/qpid/protonj2-client-docs/2.0.0-SNAPSHOT/protonj2-client-docs-2.0.0-SNAPSHOT.pom
[INFO] 
[INFO] --- deploy:3.1.4:deploy (default-deploy) @ protonj2-client-docs ---
[INFO] Skipping artifact deployment
[INFO] 
[INFO] ------------------------------------------------------------------------
[INFO] Skipping Apache Qpid ProtonJ2
[INFO] This project has been banned from the build due to previous failures.
[INFO] ------------------------------------------------------------------------
[INFO] 
[INFO] ------------------------------------------------------------------------
[INFO] Skipping Qpid ProtonJ2 JMH Performance Tests
[INFO] This project has been banned from the build due to previous failures.
[INFO] ------------------------------------------------------------------------
[INFO] ------------------------------------------------------------------------
[INFO] Reactor Summary for Qpid ProtonJ2 Parent 2.0.0-SNAPSHOT:
[INFO] 
[INFO] Qpid ProtonJ2 Parent ............................... SUCCESS [ 16.921 s]
[INFO] Qpid ProtonJ2 AMQP Test Driver ..................... FAILURE [  4.384 s]
[INFO] Qpid ProtonJ2 AMQP Protocol Library ................ SKIPPED
[INFO] Qpid ProtonJ2 Client Library ....................... SKIPPED
[INFO] Qpid ProtonJ2 Client Examples ...................... SKIPPED
[INFO] Qpid ProtonJ2 Client Documentation ................. SUCCESS [  4.387 s]
[INFO] Apache Qpid ProtonJ2 ............................... SKIPPED
[INFO] Qpid ProtonJ2 JMH Performance Tests ................ SKIPPED
[INFO] ------------------------------------------------------------------------
[INFO] BUILD FAILURE
[INFO] ------------------------------------------------------------------------
[INFO] Total time:  43.679 s
[INFO] Finished at: 2026-03-26T03:45:39Z
[INFO] ------------------------------------------------------------------------
Waiting for Jenkins to finish collecting data
[ERROR] Failed to execute goal org.apache.maven.plugins:maven-compiler-plugin:3.14.1:compile (default-compile) on project protonj2-test-driver: Compilation failure
[ERROR] error: release version 17 not supported
[ERROR] -> [Help 1]
org.apache.maven.lifecycle.LifecycleExecutionException: Failed to execute goal org.apache.maven.plugins:maven-compiler-plugin:3.14.1:compile (default-compile) on project protonj2-test-driver: Compilation failure
error: release version 17 not supported

    at org.apache.maven.lifecycle.internal.MojoExecutor.doExecute2 (MojoExecutor.java:333)
    at org.apache.maven.lifecycle.internal.MojoExecutor.doExecute (MojoExecutor.java:316)
    at org.apache.maven.lifecycle.internal.MojoExecutor.execute (MojoExecutor.java:212)
    at org.apache.maven.lifecycle.internal.MojoExecutor.execute (MojoExecutor.java:174)
    at org.apache.maven.lifecycle.internal.MojoExecutor.access$000 (MojoExecutor.java:75)
    at org.apache.maven.lifecycle.internal.MojoExecutor$1.run (MojoExecutor.java:162)
    at org.apache.maven.plugin.DefaultMojosExecutionStrategy.execute (DefaultMojosExecutionStrategy.java:39)
    at org.apache.maven.lifecycle.internal.MojoExecutor.execute (MojoExecutor.java:159)
    at org.apache.maven.lifecycle.internal.LifecycleModuleBuilder.buildProject (LifecycleModuleBuilder.java:105)
    at org.apache.maven.lifecycle.internal.LifecycleModuleBuilder.buildProject (LifecycleModuleBuilder.java:73)
    at org.apache.maven.lifecycle.internal.builder.singlethreaded.SingleThreadedBuilder.build (SingleThreadedBuilder.java:53)
    at org.apache.maven.lifecycle.internal.LifecycleStarter.execute (LifecycleStarter.java:118)
    at org.apache.maven.DefaultMaven.doExecute (DefaultMaven.java:261)
    at org.apache.maven.DefaultMaven.doExecute (DefaultMaven.java:173)
    at org.apache.maven.DefaultMaven.execute (DefaultMaven.java:101)
    at org.jvnet.hudson.maven3.launcher.Maven35Launcher.main (Maven35Launcher.java:138)
    at jdk.internal.reflect.NativeMethodAccessorImpl.invoke0 (Native Method)
    at jdk.internal.reflect.NativeMethodAccessorImpl.invoke (NativeMethodAccessorImpl.java:77)
    at jdk.internal.reflect.DelegatingMethodAccessorImpl.invoke (DelegatingMethodAccessorImpl.java:43)
    at java.lang.reflect.Method.invoke (Method.java:569)
    at org.codehaus.plexus.classworlds.launcher.Launcher.launchEnhanced (Launcher.java:255)
    at org.codehaus.plexus.classworlds.launcher.Launcher.launch (Launcher.java:201)
    at jenkins.maven3.agent.Maven35Main.launch (Maven35Main.java:179)
    at jdk.internal.reflect.NativeMethodAccessorImpl.invoke0 (Native Method)
    at jdk.internal.reflect.NativeMethodAccessorImpl.invoke (NativeMethodAccessorImpl.java:77)
    at jdk.internal.reflect.DelegatingMethodAccessorImpl.invoke (DelegatingMethodAccessorImpl.java:43)
    at java.lang.reflect.Method.invoke (Method.java:569)
    at hudson.maven.Maven3Builder.call (Maven3Builder.java:140)
    at hudson.maven.Maven3Builder.call (Maven3Builder.java:71)
    at hudson.remoting.UserRequest.perform (UserRequest.java:225)
    at hudson.remoting.UserRequest.perform (UserRequest.java:50)
    at hudson.remoting.Request$2.run (Request.java:391)
    at hudson.remoting.InterceptingExecutorService.lambda$wrap$0 (InterceptingExecutorService.java:81)
    at java.util.concurrent.FutureTask.run (FutureTask.java:264)
    at java.util.concurrent.ThreadPoolExecutor.runWorker (ThreadPoolExecutor.java:1136)
    at java.util.concurrent.ThreadPoolExecutor$Worker.run (ThreadPoolExecutor.java:635)
    at java.lang.Thread.run (Thread.java:840)
Caused by: org.apache.maven.plugin.compiler.CompilationFailureException: Compilation failure
error: release version 17 not supported

    at org.apache.maven.plugin.compiler.AbstractCompilerMojo.executeReal (AbstractCompilerMojo.java:1318)
    at org.apache.maven.plugin.compiler.AbstractCompilerMojo.execute (AbstractCompilerMojo.java:708)
    at org.apache.maven.plugin.compiler.CompilerMojo.execute (CompilerMojo.java:235)
    at org.apache.maven.plugin.DefaultBuildPluginManager.executeMojo (DefaultBuildPluginManager.java:126)
    at org.apache.maven.lifecycle.internal.MojoExecutor.doExecute2 (MojoExecutor.java:328)
    at org.apache.maven.lifecycle.internal.MojoExecutor.doExecute (MojoExecutor.java:316)
    at org.apache.maven.lifecycle.internal.MojoExecutor.execute (MojoExecutor.java:212)
    at org.apache.maven.lifecycle.internal.MojoExecutor.execute (MojoExecutor.java:174)
    at org.apache.maven.lifecycle.internal.MojoExecutor.access$000 (MojoExecutor.java:75)
    at org.apache.maven.lifecycle.internal.MojoExecutor$1.run (MojoExecutor.java:162)
    at org.apache.maven.plugin.DefaultMojosExecutionStrategy.execute (DefaultMojosExecutionStrategy.java:39)
    at org.apache.maven.lifecycle.internal.MojoExecutor.execute (MojoExecutor.java:159)
    at org.apache.maven.lifecycle.internal.LifecycleModuleBuilder.buildProject (LifecycleModuleBuilder.java:105)
    at org.apache.maven.lifecycle.internal.LifecycleModuleBuilder.buildProject (LifecycleModuleBuilder.java:73)
    at org.apache.maven.lifecycle.internal.builder.singlethreaded.SingleThreadedBuilder.build (SingleThreadedBuilder.java:53)
    at org.apache.maven.lifecycle.internal.LifecycleStarter.execute (LifecycleStarter.java:118)
    at org.apache.maven.DefaultMaven.doExecute (DefaultMaven.java:261)
    at org.apache.maven.DefaultMaven.doExecute (DefaultMaven.java:173)
    at org.apache.maven.DefaultMaven.execute (DefaultMaven.java:101)
    at org.jvnet.hudson.maven3.launcher.Maven35Launcher.main (Maven35Launcher.java:138)
    at jdk.internal.reflect.NativeMethodAccessorImpl.invoke0 (Native Method)
    at jdk.internal.reflect.NativeMethodAccessorImpl.invoke (NativeMethodAccessorImpl.java:77)
    at jdk.internal.reflect.DelegatingMethodAccessorImpl.invoke (DelegatingMethodAccessorImpl.java:43)
    at java.lang.reflect.Method.invoke (Method.java:569)
    at org.codehaus.plexus.classworlds.launcher.Launcher.launchEnhanced (Launcher.java:255)
    at org.codehaus.plexus.classworlds.launcher.Launcher.launch (Launcher.java:201)
    at jenkins.maven3.agent.Maven35Main.launch (Maven35Main.java:179)
    at jdk.internal.reflect.NativeMethodAccessorImpl.invoke0 (Native Method)
    at jdk.internal.reflect.NativeMethodAccessorImpl.invoke (NativeMethodAccessorImpl.java:77)
    at jdk.internal.reflect.DelegatingMethodAccessorImpl.invoke (DelegatingMethodAccessorImpl.java:43)
    at java.lang.reflect.Method.invoke (Method.java:569)
    at hudson.maven.Maven3Builder.call (Maven3Builder.java:140)
    at hudson.maven.Maven3Builder.call (Maven3Builder.java:71)
    at hudson.remoting.UserRequest.perform (UserRequest.java:225)
    at hudson.remoting.UserRequest.perform (UserRequest.java:50)
    at hudson.remoting.Request$2.run (Request.java:391)
    at hudson.remoting.InterceptingExecutorService.lambda$wrap$0 (InterceptingExecutorService.java:81)
    at java.util.concurrent.FutureTask.run (FutureTask.java:264)
    at java.util.concurrent.ThreadPoolExecutor.runWorker (ThreadPoolExecutor.java:1136)
    at java.util.concurrent.ThreadPoolExecutor$Worker.run (ThreadPoolExecutor.java:635)
    at java.lang.Thread.run (Thread.java:840)
[ERROR] 
[ERROR] Re-run Maven using the -X switch to enable full debug logging.
[ERROR] 
[ERROR] For more information about the errors and possible solutions, please read the following articles:
[ERROR] [Help 1] http://cwiki.apache.org/confluence/display/MAVEN/MojoFailureException
[ERROR] 
[ERROR] After correcting the problems, you can resume the build with the command
[ERROR]   mvn <goals> -rf :protonj2-test-driver
[JENKINS] Archiving <https://ci-builds.apache.org/job/Qpid/job/Qpid-ProtonJ2-Deploy/ws/apache-qpid-protonj2/pom.xml> to org.apache.qpid/apache-qpid-protonj2/2.0.0-SNAPSHOT/apache-qpid-protonj2-2.0.0-SNAPSHOT.pom
[JENKINS] Archiving <https://ci-builds.apache.org/job/Qpid/job/Qpid-ProtonJ2-Deploy/ws/pom.xml> to org.apache.qpid/protonj2-parent/2.0.0-SNAPSHOT/protonj2-parent-2.0.0-SNAPSHOT.pom
[JENKINS] Archiving <https://ci-builds.apache.org/job/Qpid/job/Qpid-ProtonJ2-Deploy/ws/protonj2/pom.xml> to org.apache.qpid/protonj2/2.0.0-SNAPSHOT/protonj2-2.0.0-SNAPSHOT.pom
[JENKINS] Archiving <https://ci-builds.apache.org/job/Qpid/job/Qpid-ProtonJ2-Deploy/ws/protonj2-client-examples/pom.xml> to org.apache.qpid/protonj2-client-examples/2.0.0-SNAPSHOT/protonj2-client-examples-2.0.0-SNAPSHOT.pom
[JENKINS] Archiving <https://ci-builds.apache.org/job/Qpid/job/Qpid-ProtonJ2-Deploy/ws/protonj2-performance-tests/pom.xml> to org.apache.qpid/protonj2-performance-tests/2.0.0-SNAPSHOT/protonj2-performance-tests-2.0.0-SNAPSHOT.pom
[JENKINS] Archiving <https://ci-builds.apache.org/job/Qpid/job/Qpid-ProtonJ2-Deploy/ws/protonj2-client-docs/pom.xml> to org.apache.qpid/protonj2-client-docs/2.0.0-SNAPSHOT/protonj2-client-docs-2.0.0-SNAPSHOT.pom
[JENKINS] Archiving <https://ci-builds.apache.org/job/Qpid/job/Qpid-ProtonJ2-Deploy/ws/protonj2-test-driver/pom.xml> to org.apache.qpid/protonj2-test-driver/2.0.0-SNAPSHOT/protonj2-test-driver-2.0.0-SNAPSHOT.pom
[JENKINS] Archiving <https://ci-builds.apache.org/job/Qpid/job/Qpid-ProtonJ2-Deploy/ws/protonj2-client/pom.xml> to org.apache.qpid/protonj2-client/2.0.0-SNAPSHOT/protonj2-client-2.0.0-SNAPSHOT.pom
channel stopped