You are viewing a plain text version of this content. The canonical link for it is here.
Posted to builds@hbase.apache.org by Apache Jenkins Server <je...@builds.apache.org> on 2017/01/29 07:25:04 UTC

Build failed in Jenkins: HBase-Trunk_matrix » JDK 1.8 (latest),Hadoop #2405

See <https://builds.apache.org/job/HBase-Trunk_matrix/jdk=JDK%201.8%20(latest),label=Hadoop/2405/>

------------------------------------------
[...truncated 7328 lines...]
[WARNING] Using platform encoding (ISO-8859-1 actually) to copy filtered resources, i.e. build is platform dependent!
[INFO] Copying 2 resources
[INFO] 
[INFO] --- maven-archetype-plugin:2.4:jar (default-jar) @ hbase-client-project-archetype ---
[INFO] Building archetype jar: <https://builds.apache.org/job/HBase-Trunk_matrix/jdk=JDK%201.8%20(latest),label=Hadoop/ws/hbase-archetypes/hbase-client-project/target/build-archetype/target/generated-sources/archetype/target/hbase-client-project-archetype-2.0.0-SNAPSHOT>
[INFO] ------------------------------------------------------------------------
[INFO] BUILD SUCCESS
[INFO] ------------------------------------------------------------------------
[INFO] Total time: 1.072s
[INFO] Finished at: Sun Jan 29 07:20:21 UTC 2017
[INFO] Final Memory: 20M/724M
[INFO] ------------------------------------------------------------------------
[INFO] Archetype project created in <https://builds.apache.org/job/HBase-Trunk_matrix/jdk=JDK%201.8%20(latest),label=Hadoop/ws/hbase-archetypes/hbase-client-project/target/build-archetype/target/generated-sources/archetype>
[INFO] ------------------------------------------------------------------------
[INFO] BUILD SUCCESS
[INFO] ------------------------------------------------------------------------
[INFO] Total time: 3.553s
[INFO] Finished at: Sun Jan 29 07:20:21 UTC 2017
[INFO] Final Memory: 21M/724M
[INFO] ------------------------------------------------------------------------
[INFO] Scanning for projects...
[INFO]                                                                         
[INFO] ------------------------------------------------------------------------
[INFO] Building Apache HBase - Exemplar for hbase-shaded-client archetype 2.0.0-SNAPSHOT
[INFO] ------------------------------------------------------------------------
[INFO] 
[INFO] >>> maven-archetype-plugin:2.4:create-from-project (default-cli) @ hbase-shaded-client-project >>>
[INFO] 
[INFO] <<< maven-archetype-plugin:2.4:create-from-project (default-cli) @ hbase-shaded-client-project <<<
[INFO] 
[INFO] --- maven-archetype-plugin:2.4:create-from-project (default-cli) @ hbase-shaded-client-project ---
[INFO] Setting default groupId: org.apache.hbase
[INFO] Setting default artifactId: hbase-shaded-client-project
[INFO] Setting default version: 2.0.0-SNAPSHOT
[INFO] Setting default package: org.apache.hbase.archetypes.exemplars.shaded_client
[INFO] Scanning for projects...
[INFO]                                                                         
[INFO] ------------------------------------------------------------------------
[INFO] Building hbase-shaded-client-project-archetype 2.0.0-SNAPSHOT
[INFO] ------------------------------------------------------------------------
[INFO] 
[INFO] --- maven-resources-plugin:3.0.1:resources (default-resources) @ hbase-shaded-client-project-archetype ---
[WARNING] Using platform encoding (ISO-8859-1 actually) to copy filtered resources, i.e. build is platform dependent!
[INFO] Copying 6 resources
[INFO] 
[INFO] --- maven-resources-plugin:3.0.1:testResources (default-testResources) @ hbase-shaded-client-project-archetype ---
[WARNING] Using platform encoding (ISO-8859-1 actually) to copy filtered resources, i.e. build is platform dependent!
[INFO] Copying 2 resources
[INFO] 
[INFO] --- maven-archetype-plugin:2.4:jar (default-jar) @ hbase-shaded-client-project-archetype ---
[INFO] Building archetype jar: <https://builds.apache.org/job/HBase-Trunk_matrix/jdk=JDK%201.8%20(latest),label=Hadoop/ws/hbase-archetypes/hbase-shaded-client-project/target/build-archetype/target/generated-sources/archetype/target/hbase-shaded-client-project-archetype-2.0.0-SNAPSHOT>
[INFO] ------------------------------------------------------------------------
[INFO] BUILD SUCCESS
[INFO] ------------------------------------------------------------------------
[INFO] Total time: 1.183s
[INFO] Finished at: Sun Jan 29 07:20:26 UTC 2017
[INFO] Final Memory: 20M/724M
[INFO] ------------------------------------------------------------------------
[INFO] Archetype project created in <https://builds.apache.org/job/HBase-Trunk_matrix/jdk=JDK%201.8%20(latest),label=Hadoop/ws/hbase-archetypes/hbase-shaded-client-project/target/build-archetype/target/generated-sources/archetype>
[INFO] ------------------------------------------------------------------------
[INFO] BUILD SUCCESS
[INFO] ------------------------------------------------------------------------
[INFO] Total time: 3.638s
[INFO] Finished at: Sun Jan 29 07:20:26 UTC 2017
[INFO] Final Memory: 21M/724M
[INFO] ------------------------------------------------------------------------
[INFO] 
[INFO] --- maven-resources-plugin:2.7:copy-resources (hbase-client-ARCHETYPE__copy-pom-to-temp-for-xslt-processing) @ hbase-archetype-builder ---
[INFO] Using 'UTF-8' encoding to copy filtered resources.
[INFO] Copying 1 resource
[INFO] 
[INFO] --- maven-resources-plugin:2.7:copy-resources (hbase-shaded-client-ARCHETYPE__copy-pom-to-temp-for-xslt-processing) @ hbase-archetype-builder ---
[INFO] Using 'UTF-8' encoding to copy filtered resources.
[INFO] Copying 1 resource
[INFO] 
[INFO] --- xml-maven-plugin:1.0.1:transform (modify-archetype-pom-files-via-xslt) @ hbase-archetype-builder ---
[INFO] Transforming file: <https://builds.apache.org/job/HBase-Trunk_matrix/jdk=JDK%201.8%20(latest),label=Hadoop/2405/artifact/hbase-archetypes/hbase-archetype-builder/../hbase-client-project/target/temp-arch/pom.xml>
[INFO] Transformed 1 file(s).
[INFO] Transforming file: <https://builds.apache.org/job/HBase-Trunk_matrix/jdk=JDK%201.8%20(latest),label=Hadoop/2405/artifact/hbase-archetypes/hbase-archetype-builder/../hbase-shaded-client-project/target/temp-arch/pom.xml>
[INFO] Transformed 1 file(s).
[INFO] 
[INFO] --- maven-install-plugin:2.5.2:install (default-install) @ hbase-archetype-builder ---
[INFO] Installing <https://builds.apache.org/job/HBase-Trunk_matrix/jdk=JDK%201.8%20(latest),label=Hadoop/2405/artifact/hbase-archetypes/hbase-archetype-builder/pom.xml> to /home/jenkins/.m2/repository/org/apache/hbase/hbase-archetype-builder/2.0.0-SNAPSHOT/hbase-archetype-builder-2.0.0-SNAPSHOT.pom
[INFO] 
[INFO] --- exec-maven-plugin:1.4.0:exec (run-installArchetypes-script) @ hbase-archetype-builder ---
[INFO] Scanning for projects...
[INFO]                                                                         
[INFO] ------------------------------------------------------------------------
[INFO] Building hbase-client-project-archetype 2.0.0-SNAPSHOT
[INFO] ------------------------------------------------------------------------
[INFO] 
[INFO] --- maven-resources-plugin:3.0.1:resources (default-resources) @ hbase-client-project-archetype ---
[INFO] Using 'UTF-8' encoding to copy filtered resources.
[INFO] Copying 6 resources
[INFO] 
[INFO] --- maven-resources-plugin:3.0.1:testResources (default-testResources) @ hbase-client-project-archetype ---
[INFO] Using 'UTF-8' encoding to copy filtered resources.
[INFO] Copying 2 resources
[INFO] 
[INFO] --- maven-archetype-plugin:2.4:jar (default-jar) @ hbase-client-project-archetype ---
[INFO] Building archetype jar: <https://builds.apache.org/job/HBase-Trunk_matrix/jdk=JDK%201.8%20(latest),label=Hadoop/ws/hbase-archetypes/hbase-client-project/target/build-archetype/target/generated-sources/archetype/target/hbase-client-project-archetype-2.0.0-SNAPSHOT>
[INFO] 
[INFO] --- maven-archetype-plugin:2.4:integration-test (default-integration-test) @ hbase-client-project-archetype ---
[INFO] Processing Archetype IT project: basic
[INFO] ----------------------------------------------------------------------------
[INFO] Using following parameters for creating project from Archetype: hbase-client-project-archetype:2.0.0-SNAPSHOT
[INFO] ----------------------------------------------------------------------------
[INFO] Parameter: groupId, Value: archetype.it
[INFO] Parameter: artifactId, Value: basic
[INFO] Parameter: version, Value: 0.1-SNAPSHOT
[INFO] Parameter: package, Value: it.pkg
[INFO] Parameter: packageInPathFormat, Value: it/pkg
[INFO] Parameter: version, Value: 0.1-SNAPSHOT
[INFO] Parameter: package, Value: it.pkg
[INFO] Parameter: groupId, Value: archetype.it
[INFO] Parameter: artifactId, Value: basic
[INFO] project created from Archetype in dir: <https://builds.apache.org/job/HBase-Trunk_matrix/jdk=JDK%201.8%20(latest),label=Hadoop/ws/hbase-archetypes/hbase-client-project/target/build-archetype/target/generated-sources/archetype/target/test-classes/projects/basic/project/basic>
[INFO] 
[INFO] --- maven-install-plugin:2.5.2:install (default-install) @ hbase-client-project-archetype ---
[INFO] Installing <https://builds.apache.org/job/HBase-Trunk_matrix/jdk=JDK%201.8%20(latest),label=Hadoop/ws/hbase-archetypes/hbase-client-project/target/build-archetype/target/generated-sources/archetype/target/hbase-client-project-archetype-2.0.0-SNAPSHOT.jar> to /home/jenkins/.m2/repository/org/apache/hbase/hbase-client-project-archetype/2.0.0-SNAPSHOT/hbase-client-project-archetype-2.0.0-SNAPSHOT.jar
[INFO] Installing <https://builds.apache.org/job/HBase-Trunk_matrix/jdk=JDK%201.8%20(latest),label=Hadoop/2405/artifact/hbase-archetypes/hbase-client-project/target/build-archetype/target/generated-sources/archetype/pom.xml> to /home/jenkins/.m2/repository/org/apache/hbase/hbase-client-project-archetype/2.0.0-SNAPSHOT/hbase-client-project-archetype-2.0.0-SNAPSHOT.pom
[INFO] 
[INFO] --- maven-archetype-plugin:2.4:update-local-catalog (default-update-local-catalog) @ hbase-client-project-archetype ---
[INFO] ------------------------------------------------------------------------
[INFO] BUILD SUCCESS
[INFO] ------------------------------------------------------------------------
[INFO] Total time: 1.306s
[INFO] Finished at: Sun Jan 29 07:20:29 UTC 2017
[INFO] Final Memory: 21M/724M
[INFO] ------------------------------------------------------------------------
[INFO] Scanning for projects...
[INFO]                                                                         
[INFO] ------------------------------------------------------------------------
[INFO] Building hbase-shaded-client-project-archetype 2.0.0-SNAPSHOT
[INFO] ------------------------------------------------------------------------
[INFO] 
[INFO] --- maven-resources-plugin:3.0.1:resources (default-resources) @ hbase-shaded-client-project-archetype ---
[INFO] Using 'UTF-8' encoding to copy filtered resources.
[INFO] Copying 6 resources
[INFO] 
[INFO] --- maven-resources-plugin:3.0.1:testResources (default-testResources) @ hbase-shaded-client-project-archetype ---
[INFO] Using 'UTF-8' encoding to copy filtered resources.
[INFO] Copying 2 resources
[INFO] 
[INFO] --- maven-archetype-plugin:2.4:jar (default-jar) @ hbase-shaded-client-project-archetype ---
[INFO] Building archetype jar: <https://builds.apache.org/job/HBase-Trunk_matrix/jdk=JDK%201.8%20(latest),label=Hadoop/ws/hbase-archetypes/hbase-shaded-client-project/target/build-archetype/target/generated-sources/archetype/target/hbase-shaded-client-project-archetype-2.0.0-SNAPSHOT>
[INFO] 
[INFO] --- maven-archetype-plugin:2.4:integration-test (default-integration-test) @ hbase-shaded-client-project-archetype ---
[INFO] Processing Archetype IT project: basic
[INFO] ----------------------------------------------------------------------------
[INFO] Using following parameters for creating project from Archetype: hbase-shaded-client-project-archetype:2.0.0-SNAPSHOT
[INFO] ----------------------------------------------------------------------------
[INFO] Parameter: groupId, Value: archetype.it
[INFO] Parameter: artifactId, Value: basic
[INFO] Parameter: version, Value: 0.1-SNAPSHOT
[INFO] Parameter: package, Value: it.pkg
[INFO] Parameter: packageInPathFormat, Value: it/pkg
[INFO] Parameter: version, Value: 0.1-SNAPSHOT
[INFO] Parameter: package, Value: it.pkg
[INFO] Parameter: groupId, Value: archetype.it
[INFO] Parameter: artifactId, Value: basic
[INFO] project created from Archetype in dir: <https://builds.apache.org/job/HBase-Trunk_matrix/jdk=JDK%201.8%20(latest),label=Hadoop/ws/hbase-archetypes/hbase-shaded-client-project/target/build-archetype/target/generated-sources/archetype/target/test-classes/projects/basic/project/basic>
[INFO] 
[INFO] --- maven-install-plugin:2.5.2:install (default-install) @ hbase-shaded-client-project-archetype ---
[INFO] Installing <https://builds.apache.org/job/HBase-Trunk_matrix/jdk=JDK%201.8%20(latest),label=Hadoop/ws/hbase-archetypes/hbase-shaded-client-project/target/build-archetype/target/generated-sources/archetype/target/hbase-shaded-client-project-archetype-2.0.0-SNAPSHOT.jar> to /home/jenkins/.m2/repository/org/apache/hbase/hbase-shaded-client-project-archetype/2.0.0-SNAPSHOT/hbase-shaded-client-project-archetype-2.0.0-SNAPSHOT.jar
[INFO] Installing <https://builds.apache.org/job/HBase-Trunk_matrix/jdk=JDK%201.8%20(latest),label=Hadoop/2405/artifact/hbase-archetypes/hbase-shaded-client-project/target/build-archetype/target/generated-sources/archetype/pom.xml> to /home/jenkins/.m2/repository/org/apache/hbase/hbase-shaded-client-project-archetype/2.0.0-SNAPSHOT/hbase-shaded-client-project-archetype-2.0.0-SNAPSHOT.pom
[INFO] 
[INFO] --- maven-archetype-plugin:2.4:update-local-catalog (default-update-local-catalog) @ hbase-shaded-client-project-archetype ---
[INFO] ------------------------------------------------------------------------
[INFO] BUILD SUCCESS
[INFO] ------------------------------------------------------------------------
[INFO] Total time: 1.276s
[INFO] Finished at: Sun Jan 29 07:20:32 UTC 2017
[INFO] Final Memory: 21M/724M
[INFO] ------------------------------------------------------------------------
[INFO] ------------------------------------------------------------------------
[INFO] Reactor Summary:
[INFO] 
[INFO] Apache HBase ...................................... SUCCESS [1.971s]
[INFO] Apache HBase - Checkstyle ......................... SUCCESS [0.889s]
[INFO] Apache HBase - Resource Bundle .................... SUCCESS [0.278s]
[INFO] Apache HBase - Annotations ........................ SUCCESS [0.250s]
[INFO] Apache HBase - Common ............................. SUCCESS [1:42.648s]
[INFO] Apache HBase - Protocol ........................... SUCCESS [0.836s]
[INFO] Apache HBase - Shaded Protocol .................... SUCCESS [1.185s]
[INFO] Apache HBase - Procedure .......................... SUCCESS [2:32.082s]
[INFO] Apache HBase - Client ............................. SUCCESS [1:58.356s]
[INFO] Apache HBase - Metrics API ........................ SUCCESS [1.438s]
[INFO] Apache HBase - Hadoop Compatibility ............... SUCCESS [9.277s]
[INFO] Apache HBase - Metrics Implementation ............. SUCCESS [4.185s]
[INFO] Apache HBase - Hadoop Two Compatibility ........... SUCCESS [10.654s]
[INFO] Apache HBase - Prefix Tree ........................ SUCCESS [10.028s]
[INFO] Apache HBase - Server ............................. FAILURE [1:29:39.869s]
[INFO] Apache HBase - Testing Util ....................... SKIPPED
[INFO] Apache HBase - Thrift ............................. SKIPPED
[INFO] Apache HBase - RSGroup ............................ SKIPPED
[INFO] Apache HBase - Shell .............................. SKIPPED
[INFO] Apache HBase - Coprocessor Endpoint ............... SKIPPED
[INFO] Apache HBase - Integration Tests .................. SKIPPED
[INFO] Apache HBase - Examples ........................... SKIPPED
[INFO] Apache HBase - Rest ............................... SKIPPED
[INFO] Apache HBase - External Block Cache ............... SKIPPED
[INFO] Apache HBase - Spark .............................. SKIPPED
[INFO] Apache HBase - Assembly ........................... SKIPPED
[INFO] Apache HBase - Shaded ............................. SUCCESS [0.072s]
[INFO] Apache HBase - Shaded - Client .................... SUCCESS [0.701s]
[INFO] Apache HBase - Shaded - Server .................... SKIPPED
[INFO] Apache HBase - Archetypes ......................... SUCCESS [0.061s]
[INFO] Apache HBase - Exemplar for hbase-client archetype  SKIPPED
[INFO] Apache HBase - Exemplar for hbase-shaded-client archetype  SKIPPED
[INFO] Apache HBase - Archetype builder .................. SUCCESS [15.644s]
[INFO] ------------------------------------------------------------------------
[INFO] BUILD FAILURE
[INFO] ------------------------------------------------------------------------
[INFO] Total time: 1:36:51.665s
[INFO] Finished at: Sun Jan 29 07:20:32 UTC 2017
[INFO] Final Memory: 77M/3852M
[INFO] ------------------------------------------------------------------------
[ERROR] Failed to execute goal org.apache.maven.plugins:maven-surefire-plugin:2.18.1:test (secondPartTestsExecution) on project hbase-server: There are test failures.
[ERROR] 
[ERROR] Please refer to <https://builds.apache.org/job/HBase-Trunk_matrix/jdk=JDK%201.8%20(latest),label=Hadoop/ws/hbase-server/target/surefire-reports> for the individual test results.
[ERROR] -> [Help 1]
[ERROR] 
[ERROR] To see the full stack trace of the errors, re-run Maven with the -e switch.
[ERROR] Re-run Maven using the -X switch to enable full debug logging.
[ERROR] 
[ERROR] For more information about the errors and possible solutions, please read the following articles:
[ERROR] [Help 1] http://cwiki.apache.org/confluence/display/MAVEN/MojoFailureException
[ERROR] 
[ERROR] After correcting the problems, you can resume the build with the command
[ERROR]   mvn <goals> -rf :hbase-server
Build step 'Invoke top-level Maven targets' marked build as failure
Performing Post build task...
Match found for :.* : True
Logical operation result is TRUE
Running script  : # Run zombie detector script
./dev-support/zombie-detector.sh --jenkins ${BUILD_ID}
[a3159d73] $ /bin/bash -xe /tmp/hudson698614579577572947.sh
+ ./dev-support/zombie-detector.sh --jenkins 2405
Sun Jan 29 07:20:33 UTC 2017 We're ok: there is no zombie test


    {color:green}+1 zombies{color}. No zombie tests found running at the end of the build.
POST BUILD TASK : SUCCESS
END OF POST BUILD TASK : 0
Archiving artifacts
Recording test results
[FINDBUGS] Skipping publisher since build result is FAILURE
[CHECKSTYLE] Skipping publisher since build result is FAILURE

Jenkins build is back to normal : HBase-Trunk_matrix » JDK 1.8 (latest),Hadoop #2408

Posted by Apache Jenkins Server <je...@builds.apache.org>.
See <https://builds.apache.org/job/HBase-Trunk_matrix/jdk=JDK%201.8%20(latest),label=Hadoop/2408/>


Build failed in Jenkins: HBase-Trunk_matrix » JDK 1.8 (latest),Hadoop #2407

Posted by Apache Jenkins Server <je...@builds.apache.org>.
See <https://builds.apache.org/job/HBase-Trunk_matrix/jdk=JDK%201.8%20(latest),label=Hadoop/2407/>

------------------------------------------
[...truncated 7305 lines...]
[WARNING] Using platform encoding (ISO-8859-1 actually) to copy filtered resources, i.e. build is platform dependent!
[INFO] Copying 2 resources
[INFO] 
[INFO] --- maven-archetype-plugin:2.4:jar (default-jar) @ hbase-client-project-archetype ---
[INFO] Building archetype jar: <https://builds.apache.org/job/HBase-Trunk_matrix/jdk=JDK%201.8%20(latest),label=Hadoop/ws/hbase-archetypes/hbase-client-project/target/build-archetype/target/generated-sources/archetype/target/hbase-client-project-archetype-2.0.0-SNAPSHOT>
[INFO] ------------------------------------------------------------------------
[INFO] BUILD SUCCESS
[INFO] ------------------------------------------------------------------------
[INFO] Total time: 1.128s
[INFO] Finished at: Sun Jan 29 15:19:51 UTC 2017
[INFO] Final Memory: 20M/724M
[INFO] ------------------------------------------------------------------------
[INFO] Archetype project created in <https://builds.apache.org/job/HBase-Trunk_matrix/jdk=JDK%201.8%20(latest),label=Hadoop/ws/hbase-archetypes/hbase-client-project/target/build-archetype/target/generated-sources/archetype>
[INFO] ------------------------------------------------------------------------
[INFO] BUILD SUCCESS
[INFO] ------------------------------------------------------------------------
[INFO] Total time: 3.604s
[INFO] Finished at: Sun Jan 29 15:19:51 UTC 2017
[INFO] Final Memory: 21M/724M
[INFO] ------------------------------------------------------------------------
[INFO] Scanning for projects...
[INFO]                                                                         
[INFO] ------------------------------------------------------------------------
[INFO] Building Apache HBase - Exemplar for hbase-shaded-client archetype 2.0.0-SNAPSHOT
[INFO] ------------------------------------------------------------------------
[INFO] 
[INFO] >>> maven-archetype-plugin:2.4:create-from-project (default-cli) @ hbase-shaded-client-project >>>
[INFO] 
[INFO] <<< maven-archetype-plugin:2.4:create-from-project (default-cli) @ hbase-shaded-client-project <<<
[INFO] 
[INFO] --- maven-archetype-plugin:2.4:create-from-project (default-cli) @ hbase-shaded-client-project ---
[INFO] Setting default groupId: org.apache.hbase
[INFO] Setting default artifactId: hbase-shaded-client-project
[INFO] Setting default version: 2.0.0-SNAPSHOT
[INFO] Setting default package: org.apache.hbase.archetypes.exemplars.shaded_client
[INFO] Scanning for projects...
[INFO]                                                                         
[INFO] ------------------------------------------------------------------------
[INFO] Building hbase-shaded-client-project-archetype 2.0.0-SNAPSHOT
[INFO] ------------------------------------------------------------------------
[INFO] 
[INFO] --- maven-resources-plugin:3.0.1:resources (default-resources) @ hbase-shaded-client-project-archetype ---
[WARNING] Using platform encoding (ISO-8859-1 actually) to copy filtered resources, i.e. build is platform dependent!
[INFO] Copying 6 resources
[INFO] 
[INFO] --- maven-resources-plugin:3.0.1:testResources (default-testResources) @ hbase-shaded-client-project-archetype ---
[WARNING] Using platform encoding (ISO-8859-1 actually) to copy filtered resources, i.e. build is platform dependent!
[INFO] Copying 2 resources
[INFO] 
[INFO] --- maven-archetype-plugin:2.4:jar (default-jar) @ hbase-shaded-client-project-archetype ---
[INFO] Building archetype jar: <https://builds.apache.org/job/HBase-Trunk_matrix/jdk=JDK%201.8%20(latest),label=Hadoop/ws/hbase-archetypes/hbase-shaded-client-project/target/build-archetype/target/generated-sources/archetype/target/hbase-shaded-client-project-archetype-2.0.0-SNAPSHOT>
[INFO] ------------------------------------------------------------------------
[INFO] BUILD SUCCESS
[INFO] ------------------------------------------------------------------------
[INFO] Total time: 1.090s
[INFO] Finished at: Sun Jan 29 15:19:56 UTC 2017
[INFO] Final Memory: 20M/724M
[INFO] ------------------------------------------------------------------------
[INFO] Archetype project created in <https://builds.apache.org/job/HBase-Trunk_matrix/jdk=JDK%201.8%20(latest),label=Hadoop/ws/hbase-archetypes/hbase-shaded-client-project/target/build-archetype/target/generated-sources/archetype>
[INFO] ------------------------------------------------------------------------
[INFO] BUILD SUCCESS
[INFO] ------------------------------------------------------------------------
[INFO] Total time: 3.470s
[INFO] Finished at: Sun Jan 29 15:19:56 UTC 2017
[INFO] Final Memory: 21M/724M
[INFO] ------------------------------------------------------------------------
[INFO] 
[INFO] --- maven-resources-plugin:2.7:copy-resources (hbase-client-ARCHETYPE__copy-pom-to-temp-for-xslt-processing) @ hbase-archetype-builder ---
[INFO] Using 'UTF-8' encoding to copy filtered resources.
[INFO] Copying 1 resource
[INFO] 
[INFO] --- maven-resources-plugin:2.7:copy-resources (hbase-shaded-client-ARCHETYPE__copy-pom-to-temp-for-xslt-processing) @ hbase-archetype-builder ---
[INFO] Using 'UTF-8' encoding to copy filtered resources.
[INFO] Copying 1 resource
[INFO] 
[INFO] --- xml-maven-plugin:1.0.1:transform (modify-archetype-pom-files-via-xslt) @ hbase-archetype-builder ---
[INFO] Transforming file: <https://builds.apache.org/job/HBase-Trunk_matrix/jdk=JDK%201.8%20(latest),label=Hadoop/2407/artifact/hbase-archetypes/hbase-archetype-builder/../hbase-client-project/target/temp-arch/pom.xml>
[INFO] Transformed 1 file(s).
[INFO] Transforming file: <https://builds.apache.org/job/HBase-Trunk_matrix/jdk=JDK%201.8%20(latest),label=Hadoop/2407/artifact/hbase-archetypes/hbase-archetype-builder/../hbase-shaded-client-project/target/temp-arch/pom.xml>
[INFO] Transformed 1 file(s).
[INFO] 
[INFO] --- maven-install-plugin:2.5.2:install (default-install) @ hbase-archetype-builder ---
[INFO] Installing <https://builds.apache.org/job/HBase-Trunk_matrix/jdk=JDK%201.8%20(latest),label=Hadoop/2407/artifact/hbase-archetypes/hbase-archetype-builder/pom.xml> to /home/jenkins/.m2/repository/org/apache/hbase/hbase-archetype-builder/2.0.0-SNAPSHOT/hbase-archetype-builder-2.0.0-SNAPSHOT.pom
[INFO] 
[INFO] --- exec-maven-plugin:1.4.0:exec (run-installArchetypes-script) @ hbase-archetype-builder ---
[INFO] Scanning for projects...
[INFO]                                                                         
[INFO] ------------------------------------------------------------------------
[INFO] Building hbase-client-project-archetype 2.0.0-SNAPSHOT
[INFO] ------------------------------------------------------------------------
[INFO] 
[INFO] --- maven-resources-plugin:3.0.1:resources (default-resources) @ hbase-client-project-archetype ---
[INFO] Using 'UTF-8' encoding to copy filtered resources.
[INFO] Copying 6 resources
[INFO] 
[INFO] --- maven-resources-plugin:3.0.1:testResources (default-testResources) @ hbase-client-project-archetype ---
[INFO] Using 'UTF-8' encoding to copy filtered resources.
[INFO] Copying 2 resources
[INFO] 
[INFO] --- maven-archetype-plugin:2.4:jar (default-jar) @ hbase-client-project-archetype ---
[INFO] Building archetype jar: <https://builds.apache.org/job/HBase-Trunk_matrix/jdk=JDK%201.8%20(latest),label=Hadoop/ws/hbase-archetypes/hbase-client-project/target/build-archetype/target/generated-sources/archetype/target/hbase-client-project-archetype-2.0.0-SNAPSHOT>
[INFO] 
[INFO] --- maven-archetype-plugin:2.4:integration-test (default-integration-test) @ hbase-client-project-archetype ---
[INFO] Processing Archetype IT project: basic
[INFO] ----------------------------------------------------------------------------
[INFO] Using following parameters for creating project from Archetype: hbase-client-project-archetype:2.0.0-SNAPSHOT
[INFO] ----------------------------------------------------------------------------
[INFO] Parameter: groupId, Value: archetype.it
[INFO] Parameter: artifactId, Value: basic
[INFO] Parameter: version, Value: 0.1-SNAPSHOT
[INFO] Parameter: package, Value: it.pkg
[INFO] Parameter: packageInPathFormat, Value: it/pkg
[INFO] Parameter: version, Value: 0.1-SNAPSHOT
[INFO] Parameter: package, Value: it.pkg
[INFO] Parameter: groupId, Value: archetype.it
[INFO] Parameter: artifactId, Value: basic
[INFO] project created from Archetype in dir: <https://builds.apache.org/job/HBase-Trunk_matrix/jdk=JDK%201.8%20(latest),label=Hadoop/ws/hbase-archetypes/hbase-client-project/target/build-archetype/target/generated-sources/archetype/target/test-classes/projects/basic/project/basic>
[INFO] 
[INFO] --- maven-install-plugin:2.5.2:install (default-install) @ hbase-client-project-archetype ---
[INFO] Installing <https://builds.apache.org/job/HBase-Trunk_matrix/jdk=JDK%201.8%20(latest),label=Hadoop/ws/hbase-archetypes/hbase-client-project/target/build-archetype/target/generated-sources/archetype/target/hbase-client-project-archetype-2.0.0-SNAPSHOT.jar> to /home/jenkins/.m2/repository/org/apache/hbase/hbase-client-project-archetype/2.0.0-SNAPSHOT/hbase-client-project-archetype-2.0.0-SNAPSHOT.jar
[INFO] Installing <https://builds.apache.org/job/HBase-Trunk_matrix/jdk=JDK%201.8%20(latest),label=Hadoop/2407/artifact/hbase-archetypes/hbase-client-project/target/build-archetype/target/generated-sources/archetype/pom.xml> to /home/jenkins/.m2/repository/org/apache/hbase/hbase-client-project-archetype/2.0.0-SNAPSHOT/hbase-client-project-archetype-2.0.0-SNAPSHOT.pom
[INFO] 
[INFO] --- maven-archetype-plugin:2.4:update-local-catalog (default-update-local-catalog) @ hbase-client-project-archetype ---
[INFO] ------------------------------------------------------------------------
[INFO] BUILD SUCCESS
[INFO] ------------------------------------------------------------------------
[INFO] Total time: 1.320s
[INFO] Finished at: Sun Jan 29 15:19:59 UTC 2017
[INFO] Final Memory: 21M/724M
[INFO] ------------------------------------------------------------------------
[INFO] Scanning for projects...
[INFO]                                                                         
[INFO] ------------------------------------------------------------------------
[INFO] Building hbase-shaded-client-project-archetype 2.0.0-SNAPSHOT
[INFO] ------------------------------------------------------------------------
[INFO] 
[INFO] --- maven-resources-plugin:3.0.1:resources (default-resources) @ hbase-shaded-client-project-archetype ---
[INFO] Using 'UTF-8' encoding to copy filtered resources.
[INFO] Copying 6 resources
[INFO] 
[INFO] --- maven-resources-plugin:3.0.1:testResources (default-testResources) @ hbase-shaded-client-project-archetype ---
[INFO] Using 'UTF-8' encoding to copy filtered resources.
[INFO] Copying 2 resources
[INFO] 
[INFO] --- maven-archetype-plugin:2.4:jar (default-jar) @ hbase-shaded-client-project-archetype ---
[INFO] Building archetype jar: <https://builds.apache.org/job/HBase-Trunk_matrix/jdk=JDK%201.8%20(latest),label=Hadoop/ws/hbase-archetypes/hbase-shaded-client-project/target/build-archetype/target/generated-sources/archetype/target/hbase-shaded-client-project-archetype-2.0.0-SNAPSHOT>
[INFO] 
[INFO] --- maven-archetype-plugin:2.4:integration-test (default-integration-test) @ hbase-shaded-client-project-archetype ---
[INFO] Processing Archetype IT project: basic
[INFO] ----------------------------------------------------------------------------
[INFO] Using following parameters for creating project from Archetype: hbase-shaded-client-project-archetype:2.0.0-SNAPSHOT
[INFO] ----------------------------------------------------------------------------
[INFO] Parameter: groupId, Value: archetype.it
[INFO] Parameter: artifactId, Value: basic
[INFO] Parameter: version, Value: 0.1-SNAPSHOT
[INFO] Parameter: package, Value: it.pkg
[INFO] Parameter: packageInPathFormat, Value: it/pkg
[INFO] Parameter: version, Value: 0.1-SNAPSHOT
[INFO] Parameter: package, Value: it.pkg
[INFO] Parameter: groupId, Value: archetype.it
[INFO] Parameter: artifactId, Value: basic
[INFO] project created from Archetype in dir: <https://builds.apache.org/job/HBase-Trunk_matrix/jdk=JDK%201.8%20(latest),label=Hadoop/ws/hbase-archetypes/hbase-shaded-client-project/target/build-archetype/target/generated-sources/archetype/target/test-classes/projects/basic/project/basic>
[INFO] 
[INFO] --- maven-install-plugin:2.5.2:install (default-install) @ hbase-shaded-client-project-archetype ---
[INFO] Installing <https://builds.apache.org/job/HBase-Trunk_matrix/jdk=JDK%201.8%20(latest),label=Hadoop/ws/hbase-archetypes/hbase-shaded-client-project/target/build-archetype/target/generated-sources/archetype/target/hbase-shaded-client-project-archetype-2.0.0-SNAPSHOT.jar> to /home/jenkins/.m2/repository/org/apache/hbase/hbase-shaded-client-project-archetype/2.0.0-SNAPSHOT/hbase-shaded-client-project-archetype-2.0.0-SNAPSHOT.jar
[INFO] Installing <https://builds.apache.org/job/HBase-Trunk_matrix/jdk=JDK%201.8%20(latest),label=Hadoop/2407/artifact/hbase-archetypes/hbase-shaded-client-project/target/build-archetype/target/generated-sources/archetype/pom.xml> to /home/jenkins/.m2/repository/org/apache/hbase/hbase-shaded-client-project-archetype/2.0.0-SNAPSHOT/hbase-shaded-client-project-archetype-2.0.0-SNAPSHOT.pom
[INFO] 
[INFO] --- maven-archetype-plugin:2.4:update-local-catalog (default-update-local-catalog) @ hbase-shaded-client-project-archetype ---
[INFO] ------------------------------------------------------------------------
[INFO] BUILD SUCCESS
[INFO] ------------------------------------------------------------------------
[INFO] Total time: 1.305s
[INFO] Finished at: Sun Jan 29 15:20:01 UTC 2017
[INFO] Final Memory: 21M/724M
[INFO] ------------------------------------------------------------------------
[INFO] ------------------------------------------------------------------------
[INFO] Reactor Summary:
[INFO] 
[INFO] Apache HBase ...................................... SUCCESS [1.870s]
[INFO] Apache HBase - Checkstyle ......................... SUCCESS [0.821s]
[INFO] Apache HBase - Resource Bundle .................... SUCCESS [0.211s]
[INFO] Apache HBase - Annotations ........................ SUCCESS [0.229s]
[INFO] Apache HBase - Common ............................. SUCCESS [1:42.746s]
[INFO] Apache HBase - Protocol ........................... SUCCESS [0.794s]
[INFO] Apache HBase - Shaded Protocol .................... SUCCESS [1.231s]
[INFO] Apache HBase - Procedure .......................... SUCCESS [2:32.234s]
[INFO] Apache HBase - Client ............................. SUCCESS [1:59.061s]
[INFO] Apache HBase - Metrics API ........................ SUCCESS [1.476s]
[INFO] Apache HBase - Hadoop Compatibility ............... SUCCESS [9.098s]
[INFO] Apache HBase - Metrics Implementation ............. SUCCESS [4.365s]
[INFO] Apache HBase - Hadoop Two Compatibility ........... SUCCESS [10.737s]
[INFO] Apache HBase - Prefix Tree ........................ SUCCESS [10.007s]
[INFO] Apache HBase - Server ............................. FAILURE [1:29:09.568s]
[INFO] Apache HBase - Testing Util ....................... SKIPPED
[INFO] Apache HBase - Thrift ............................. SKIPPED
[INFO] Apache HBase - RSGroup ............................ SKIPPED
[INFO] Apache HBase - Shell .............................. SKIPPED
[INFO] Apache HBase - Coprocessor Endpoint ............... SKIPPED
[INFO] Apache HBase - Integration Tests .................. SKIPPED
[INFO] Apache HBase - Examples ........................... SKIPPED
[INFO] Apache HBase - Rest ............................... SKIPPED
[INFO] Apache HBase - External Block Cache ............... SKIPPED
[INFO] Apache HBase - Spark .............................. SKIPPED
[INFO] Apache HBase - Assembly ........................... SKIPPED
[INFO] Apache HBase - Shaded ............................. SUCCESS [0.067s]
[INFO] Apache HBase - Shaded - Client .................... SUCCESS [0.715s]
[INFO] Apache HBase - Shaded - Server .................... SKIPPED
[INFO] Apache HBase - Archetypes ......................... SUCCESS [0.035s]
[INFO] Apache HBase - Exemplar for hbase-client archetype  SKIPPED
[INFO] Apache HBase - Exemplar for hbase-shaded-client archetype  SKIPPED
[INFO] Apache HBase - Archetype builder .................. SUCCESS [15.732s]
[INFO] ------------------------------------------------------------------------
[INFO] BUILD FAILURE
[INFO] ------------------------------------------------------------------------
[INFO] Total time: 1:36:22.409s
[INFO] Finished at: Sun Jan 29 15:20:02 UTC 2017
[INFO] Final Memory: 481M/2667M
[INFO] ------------------------------------------------------------------------
[ERROR] Failed to execute goal org.apache.maven.plugins:maven-surefire-plugin:2.18.1:test (secondPartTestsExecution) on project hbase-server: There was a timeout or other error in the fork -> [Help 1]
[ERROR] 
[ERROR] To see the full stack trace of the errors, re-run Maven with the -e switch.
[ERROR] Re-run Maven using the -X switch to enable full debug logging.
[ERROR] 
[ERROR] For more information about the errors and possible solutions, please read the following articles:
[ERROR] [Help 1] http://cwiki.apache.org/confluence/display/MAVEN/MojoFailureException
[ERROR] 
[ERROR] After correcting the problems, you can resume the build with the command
[ERROR]   mvn <goals> -rf :hbase-server
Build step 'Invoke top-level Maven targets' marked build as failure
Performing Post build task...
Match found for :.* : True
Logical operation result is TRUE
Running script  : # Run zombie detector script
./dev-support/zombie-detector.sh --jenkins ${BUILD_ID}
[a3159d73] $ /bin/bash -xe /tmp/hudson5760208124676400945.sh
+ ./dev-support/zombie-detector.sh --jenkins 2407
Sun Jan 29 15:20:03 UTC 2017 Found 1 suspicious java process(es) listed below; waiting 30s to see if just slow to stop
1267 surefirebooter3301203226305611630.jar -enableassertions -Dhbase.build.id=2407 -Xmx2800m -Djava.security.egd=file:/dev/./urandom -Djava.net.preferIPv4Stack=true -Djava.awt.headless=true
tail: cannot open '+2' for reading: No such file or directory
Sun Jan 29 15:20:33 UTC 2017 We're ok: there was a zombie candidate but it went away


    {color:green}+1 zombies{color}. No zombie tests found running at the end of the build (There were candidates but they seem to have gone away).
POST BUILD TASK : SUCCESS
END OF POST BUILD TASK : 0
Archiving artifacts
Recording test results
[FINDBUGS] Skipping publisher since build result is FAILURE
[CHECKSTYLE] Skipping publisher since build result is FAILURE

Build failed in Jenkins: HBase-Trunk_matrix » JDK 1.8 (latest),Hadoop #2406

Posted by Apache Jenkins Server <je...@builds.apache.org>.
See <https://builds.apache.org/job/HBase-Trunk_matrix/jdk=JDK%201.8%20(latest),label=Hadoop/2406/changes>

Changes:

[stack] HBASE-17563 Changed for-loops and switch-statements in RootDocProcessor

[stack] HBASE-17555 Changed calls to deprecated getHBaseAdmin to getAdmin

------------------------------------------
[...truncated 7341 lines...]
[WARNING] Using platform encoding (ISO-8859-1 actually) to copy filtered resources, i.e. build is platform dependent!
[INFO] Copying 2 resources
[INFO] 
[INFO] --- maven-archetype-plugin:2.4:jar (default-jar) @ hbase-client-project-archetype ---
[INFO] Building archetype jar: <https://builds.apache.org/job/HBase-Trunk_matrix/jdk=JDK%201.8%20(latest),label=Hadoop/ws/hbase-archetypes/hbase-client-project/target/build-archetype/target/generated-sources/archetype/target/hbase-client-project-archetype-2.0.0-SNAPSHOT>
[INFO] ------------------------------------------------------------------------
[INFO] BUILD SUCCESS
[INFO] ------------------------------------------------------------------------
[INFO] Total time: 1.204s
[INFO] Finished at: Sun Jan 29 11:39:19 UTC 2017
[INFO] Final Memory: 20M/724M
[INFO] ------------------------------------------------------------------------
[INFO] Archetype project created in <https://builds.apache.org/job/HBase-Trunk_matrix/jdk=JDK%201.8%20(latest),label=Hadoop/ws/hbase-archetypes/hbase-client-project/target/build-archetype/target/generated-sources/archetype>
[INFO] ------------------------------------------------------------------------
[INFO] BUILD SUCCESS
[INFO] ------------------------------------------------------------------------
[INFO] Total time: 3.540s
[INFO] Finished at: Sun Jan 29 11:39:19 UTC 2017
[INFO] Final Memory: 21M/724M
[INFO] ------------------------------------------------------------------------
[INFO] Scanning for projects...
[INFO]                                                                         
[INFO] ------------------------------------------------------------------------
[INFO] Building Apache HBase - Exemplar for hbase-shaded-client archetype 2.0.0-SNAPSHOT
[INFO] ------------------------------------------------------------------------
[INFO] 
[INFO] >>> maven-archetype-plugin:2.4:create-from-project (default-cli) @ hbase-shaded-client-project >>>
[INFO] 
[INFO] <<< maven-archetype-plugin:2.4:create-from-project (default-cli) @ hbase-shaded-client-project <<<
[INFO] 
[INFO] --- maven-archetype-plugin:2.4:create-from-project (default-cli) @ hbase-shaded-client-project ---
[INFO] Setting default groupId: org.apache.hbase
[INFO] Setting default artifactId: hbase-shaded-client-project
[INFO] Setting default version: 2.0.0-SNAPSHOT
[INFO] Setting default package: org.apache.hbase.archetypes.exemplars.shaded_client
[INFO] Scanning for projects...
[INFO]                                                                         
[INFO] ------------------------------------------------------------------------
[INFO] Building hbase-shaded-client-project-archetype 2.0.0-SNAPSHOT
[INFO] ------------------------------------------------------------------------
[INFO] 
[INFO] --- maven-resources-plugin:3.0.1:resources (default-resources) @ hbase-shaded-client-project-archetype ---
[WARNING] Using platform encoding (ISO-8859-1 actually) to copy filtered resources, i.e. build is platform dependent!
[INFO] Copying 6 resources
[INFO] 
[INFO] --- maven-resources-plugin:3.0.1:testResources (default-testResources) @ hbase-shaded-client-project-archetype ---
[WARNING] Using platform encoding (ISO-8859-1 actually) to copy filtered resources, i.e. build is platform dependent!
[INFO] Copying 2 resources
[INFO] 
[INFO] --- maven-archetype-plugin:2.4:jar (default-jar) @ hbase-shaded-client-project-archetype ---
[INFO] Building archetype jar: <https://builds.apache.org/job/HBase-Trunk_matrix/jdk=JDK%201.8%20(latest),label=Hadoop/ws/hbase-archetypes/hbase-shaded-client-project/target/build-archetype/target/generated-sources/archetype/target/hbase-shaded-client-project-archetype-2.0.0-SNAPSHOT>
[INFO] ------------------------------------------------------------------------
[INFO] BUILD SUCCESS
[INFO] ------------------------------------------------------------------------
[INFO] Total time: 1.103s
[INFO] Finished at: Sun Jan 29 11:39:24 UTC 2017
[INFO] Final Memory: 20M/724M
[INFO] ------------------------------------------------------------------------
[INFO] Archetype project created in <https://builds.apache.org/job/HBase-Trunk_matrix/jdk=JDK%201.8%20(latest),label=Hadoop/ws/hbase-archetypes/hbase-shaded-client-project/target/build-archetype/target/generated-sources/archetype>
[INFO] ------------------------------------------------------------------------
[INFO] BUILD SUCCESS
[INFO] ------------------------------------------------------------------------
[INFO] Total time: 3.591s
[INFO] Finished at: Sun Jan 29 11:39:24 UTC 2017
[INFO] Final Memory: 21M/724M
[INFO] ------------------------------------------------------------------------
[INFO] 
[INFO] --- maven-resources-plugin:2.7:copy-resources (hbase-client-ARCHETYPE__copy-pom-to-temp-for-xslt-processing) @ hbase-archetype-builder ---
[INFO] Using 'UTF-8' encoding to copy filtered resources.
[INFO] Copying 1 resource
[INFO] 
[INFO] --- maven-resources-plugin:2.7:copy-resources (hbase-shaded-client-ARCHETYPE__copy-pom-to-temp-for-xslt-processing) @ hbase-archetype-builder ---
[INFO] Using 'UTF-8' encoding to copy filtered resources.
[INFO] Copying 1 resource
[INFO] 
[INFO] --- xml-maven-plugin:1.0.1:transform (modify-archetype-pom-files-via-xslt) @ hbase-archetype-builder ---
[INFO] Transforming file: <https://builds.apache.org/job/HBase-Trunk_matrix/jdk=JDK%201.8%20(latest),label=Hadoop/2406/artifact/hbase-archetypes/hbase-archetype-builder/../hbase-client-project/target/temp-arch/pom.xml>
[INFO] Transformed 1 file(s).
[INFO] Transforming file: <https://builds.apache.org/job/HBase-Trunk_matrix/jdk=JDK%201.8%20(latest),label=Hadoop/2406/artifact/hbase-archetypes/hbase-archetype-builder/../hbase-shaded-client-project/target/temp-arch/pom.xml>
[INFO] Transformed 1 file(s).
[INFO] 
[INFO] --- maven-install-plugin:2.5.2:install (default-install) @ hbase-archetype-builder ---
[INFO] Installing <https://builds.apache.org/job/HBase-Trunk_matrix/jdk=JDK%201.8%20(latest),label=Hadoop/2406/artifact/hbase-archetypes/hbase-archetype-builder/pom.xml> to /home/jenkins/.m2/repository/org/apache/hbase/hbase-archetype-builder/2.0.0-SNAPSHOT/hbase-archetype-builder-2.0.0-SNAPSHOT.pom
[INFO] 
[INFO] --- exec-maven-plugin:1.4.0:exec (run-installArchetypes-script) @ hbase-archetype-builder ---
[INFO] Scanning for projects...
[INFO]                                                                         
[INFO] ------------------------------------------------------------------------
[INFO] Building hbase-client-project-archetype 2.0.0-SNAPSHOT
[INFO] ------------------------------------------------------------------------
[INFO] 
[INFO] --- maven-resources-plugin:3.0.1:resources (default-resources) @ hbase-client-project-archetype ---
[INFO] Using 'UTF-8' encoding to copy filtered resources.
[INFO] Copying 6 resources
[INFO] 
[INFO] --- maven-resources-plugin:3.0.1:testResources (default-testResources) @ hbase-client-project-archetype ---
[INFO] Using 'UTF-8' encoding to copy filtered resources.
[INFO] Copying 2 resources
[INFO] 
[INFO] --- maven-archetype-plugin:2.4:jar (default-jar) @ hbase-client-project-archetype ---
[INFO] Building archetype jar: <https://builds.apache.org/job/HBase-Trunk_matrix/jdk=JDK%201.8%20(latest),label=Hadoop/ws/hbase-archetypes/hbase-client-project/target/build-archetype/target/generated-sources/archetype/target/hbase-client-project-archetype-2.0.0-SNAPSHOT>
[INFO] 
[INFO] --- maven-archetype-plugin:2.4:integration-test (default-integration-test) @ hbase-client-project-archetype ---
[INFO] Processing Archetype IT project: basic
[INFO] ----------------------------------------------------------------------------
[INFO] Using following parameters for creating project from Archetype: hbase-client-project-archetype:2.0.0-SNAPSHOT
[INFO] ----------------------------------------------------------------------------
[INFO] Parameter: groupId, Value: archetype.it
[INFO] Parameter: artifactId, Value: basic
[INFO] Parameter: version, Value: 0.1-SNAPSHOT
[INFO] Parameter: package, Value: it.pkg
[INFO] Parameter: packageInPathFormat, Value: it/pkg
[INFO] Parameter: version, Value: 0.1-SNAPSHOT
[INFO] Parameter: package, Value: it.pkg
[INFO] Parameter: groupId, Value: archetype.it
[INFO] Parameter: artifactId, Value: basic
[INFO] project created from Archetype in dir: <https://builds.apache.org/job/HBase-Trunk_matrix/jdk=JDK%201.8%20(latest),label=Hadoop/ws/hbase-archetypes/hbase-client-project/target/build-archetype/target/generated-sources/archetype/target/test-classes/projects/basic/project/basic>
[INFO] 
[INFO] --- maven-install-plugin:2.5.2:install (default-install) @ hbase-client-project-archetype ---
[INFO] Installing <https://builds.apache.org/job/HBase-Trunk_matrix/jdk=JDK%201.8%20(latest),label=Hadoop/ws/hbase-archetypes/hbase-client-project/target/build-archetype/target/generated-sources/archetype/target/hbase-client-project-archetype-2.0.0-SNAPSHOT.jar> to /home/jenkins/.m2/repository/org/apache/hbase/hbase-client-project-archetype/2.0.0-SNAPSHOT/hbase-client-project-archetype-2.0.0-SNAPSHOT.jar
[INFO] Installing <https://builds.apache.org/job/HBase-Trunk_matrix/jdk=JDK%201.8%20(latest),label=Hadoop/2406/artifact/hbase-archetypes/hbase-client-project/target/build-archetype/target/generated-sources/archetype/pom.xml> to /home/jenkins/.m2/repository/org/apache/hbase/hbase-client-project-archetype/2.0.0-SNAPSHOT/hbase-client-project-archetype-2.0.0-SNAPSHOT.pom
[INFO] 
[INFO] --- maven-archetype-plugin:2.4:update-local-catalog (default-update-local-catalog) @ hbase-client-project-archetype ---
[INFO] ------------------------------------------------------------------------
[INFO] BUILD SUCCESS
[INFO] ------------------------------------------------------------------------
[INFO] Total time: 1.250s
[INFO] Finished at: Sun Jan 29 11:39:27 UTC 2017
[INFO] Final Memory: 21M/724M
[INFO] ------------------------------------------------------------------------
[INFO] Scanning for projects...
[INFO]                                                                         
[INFO] ------------------------------------------------------------------------
[INFO] Building hbase-shaded-client-project-archetype 2.0.0-SNAPSHOT
[INFO] ------------------------------------------------------------------------
[INFO] 
[INFO] --- maven-resources-plugin:3.0.1:resources (default-resources) @ hbase-shaded-client-project-archetype ---
[INFO] Using 'UTF-8' encoding to copy filtered resources.
[INFO] Copying 6 resources
[INFO] 
[INFO] --- maven-resources-plugin:3.0.1:testResources (default-testResources) @ hbase-shaded-client-project-archetype ---
[INFO] Using 'UTF-8' encoding to copy filtered resources.
[INFO] Copying 2 resources
[INFO] 
[INFO] --- maven-archetype-plugin:2.4:jar (default-jar) @ hbase-shaded-client-project-archetype ---
[INFO] Building archetype jar: <https://builds.apache.org/job/HBase-Trunk_matrix/jdk=JDK%201.8%20(latest),label=Hadoop/ws/hbase-archetypes/hbase-shaded-client-project/target/build-archetype/target/generated-sources/archetype/target/hbase-shaded-client-project-archetype-2.0.0-SNAPSHOT>
[INFO] 
[INFO] --- maven-archetype-plugin:2.4:integration-test (default-integration-test) @ hbase-shaded-client-project-archetype ---
[INFO] Processing Archetype IT project: basic
[INFO] ----------------------------------------------------------------------------
[INFO] Using following parameters for creating project from Archetype: hbase-shaded-client-project-archetype:2.0.0-SNAPSHOT
[INFO] ----------------------------------------------------------------------------
[INFO] Parameter: groupId, Value: archetype.it
[INFO] Parameter: artifactId, Value: basic
[INFO] Parameter: version, Value: 0.1-SNAPSHOT
[INFO] Parameter: package, Value: it.pkg
[INFO] Parameter: packageInPathFormat, Value: it/pkg
[INFO] Parameter: version, Value: 0.1-SNAPSHOT
[INFO] Parameter: package, Value: it.pkg
[INFO] Parameter: groupId, Value: archetype.it
[INFO] Parameter: artifactId, Value: basic
[INFO] project created from Archetype in dir: <https://builds.apache.org/job/HBase-Trunk_matrix/jdk=JDK%201.8%20(latest),label=Hadoop/ws/hbase-archetypes/hbase-shaded-client-project/target/build-archetype/target/generated-sources/archetype/target/test-classes/projects/basic/project/basic>
[INFO] 
[INFO] --- maven-install-plugin:2.5.2:install (default-install) @ hbase-shaded-client-project-archetype ---
[INFO] Installing <https://builds.apache.org/job/HBase-Trunk_matrix/jdk=JDK%201.8%20(latest),label=Hadoop/ws/hbase-archetypes/hbase-shaded-client-project/target/build-archetype/target/generated-sources/archetype/target/hbase-shaded-client-project-archetype-2.0.0-SNAPSHOT.jar> to /home/jenkins/.m2/repository/org/apache/hbase/hbase-shaded-client-project-archetype/2.0.0-SNAPSHOT/hbase-shaded-client-project-archetype-2.0.0-SNAPSHOT.jar
[INFO] Installing <https://builds.apache.org/job/HBase-Trunk_matrix/jdk=JDK%201.8%20(latest),label=Hadoop/2406/artifact/hbase-archetypes/hbase-shaded-client-project/target/build-archetype/target/generated-sources/archetype/pom.xml> to /home/jenkins/.m2/repository/org/apache/hbase/hbase-shaded-client-project-archetype/2.0.0-SNAPSHOT/hbase-shaded-client-project-archetype-2.0.0-SNAPSHOT.pom
[INFO] 
[INFO] --- maven-archetype-plugin:2.4:update-local-catalog (default-update-local-catalog) @ hbase-shaded-client-project-archetype ---
[INFO] ------------------------------------------------------------------------
[INFO] BUILD SUCCESS
[INFO] ------------------------------------------------------------------------
[INFO] Total time: 1.269s
[INFO] Finished at: Sun Jan 29 11:39:29 UTC 2017
[INFO] Final Memory: 21M/724M
[INFO] ------------------------------------------------------------------------
[INFO] ------------------------------------------------------------------------
[INFO] Reactor Summary:
[INFO] 
[INFO] Apache HBase ...................................... SUCCESS [2.371s]
[INFO] Apache HBase - Checkstyle ......................... SUCCESS [0.947s]
[INFO] Apache HBase - Resource Bundle .................... SUCCESS [0.259s]
[INFO] Apache HBase - Annotations ........................ SUCCESS [0.230s]
[INFO] Apache HBase - Common ............................. SUCCESS [1:57.575s]
[INFO] Apache HBase - Protocol ........................... SUCCESS [1.052s]
[INFO] Apache HBase - Shaded Protocol .................... SUCCESS [1.409s]
[INFO] Apache HBase - Procedure .......................... SUCCESS [2:50.810s]
[INFO] Apache HBase - Client ............................. SUCCESS [2:12.999s]
[INFO] Apache HBase - Metrics API ........................ SUCCESS [2.084s]
[INFO] Apache HBase - Hadoop Compatibility ............... SUCCESS [10.594s]
[INFO] Apache HBase - Metrics Implementation ............. SUCCESS [5.607s]
[INFO] Apache HBase - Hadoop Two Compatibility ........... SUCCESS [13.163s]
[INFO] Apache HBase - Prefix Tree ........................ SUCCESS [13.012s]
[INFO] Apache HBase - Server ............................. FAILURE [1:45:10.584s]
[INFO] Apache HBase - Testing Util ....................... SKIPPED
[INFO] Apache HBase - Thrift ............................. SKIPPED
[INFO] Apache HBase - RSGroup ............................ SKIPPED
[INFO] Apache HBase - Shell .............................. SKIPPED
[INFO] Apache HBase - Coprocessor Endpoint ............... SKIPPED
[INFO] Apache HBase - Integration Tests .................. SKIPPED
[INFO] Apache HBase - Examples ........................... SKIPPED
[INFO] Apache HBase - Rest ............................... SKIPPED
[INFO] Apache HBase - External Block Cache ............... SKIPPED
[INFO] Apache HBase - Spark .............................. SKIPPED
[INFO] Apache HBase - Assembly ........................... SKIPPED
[INFO] Apache HBase - Shaded ............................. SUCCESS [0.059s]
[INFO] Apache HBase - Shaded - Client .................... SUCCESS [0.723s]
[INFO] Apache HBase - Shaded - Server .................... SKIPPED
[INFO] Apache HBase - Archetypes ......................... SUCCESS [0.030s]
[INFO] Apache HBase - Exemplar for hbase-client archetype  SKIPPED
[INFO] Apache HBase - Exemplar for hbase-shaded-client archetype  SKIPPED
[INFO] Apache HBase - Archetype builder .................. SUCCESS [15.360s]
[INFO] ------------------------------------------------------------------------
[INFO] BUILD FAILURE
[INFO] ------------------------------------------------------------------------
[INFO] Total time: 1:53:20.223s
[INFO] Finished at: Sun Jan 29 11:39:30 UTC 2017
[INFO] Final Memory: 77M/1887M
[INFO] ------------------------------------------------------------------------
[ERROR] Failed to execute goal org.apache.maven.plugins:maven-surefire-plugin:2.18.1:test (secondPartTestsExecution) on project hbase-server: There are test failures.
[ERROR] 
[ERROR] Please refer to <https://builds.apache.org/job/HBase-Trunk_matrix/jdk=JDK%201.8%20(latest),label=Hadoop/ws/hbase-server/target/surefire-reports> for the individual test results.
[ERROR] -> [Help 1]
[ERROR] 
[ERROR] To see the full stack trace of the errors, re-run Maven with the -e switch.
[ERROR] Re-run Maven using the -X switch to enable full debug logging.
[ERROR] 
[ERROR] For more information about the errors and possible solutions, please read the following articles:
[ERROR] [Help 1] http://cwiki.apache.org/confluence/display/MAVEN/MojoFailureException
[ERROR] 
[ERROR] After correcting the problems, you can resume the build with the command
[ERROR]   mvn <goals> -rf :hbase-server
Build step 'Invoke top-level Maven targets' marked build as failure
Performing Post build task...
Match found for :.* : True
Logical operation result is TRUE
Running script  : # Run zombie detector script
./dev-support/zombie-detector.sh --jenkins ${BUILD_ID}
[a3159d73] $ /bin/bash -xe /tmp/hudson2774610646240956998.sh
+ ./dev-support/zombie-detector.sh --jenkins 2406
Sun Jan 29 11:39:31 UTC 2017 We're ok: there is no zombie test


    {color:green}+1 zombies{color}. No zombie tests found running at the end of the build.
POST BUILD TASK : SUCCESS
END OF POST BUILD TASK : 0
Archiving artifacts
Recording test results
[FINDBUGS] Skipping publisher since build result is FAILURE
[CHECKSTYLE] Skipping publisher since build result is FAILURE