You are viewing a plain text version of this content. The canonical link for it is here.
Posted to builds@lucene.apache.org by Apache Jenkins Server <je...@builds.apache.org> on 2024/03/08 12:59:12 UTC
[JENKINS] Lucene » Lucene-MMAPv2-Linux (s390x big endian) - Build # 452 - Still Unstable!
Build: https://ci-builds.apache.org/job/Lucene/job/Lucene-MMAPv2-Linux%20(s390x%20big%20endian)/452/
2 tests failed.
FAILED: org.apache.lucene.TestMergeSchedulerExternal.testSubclassConcurrentMergeScheduler
Error Message:
java.lang.AssertionError
Stack Trace:
java.lang.AssertionError
at __randomizedtesting.SeedInfo.seed([48AF0C85866430D9:CF2EB12882444ADD]:0)
at org.junit.Assert.fail(Assert.java:87)
at org.junit.Assert.assertTrue(Assert.java:42)
at org.junit.Assert.assertTrue(Assert.java:53)
at org.apache.lucene.TestMergeSchedulerExternal.testSubclassConcurrentMergeScheduler(TestMergeSchedulerExternal.java:156)
at java.base/jdk.internal.reflect.DirectMethodHandleAccessor.invoke(DirectMethodHandleAccessor.java:103)
at java.base/java.lang.reflect.Method.invoke(Method.java:580)
at com.carrotsearch.randomizedtesting.RandomizedRunner.invoke(RandomizedRunner.java:1758)
at com.carrotsearch.randomizedtesting.RandomizedRunner$8.evaluate(RandomizedRunner.java:946)
at com.carrotsearch.randomizedtesting.RandomizedRunner$9.evaluate(RandomizedRunner.java:982)
at com.carrotsearch.randomizedtesting.RandomizedRunner$10.evaluate(RandomizedRunner.java:996)
at org.apache.lucene.tests.util.TestRuleSetupTeardownChained$1.evaluate(TestRuleSetupTeardownChained.java:48)
at org.apache.lucene.tests.util.AbstractBeforeAfterRule$1.evaluate(AbstractBeforeAfterRule.java:43)
at org.apache.lucene.tests.util.TestRuleThreadAndTestName$1.evaluate(TestRuleThreadAndTestName.java:45)
at org.apache.lucene.tests.util.TestRuleIgnoreAfterMaxFailures$1.evaluate(TestRuleIgnoreAfterMaxFailures.java:60)
at org.apache.lucene.tests.util.TestRuleMarkFailure$1.evaluate(TestRuleMarkFailure.java:44)
at org.junit.rules.RunRules.evaluate(RunRules.java:20)
at com.carrotsearch.randomizedtesting.rules.StatementAdapter.evaluate(StatementAdapter.java:36)
at com.carrotsearch.randomizedtesting.ThreadLeakControl$StatementRunner.run(ThreadLeakControl.java:390)
at com.carrotsearch.randomizedtesting.ThreadLeakControl.forkTimeoutingTask(ThreadLeakControl.java:843)
at com.carrotsearch.randomizedtesting.ThreadLeakControl$3.evaluate(ThreadLeakControl.java:490)
at com.carrotsearch.randomizedtesting.RandomizedRunner.runSingleTest(RandomizedRunner.java:955)
at com.carrotsearch.randomizedtesting.RandomizedRunner$5.evaluate(RandomizedRunner.java:840)
at com.carrotsearch.randomizedtesting.RandomizedRunner$6.evaluate(RandomizedRunner.java:891)
at com.carrotsearch.randomizedtesting.RandomizedRunner$7.evaluate(RandomizedRunner.java:902)
at org.apache.lucene.tests.util.AbstractBeforeAfterRule$1.evaluate(AbstractBeforeAfterRule.java:43)
at com.carrotsearch.randomizedtesting.rules.StatementAdapter.evaluate(StatementAdapter.java:36)
at org.apache.lucene.tests.util.TestRuleStoreClassName$1.evaluate(TestRuleStoreClassName.java:38)
at com.carrotsearch.randomizedtesting.rules.NoShadowingOrOverridesOnMethodsRule$1.evaluate(NoShadowingOrOverridesOnMethodsRule.java:40)
at com.carrotsearch.randomizedtesting.rules.NoShadowingOrOverridesOnMethodsRule$1.evaluate(NoShadowingOrOverridesOnMethodsRule.java:40)
at com.carrotsearch.randomizedtesting.rules.StatementAdapter.evaluate(StatementAdapter.java:36)
at com.carrotsearch.randomizedtesting.rules.StatementAdapter.evaluate(StatementAdapter.java:36)
at org.apache.lucene.tests.util.TestRuleAssertionsRequired$1.evaluate(TestRuleAssertionsRequired.java:53)
at org.apache.lucene.tests.util.AbstractBeforeAfterRule$1.evaluate(AbstractBeforeAfterRule.java:43)
at org.apache.lucene.tests.util.TestRuleMarkFailure$1.evaluate(TestRuleMarkFailure.java:44)
at org.apache.lucene.tests.util.TestRuleIgnoreAfterMaxFailures$1.evaluate(TestRuleIgnoreAfterMaxFailures.java:60)
at org.apache.lucene.tests.util.TestRuleIgnoreTestSuites$1.evaluate(TestRuleIgnoreTestSuites.java:47)
at org.junit.rules.RunRules.evaluate(RunRules.java:20)
at com.carrotsearch.randomizedtesting.rules.StatementAdapter.evaluate(StatementAdapter.java:36)
at com.carrotsearch.randomizedtesting.ThreadLeakControl$StatementRunner.run(ThreadLeakControl.java:390)
at com.carrotsearch.randomizedtesting.ThreadLeakControl.lambda$forkTimeoutingTask$0(ThreadLeakControl.java:850)
at java.base/java.lang.Thread.run(Thread.java:1583)
FAILED: org.apache.lucene.index.TestIndexWriterWithThreads.testCloseWithThreads
Error Message:
java.lang.IllegalStateException: this writer hit an unrecoverable error; cannot commit
Stack Trace:
java.lang.IllegalStateException: this writer hit an unrecoverable error; cannot commit
at __randomizedtesting.SeedInfo.seed([48AF0C85866430D9:556B25F2E5912A7F]:0)
at org.apache.lucene.index.IndexWriter.startCommit(IndexWriter.java:5547)
at org.apache.lucene.index.IndexWriter.prepareCommitInternal(IndexWriter.java:3761)
at org.apache.lucene.index.IndexWriter.commitInternal(IndexWriter.java:4102)
at org.apache.lucene.index.IndexWriter.commit(IndexWriter.java:4064)
at org.apache.lucene.index.TestIndexWriterWithThreads.testCloseWithThreads(TestIndexWriterWithThreads.java:240)
at java.base/jdk.internal.reflect.DirectMethodHandleAccessor.invoke(DirectMethodHandleAccessor.java:103)
at java.base/java.lang.reflect.Method.invoke(Method.java:580)
at com.carrotsearch.randomizedtesting.RandomizedRunner.invoke(RandomizedRunner.java:1758)
at com.carrotsearch.randomizedtesting.RandomizedRunner$8.evaluate(RandomizedRunner.java:946)
at com.carrotsearch.randomizedtesting.RandomizedRunner$9.evaluate(RandomizedRunner.java:982)
at com.carrotsearch.randomizedtesting.RandomizedRunner$10.evaluate(RandomizedRunner.java:996)
at org.apache.lucene.tests.util.TestRuleSetupTeardownChained$1.evaluate(TestRuleSetupTeardownChained.java:48)
at org.apache.lucene.tests.util.AbstractBeforeAfterRule$1.evaluate(AbstractBeforeAfterRule.java:43)
at org.apache.lucene.tests.util.TestRuleThreadAndTestName$1.evaluate(TestRuleThreadAndTestName.java:45)
at org.apache.lucene.tests.util.TestRuleIgnoreAfterMaxFailures$1.evaluate(TestRuleIgnoreAfterMaxFailures.java:60)
at org.apache.lucene.tests.util.TestRuleMarkFailure$1.evaluate(TestRuleMarkFailure.java:44)
at org.junit.rules.RunRules.evaluate(RunRules.java:20)
at com.carrotsearch.randomizedtesting.rules.StatementAdapter.evaluate(StatementAdapter.java:36)
at com.carrotsearch.randomizedtesting.ThreadLeakControl$StatementRunner.run(ThreadLeakControl.java:390)
at com.carrotsearch.randomizedtesting.ThreadLeakControl.forkTimeoutingTask(ThreadLeakControl.java:843)
at com.carrotsearch.randomizedtesting.ThreadLeakControl$3.evaluate(ThreadLeakControl.java:490)
at com.carrotsearch.randomizedtesting.RandomizedRunner.runSingleTest(RandomizedRunner.java:955)
at com.carrotsearch.randomizedtesting.RandomizedRunner$5.evaluate(RandomizedRunner.java:840)
at com.carrotsearch.randomizedtesting.RandomizedRunner$6.evaluate(RandomizedRunner.java:891)
at com.carrotsearch.randomizedtesting.RandomizedRunner$7.evaluate(RandomizedRunner.java:902)
at org.apache.lucene.tests.util.AbstractBeforeAfterRule$1.evaluate(AbstractBeforeAfterRule.java:43)
at com.carrotsearch.randomizedtesting.rules.StatementAdapter.evaluate(StatementAdapter.java:36)
at org.apache.lucene.tests.util.TestRuleStoreClassName$1.evaluate(TestRuleStoreClassName.java:38)
at com.carrotsearch.randomizedtesting.rules.NoShadowingOrOverridesOnMethodsRule$1.evaluate(NoShadowingOrOverridesOnMethodsRule.java:40)
at com.carrotsearch.randomizedtesting.rules.NoShadowingOrOverridesOnMethodsRule$1.evaluate(NoShadowingOrOverridesOnMethodsRule.java:40)
at com.carrotsearch.randomizedtesting.rules.StatementAdapter.evaluate(StatementAdapter.java:36)
at com.carrotsearch.randomizedtesting.rules.StatementAdapter.evaluate(StatementAdapter.java:36)
at org.apache.lucene.tests.util.TestRuleAssertionsRequired$1.evaluate(TestRuleAssertionsRequired.java:53)
at org.apache.lucene.tests.util.AbstractBeforeAfterRule$1.evaluate(AbstractBeforeAfterRule.java:43)
at org.apache.lucene.tests.util.TestRuleMarkFailure$1.evaluate(TestRuleMarkFailure.java:44)
at org.apache.lucene.tests.util.TestRuleIgnoreAfterMaxFailures$1.evaluate(TestRuleIgnoreAfterMaxFailures.java:60)
at org.apache.lucene.tests.util.TestRuleIgnoreTestSuites$1.evaluate(TestRuleIgnoreTestSuites.java:47)
at org.junit.rules.RunRules.evaluate(RunRules.java:20)
at com.carrotsearch.randomizedtesting.rules.StatementAdapter.evaluate(StatementAdapter.java:36)
at com.carrotsearch.randomizedtesting.ThreadLeakControl$StatementRunner.run(ThreadLeakControl.java:390)
at com.carrotsearch.randomizedtesting.ThreadLeakControl.lambda$forkTimeoutingTask$0(ThreadLeakControl.java:850)
at java.base/java.lang.Thread.run(Thread.java:1583)
Caused by: java.nio.file.FileSystemException: /home/jenkins/jenkins-home/712657a4/workspace/Lucene/Lucene-MMAPv2-Linux (s390x big endian)/lucene/core/build/tmp/tests-tmp/lucene.index.TestIndexWriterWithThreads_48AF0C85866430D9-001/index-MMapDirectory-017/_7m_Lucene90TermVectorsIndexfile_pointers_uj.tmp: Too many open files
at org.apache.lucene.tests.mockfile.HandleLimitFS.onOpen(HandleLimitFS.java:67)
at org.apache.lucene.tests.mockfile.HandleTrackingFS.callOpenHook(HandleTrackingFS.java:82)
at org.apache.lucene.tests.mockfile.HandleTrackingFS.newOutputStream(HandleTrackingFS.java:163)
at org.apache.lucene.tests.mockfile.FilterFileSystemProvider.newOutputStream(FilterFileSystemProvider.java:200)
at java.base/java.nio.file.Files.newOutputStream(Files.java:227)
at org.apache.lucene.store.FSDirectory$FSIndexOutput.<init>(FSDirectory.java:389)
at org.apache.lucene.store.FSDirectory.createTempOutput(FSDirectory.java:229)
at org.apache.lucene.tests.store.MockDirectoryWrapper.createTempOutput(MockDirectoryWrapper.java:752)
at org.apache.lucene.store.FilterDirectory.createTempOutput(FilterDirectory.java:81)
at org.apache.lucene.store.TrackingDirectoryWrapper.createTempOutput(TrackingDirectoryWrapper.java:49)
at org.apache.lucene.codecs.lucene90.compressing.FieldsIndexWriter.<init>(FieldsIndexWriter.java:87)
at org.apache.lucene.codecs.lucene90.compressing.Lucene90CompressingTermVectorsWriter.<init>(Lucene90CompressingTermVectorsWriter.java:287)
at org.apache.lucene.codecs.lucene90.compressing.Lucene90CompressingTermVectorsFormat.vectorsWriter(Lucene90CompressingTermVectorsFormat.java:103)
at org.apache.lucene.index.TermVectorsConsumer.initTermVectorsWriter(TermVectorsConsumer.java:106)
at org.apache.lucene.index.TermVectorsConsumer.finishDocument(TermVectorsConsumer.java:126)
at org.apache.lucene.index.TermsHash.finishDocument(TermsHash.java:95)
at org.apache.lucene.index.IndexingChain.processDocument(IndexingChain.java:633)
at org.apache.lucene.index.DocumentsWriterPerThread.updateDocuments(DocumentsWriterPerThread.java:274)
at org.apache.lucene.index.DocumentsWriter.updateDocuments(DocumentsWriter.java:425)
at org.apache.lucene.index.IndexWriter.updateDocuments(IndexWriter.java:1549)
at org.apache.lucene.index.IndexWriter.updateDocument(IndexWriter.java:1834)
at org.apache.lucene.index.TestIndexWriterWithThreads$IndexerThread.run(TestIndexWriterWithThreads.java:93)
Build Log:
[...truncated 1628 lines...]
ERROR: The following test(s) have failed:
- org.apache.lucene.TestMergeSchedulerExternal.testSubclassConcurrentMergeScheduler (:lucene:core)
Test output: /home/jenkins/jenkins-home/712657a4/workspace/Lucene/Lucene-MMAPv2-Linux (s390x big endian)/lucene/core/build/test-results/test/outputs/OUTPUT-org.apache.lucene.TestMergeSchedulerExternal.txt
Reproduce with: gradlew :lucene:core:test --tests "org.apache.lucene.TestMergeSchedulerExternal.testSubclassConcurrentMergeScheduler" -Ptests.jvms=4 -Ptests.jvmargs= -Ptests.seed=48AF0C85866430D9 -Ptests.multiplier=2 -Ptests.directory=MMapDirectory -Ptests.gui=true -Ptests.file.encoding=US-ASCII -Ptests.vectorsize=128
- org.apache.lucene.index.TestIndexWriterWithThreads.testCloseWithThreads (:lucene:core)
Test output: /home/jenkins/jenkins-home/712657a4/workspace/Lucene/Lucene-MMAPv2-Linux (s390x big endian)/lucene/core/build/test-results/test/outputs/OUTPUT-org.apache.lucene.index.TestIndexWriterWithThreads.txt
Reproduce with: gradlew :lucene:core:test --tests "org.apache.lucene.index.TestIndexWriterWithThreads.testCloseWithThreads" -Ptests.jvms=4 -Ptests.jvmargs= -Ptests.seed=48AF0C85866430D9 -Ptests.multiplier=2 -Ptests.directory=MMapDirectory -Ptests.gui=true -Ptests.file.encoding=US-ASCII -Ptests.vectorsize=128
Deprecated Gradle features were used in this build, making it incompatible with Gradle 9.0.
You can use '--warning-mode all' to show the individual deprecation warnings and determine if they come from your own scripts or plugins.
For more on this, please refer to https://docs.gradle.org/8.4/userguide/command_line_interface.html#sec:command_line_warnings in the Gradle documentation.
BUILD SUCCESSFUL in 33m 48s
244 actionable tasks: 244 executed
Publishing build scan...
https://ge.apache.org/s/n7257li7nfo7a
Build step 'Invoke Gradle script' changed build result to SUCCESS
Archiving artifacts
hudson.FilePath$ValidateAntFileMask$1Cancel
at hudson.FilePath$ValidateAntFileMask$1.isCaseSensitive(FilePath.java:3338)
at org.apache.tools.ant.DirectoryScanner.lambda$isIncluded$3(DirectoryScanner.java:1389)
at java.base/java.util.stream.MatchOps$1MatchSink.accept(MatchOps.java:90)
at java.base/java.util.Spliterators$ArraySpliterator.tryAdvance(Spliterators.java:958)
at java.base/java.util.stream.ReferencePipeline.forEachWithCancel(ReferencePipeline.java:127)
at java.base/java.util.stream.AbstractPipeline.copyIntoWithCancel(AbstractPipeline.java:502)
at java.base/java.util.stream.AbstractPipeline.copyInto(AbstractPipeline.java:488)
at java.base/java.util.stream.AbstractPipeline.wrapAndCopyInto(AbstractPipeline.java:474)
at java.base/java.util.stream.MatchOps$MatchOp.evaluateSequential(MatchOps.java:230)
at java.base/java.util.stream.MatchOps$MatchOp.evaluateSequential(MatchOps.java:196)
at java.base/java.util.stream.AbstractPipeline.evaluate(AbstractPipeline.java:234)
at java.base/java.util.stream.ReferencePipeline.anyMatch(ReferencePipeline.java:528)
at org.apache.tools.ant.DirectoryScanner.isIncluded(DirectoryScanner.java:1389)
at org.apache.tools.ant.DirectoryScanner.scandir(DirectoryScanner.java:1256)
at org.apache.tools.ant.DirectoryScanner.scandir(DirectoryScanner.java:1282)
at org.apache.tools.ant.DirectoryScanner.scandir(DirectoryScanner.java:1282)
at org.apache.tools.ant.DirectoryScanner.scandir(DirectoryScanner.java:1282)
at org.apache.tools.ant.DirectoryScanner.scandir(DirectoryScanner.java:1282)
at org.apache.tools.ant.DirectoryScanner.scandir(DirectoryScanner.java:1282)
at org.apache.tools.ant.DirectoryScanner.scandir(DirectoryScanner.java:1282)
at org.apache.tools.ant.DirectoryScanner.scandir(DirectoryScanner.java:1282)
at org.apache.tools.ant.DirectoryScanner.scandir(DirectoryScanner.java:1282)
at org.apache.tools.ant.DirectoryScanner.scandir(DirectoryScanner.java:1198)
at org.apache.tools.ant.DirectoryScanner.scandir(DirectoryScanner.java:1160)
at org.apache.tools.ant.DirectoryScanner.checkIncludePatterns(DirectoryScanner.java:954)
at org.apache.tools.ant.DirectoryScanner.scan(DirectoryScanner.java:912)
at hudson.FilePath$ValidateAntFileMask.hasMatch(FilePath.java:3351)
Caused: hudson.FilePath$FileMaskNoMatchesFoundException: no matches found within 60000
at hudson.FilePath$ValidateAntFileMask.hasMatch(FilePath.java:3356)
at hudson.FilePath$ValidateAntFileMask.invoke(FilePath.java:3234)
at hudson.FilePath$ValidateAntFileMask.invoke(FilePath.java:3212)
at hudson.FilePath$FileCallableWrapper.call(FilePath.java:3616)
Also: hudson.remoting.Channel$CallSiteStackTrace: Remote call to jenkins-s390x-3
at hudson.remoting.Channel.attachCallSiteStackTrace(Channel.java:1787)
at hudson.remoting.UserRequest$ExceptionResponse.retrieve(UserRequest.java:356)
at hudson.remoting.Channel.call(Channel.java:1003)
at hudson.FilePath.act(FilePath.java:1230)
at hudson.FilePath.act(FilePath.java:1219)
at hudson.FilePath.validateAntFileMask(FilePath.java:3209)
at hudson.tasks.ArtifactArchiver.perform(ArtifactArchiver.java:271)
at hudson.tasks.BuildStepCompatibilityLayer.perform(BuildStepCompatibilityLayer.java:80)
at hudson.tasks.BuildStepMonitor$1.perform(BuildStepMonitor.java:20)
at hudson.model.AbstractBuild$AbstractBuildExecution.perform(AbstractBuild.java:818)
at hudson.model.AbstractBuild$AbstractBuildExecution.performAllBuildSteps(AbstractBuild.java:767)
at hudson.model.Build$BuildExecution.post2(Build.java:179)
at hudson.model.AbstractBuild$AbstractBuildExecution.post(AbstractBuild.java:711)
at hudson.model.Run.execute(Run.java:1864)
at hudson.model.FreeStyleBuild.run(FreeStyleBuild.java:44)
at hudson.model.ResourceController.execute(ResourceController.java:101)
at hudson.model.Executor.run(Executor.java:442)
Caused: hudson.FilePath$TunneledInterruptedException
at hudson.FilePath$FileCallableWrapper.call(FilePath.java:3618)
at hudson.remoting.UserRequest.perform(UserRequest.java:211)
at hudson.remoting.UserRequest.perform(UserRequest.java:54)
at hudson.remoting.Request$2.run(Request.java:377)
at hudson.remoting.InterceptingExecutorService.lambda$wrap$0(InterceptingExecutorService.java:78)
at java.base/java.util.concurrent.FutureTask.run(FutureTask.java:264)
at java.base/java.util.concurrent.ThreadPoolExecutor.runWorker(ThreadPoolExecutor.java:1128)
at java.base/java.util.concurrent.ThreadPoolExecutor$Worker.run(ThreadPoolExecutor.java:628)
at java.base/java.lang.Thread.run(Thread.java:829)
Caused: java.lang.InterruptedException: hudson.FilePath$FileMaskNoMatchesFoundException: no matches found within 60000
at hudson.FilePath.act(FilePath.java:1232)
at hudson.FilePath.act(FilePath.java:1219)
at hudson.FilePath.validateAntFileMask(FilePath.java:3209)
at hudson.tasks.ArtifactArchiver.perform(ArtifactArchiver.java:271)
at hudson.tasks.BuildStepCompatibilityLayer.perform(BuildStepCompatibilityLayer.java:80)
at hudson.tasks.BuildStepMonitor$1.perform(BuildStepMonitor.java:20)
at hudson.model.AbstractBuild$AbstractBuildExecution.perform(AbstractBuild.java:818)
at hudson.model.AbstractBuild$AbstractBuildExecution.performAllBuildSteps(AbstractBuild.java:767)
at hudson.model.Build$BuildExecution.post2(Build.java:179)
at hudson.model.AbstractBuild$AbstractBuildExecution.post(AbstractBuild.java:711)
at hudson.model.Run.execute(Run.java:1864)
at hudson.model.FreeStyleBuild.run(FreeStyleBuild.java:44)
at hudson.model.ResourceController.execute(ResourceController.java:101)
at hudson.model.Executor.run(Executor.java:442)
No artifacts found that match the file pattern "**/*.events,heapdumps/**,**/hs_err_pid*". Configuration error?
Recording test results
[Checks API] No suitable checks publisher found.
Build step 'Publish JUnit test result report' changed build result to UNSTABLE
Email was triggered for: Unstable (Test Failures)
Sending email for trigger: Unstable (Test Failures)