You are viewing a plain text version of this content. The canonical link for it is here.
Posted to commits@phoenix.apache.org by Apache Jenkins Server <je...@builds.apache.org> on 2014/10/13 10:36:58 UTC
Build failed in Jenkins: Phoenix | 3.0 | Hadoop1 #251
See <https://builds.apache.org/job/Phoenix-3.0-hadoop1/251/changes>
Changes:
[ramkrishna] Phoenix-1333 Store statistics guideposts as VARBINARY (Ramkrishna S
[ramkrishna] PHOENIX-1333 - Store statistics guideposts as VARBINARY (Add missing file
[ramkrishna] PHOENIX-1337 Unpadded fixed length tenant ID causes erroneous results
[gabrielr] PHOENIX-1341 Exit status for PhoenixRuntime
------------------------------------------
[...truncated 1689 lines...]
at org.apache.phoenix.coprocessor.GroupedAggregateRegionObserver.scanUnordered(GroupedAggregateRegionObserver.java:354)
at org.apache.phoenix.coprocessor.GroupedAggregateRegionObserver.doPostScannerOpen(GroupedAggregateRegionObserver.java:130)
at org.apache.phoenix.coprocessor.BaseScannerRegionObserver.postScannerOpen(BaseScannerRegionObserver.java:96)
... 8 more
at org.apache.hadoop.hbase.ipc.HBaseClient.call(HBaseClient.java:1012)
at org.apache.hadoop.hbase.ipc.WritableRpcEngine$Invoker.invoke(WritableRpcEngine.java:87)
at com.sun.proxy.$Proxy22.openScanner(Unknown Source)
at org.apache.hadoop.hbase.client.ScannerCallable.openScanner(ScannerCallable.java:224)
at org.apache.hadoop.hbase.client.ScannerCallable.call(ScannerCallable.java:126)
at org.apache.hadoop.hbase.client.ScannerCallable.call(ScannerCallable.java:42)
at org.apache.hadoop.hbase.client.ServerCallable.withRetries(ServerCallable.java:164)
at org.apache.hadoop.hbase.client.ClientScanner.nextScanner(ClientScanner.java:211)
at org.apache.hadoop.hbase.client.ClientScanner.initializeScannerInConstruction(ClientScanner.java:126)
at org.apache.hadoop.hbase.client.ClientScanner.<init>(ClientScanner.java:121)
at org.apache.hadoop.hbase.client.HTable.getScanner(HTable.java:702)
at org.apache.phoenix.iterate.TableResultIterator.<init>(TableResultIterator.java:54)
at org.apache.phoenix.iterate.ParallelIterators$2.call(ParallelIterators.java:583)
at org.apache.phoenix.iterate.ParallelIterators$2.call(ParallelIterators.java:578)
at java.util.concurrent.FutureTask$Sync.innerRun(FutureTask.java:334)
at java.util.concurrent.FutureTask.run(FutureTask.java:166)
at java.util.concurrent.ThreadPoolExecutor.runWorker(ThreadPoolExecutor.java:1145)
at java.util.concurrent.ThreadPoolExecutor$Worker.run(ThreadPoolExecutor.java:615)
at java.lang.Thread.run(Thread.java:724)
Running org.apache.phoenix.end2end.AutoCommitIT
Tests run: 1, Failures: 0, Errors: 0, Skipped: 0, Time elapsed: 3.359 sec - in org.apache.phoenix.end2end.ServerExceptionIT
Running org.apache.phoenix.end2end.LastValueFunctionIT
Tests run: 1, Failures: 0, Errors: 0, Skipped: 0, Time elapsed: 3.406 sec - in org.apache.phoenix.end2end.AutoCommitIT
Running org.apache.phoenix.end2end.RoundFloorCeilFunctionsEnd2EndIT
Tests run: 11, Failures: 0, Errors: 0, Skipped: 0, Time elapsed: 8.019 sec - in org.apache.phoenix.end2end.LastValueFunctionIT
Running org.apache.phoenix.end2end.LpadFunctionIT
Tests run: 30, Failures: 0, Errors: 0, Skipped: 0, Time elapsed: 8.501 sec - in org.apache.phoenix.end2end.RoundFloorCeilFunctionsEnd2EndIT
Tests run: 10, Failures: 0, Errors: 0, Skipped: 0, Time elapsed: 9.421 sec - in org.apache.phoenix.end2end.LpadFunctionIT
Tests run: 64, Failures: 0, Errors: 0, Skipped: 0, Time elapsed: 96.944 sec - in org.apache.phoenix.end2end.HashJoinIT
Tests run: 4, Failures: 0, Errors: 0, Skipped: 0, Time elapsed: 35.209 sec - in org.apache.phoenix.end2end.QueryMoreIT
Results :
Tests in error:
NthValueFunctionIT.offsetValueAscOrder:74 » PhoenixIO org.apache.phoenix.excep...
NthValueFunctionIT.simpleTest:49 » PhoenixIO org.apache.phoenix.exception.Phoe...
NthValueFunctionIT.offsetValueLastMismatchByColumn:124 » PhoenixIO org.apache....
NthValueFunctionIT.testSortOrderInDataColWithOffset:148 » PhoenixIO org.apache...
NthValueFunctionIT.offsetValueDescOrder:99 » PhoenixIO org.apache.phoenix.exce...
FirstValueFunctionIT.allColumnsNull:196 » PhoenixIO org.apache.phoenix.excepti...
FirstValueFunctionIT.floatDataType:171 » PhoenixIO org.apache.phoenix.exceptio...
FirstValueFunctionIT.signedLongAsBigInt:51 » PhoenixIO org.apache.phoenix.exce...
FirstValueFunctionIT.testSortOrderInDataCol:99 » PhoenixIO org.apache.phoenix....
FirstValueFunctionIT.doubleDataType:123 » PhoenixIO org.apache.phoenix.excepti...
FirstValueFunctionIT.testSortOrderInSortCol:75 » PhoenixIO org.apache.phoenix....
FirstValueFunctionIT.varcharFixedLenghtDatatype:147 » PhoenixIO org.apache.pho...
UpsertBigValuesIT.testIntegerKV:240 » PhoenixIO org.apache.phoenix.exception.P...
UpsertBigValuesIT.testBigIntKV:323 » PhoenixIO org.apache.phoenix.exception.Ph...
RegexpSubstrFunctionIT.testGroupByScanWithRegexpSubstr:68 » PhoenixIO org.apac...
Tests run: 405, Failures: 0, Errors: 15, Skipped: 0
[INFO]
[INFO] --- maven-failsafe-plugin:2.17:integration-test (ClientManagedTimeTests) @ phoenix-core ---
[INFO] Failsafe report directory: <https://builds.apache.org/job/Phoenix-3.0-hadoop1/ws/phoenix-core/target/failsafe-reports>
[INFO] parallel='none', perCoreThreadCount=true, threadCount=0, useUnlimitedThreads=false, threadCountSuites=0, threadCountClasses=0, threadCountMethods=0, parallelOptimized=true
-------------------------------------------------------
T E S T S
-------------------------------------------------------
-------------------------------------------------------
T E S T S
-------------------------------------------------------
Running org.apache.phoenix.end2end.OrderByIT
Running org.apache.phoenix.end2end.ToCharFunctionIT
Running org.apache.phoenix.end2end.CustomEntityDataIT
Running org.apache.phoenix.end2end.CaseStatementIT
Tests run: 3, Failures: 0, Errors: 0, Skipped: 0, Time elapsed: 4.477 sec - in org.apache.phoenix.end2end.CustomEntityDataIT
Running org.apache.phoenix.end2end.GroupByIT
Tests run: 10, Failures: 0, Errors: 0, Skipped: 0, Time elapsed: 5.769 sec - in org.apache.phoenix.end2end.ToCharFunctionIT
Running org.apache.phoenix.end2end.QueryDatabaseMetaDataIT
Tests run: 3, Failures: 0, Errors: 0, Skipped: 1, Time elapsed: 6.606 sec - in org.apache.phoenix.end2end.OrderByIT
Running org.apache.phoenix.end2end.VariableLengthPKIT
Tests run: 36, Failures: 0, Errors: 0, Skipped: 0, Time elapsed: 29.174 sec - in org.apache.phoenix.end2end.CaseStatementIT
Running org.apache.phoenix.end2end.DerivedTableIT
Tests run: 50, Failures: 0, Errors: 0, Skipped: 0, Time elapsed: 34.047 sec - in org.apache.phoenix.end2end.VariableLengthPKIT
Running org.apache.phoenix.end2end.ReadIsolationLevelIT
Tests run: 52, Failures: 0, Errors: 0, Skipped: 0, Time elapsed: 38.061 sec - in org.apache.phoenix.end2end.GroupByIT
Running org.apache.phoenix.end2end.GroupByCaseIT
Tests run: 2, Failures: 0, Errors: 0, Skipped: 0, Time elapsed: 3.554 sec - in org.apache.phoenix.end2end.ReadIsolationLevelIT
Running org.apache.phoenix.end2end.DynamicColumnIT
Tests run: 16, Failures: 0, Errors: 0, Skipped: 0, Time elapsed: 15.972 sec - in org.apache.phoenix.end2end.DerivedTableIT
Running org.apache.phoenix.end2end.TopNIT
Tests run: 3, Failures: 0, Errors: 0, Skipped: 0, Time elapsed: 3.669 sec - in org.apache.phoenix.end2end.GroupByCaseIT
Running org.apache.phoenix.end2end.SpooledOrderByIT
Tests run: 5, Failures: 0, Errors: 0, Skipped: 0, Time elapsed: 2.423 sec - in org.apache.phoenix.end2end.DynamicColumnIT
Running org.apache.phoenix.end2end.SequenceIT
Tests run: 3, Failures: 0, Errors: 0, Skipped: 1, Time elapsed: 4.85 sec - in org.apache.phoenix.end2end.SpooledOrderByIT
Tests run: 4, Failures: 0, Errors: 0, Skipped: 0, Time elapsed: 5.561 sec - in org.apache.phoenix.end2end.TopNIT
Running org.apache.phoenix.end2end.DynamicUpsertIT
Tests run: 7, Failures: 0, Errors: 0, Skipped: 0, Time elapsed: 2.597 sec - in org.apache.phoenix.end2end.DynamicUpsertIT
Running org.apache.phoenix.end2end.NativeHBaseTypesIT
Running org.apache.phoenix.end2end.ExtendedQueryExecIT
Tests run: 15, Failures: 0, Errors: 0, Skipped: 0, Time elapsed: 52.552 sec - in org.apache.phoenix.end2end.QueryDatabaseMetaDataIT
Tests run: 7, Failures: 0, Errors: 0, Skipped: 0, Time elapsed: 2.925 sec - in org.apache.phoenix.end2end.NativeHBaseTypesIT
Running org.apache.phoenix.end2end.CastAndCoerceIT
Running org.apache.phoenix.end2end.ToNumberFunctionIT
Tests run: 4, Failures: 0, Errors: 0, Skipped: 0, Time elapsed: 4.523 sec - in org.apache.phoenix.end2end.ExtendedQueryExecIT
Running org.apache.phoenix.end2end.ColumnProjectionOptimizationIT
Tests run: 18, Failures: 0, Errors: 0, Skipped: 0, Time elapsed: 5.851 sec - in org.apache.phoenix.end2end.ToNumberFunctionIT
Running org.apache.phoenix.end2end.ClientTimeArithmeticQueryIT
Tests run: 3, Failures: 0, Errors: 0, Skipped: 0, Time elapsed: 15.817 sec - in org.apache.phoenix.end2end.ColumnProjectionOptimizationIT
Running org.apache.phoenix.end2end.FunkyNamesIT
Tests run: 49, Failures: 0, Errors: 0, Skipped: 0, Time elapsed: 29.937 sec - in org.apache.phoenix.end2end.SequenceIT
Running org.apache.phoenix.end2end.QueryIT
Tests run: 3, Failures: 0, Errors: 0, Skipped: 0, Time elapsed: 3.71 sec - in org.apache.phoenix.end2end.FunkyNamesIT
Running org.apache.phoenix.end2end.UpsertSelectIT
Tests run: 28, Failures: 0, Errors: 0, Skipped: 0, Time elapsed: 27.301 sec - in org.apache.phoenix.end2end.CastAndCoerceIT
Running org.apache.phoenix.end2end.ProductMetricsIT
Tests run: 61, Failures: 0, Errors: 0, Skipped: 0, Time elapsed: 30.929 sec - in org.apache.phoenix.end2end.ProductMetricsIT
Running org.apache.phoenix.end2end.UpsertValuesIT
Tests run: 12, Failures: 0, Errors: 0, Skipped: 0, Time elapsed: 41.412 sec - in org.apache.phoenix.end2end.UpsertSelectIT
Running org.apache.phoenix.end2end.salted.SaltedTableIT
Tests run: 116, Failures: 0, Errors: 0, Skipped: 0, Time elapsed: 61.975 sec - in org.apache.phoenix.end2end.ClientTimeArithmeticQueryIT
Running org.apache.phoenix.end2end.ScanQueryIT
Tests run: 8, Failures: 0, Errors: 0, Skipped: 0, Time elapsed: 6.794 sec - in org.apache.phoenix.end2end.salted.SaltedTableIT
Running org.apache.phoenix.end2end.CreateTableIT
Tests run: 12, Failures: 0, Errors: 0, Skipped: 0, Time elapsed: 26.699 sec - in org.apache.phoenix.end2end.UpsertValuesIT
Running org.apache.phoenix.end2end.CompareDecimalToLongIT
Tests run: 8, Failures: 0, Errors: 0, Skipped: 0, Time elapsed: 4.499 sec - in org.apache.phoenix.end2end.CompareDecimalToLongIT
Running org.apache.phoenix.end2end.ArrayIT
Tests run: 11, Failures: 0, Errors: 0, Skipped: 0, Time elapsed: 31.287 sec - in org.apache.phoenix.end2end.CreateTableIT
Running org.apache.phoenix.end2end.TruncateFunctionIT
Tests run: 1, Failures: 0, Errors: 0, Skipped: 0, Time elapsed: 3.441 sec - in org.apache.phoenix.end2end.TruncateFunctionIT
Running org.apache.phoenix.end2end.RowValueConstructorIT
Tests run: 104, Failures: 0, Errors: 0, Skipped: 0, Time elapsed: 85.828 sec - in org.apache.phoenix.end2end.QueryIT
Running org.apache.phoenix.end2end.StddevIT
Tests run: 4, Failures: 0, Errors: 0, Skipped: 0, Time elapsed: 5.616 sec - in org.apache.phoenix.end2end.StddevIT
Running org.apache.phoenix.end2end.NotQueryIT
Tests run: 68, Failures: 0, Errors: 0, Skipped: 0, Time elapsed: 43.801 sec - in org.apache.phoenix.end2end.ScanQueryIT
Running org.apache.phoenix.end2end.IsNullIT
Tests run: 48, Failures: 0, Errors: 0, Skipped: 0, Time elapsed: 27.766 sec - in org.apache.phoenix.end2end.ArrayIT
Running org.apache.phoenix.end2end.PercentileIT
Tests run: 2, Failures: 0, Errors: 0, Skipped: 0, Time elapsed: 6.624 sec - in org.apache.phoenix.end2end.IsNullIT
Running org.apache.phoenix.end2end.DistinctCountIT
Tests run: 17, Failures: 0, Errors: 0, Skipped: 0, Time elapsed: 12.246 sec - in org.apache.phoenix.end2end.PercentileIT
Running org.apache.phoenix.end2end.InMemoryOrderByIT
Tests run: 10, Failures: 0, Errors: 0, Skipped: 0, Time elapsed: 13.934 sec - in org.apache.phoenix.end2end.DistinctCountIT
Running org.apache.phoenix.end2end.SkipRangeParallelIteratorRegionSplitterIT
Tests run: 8, Failures: 0, Errors: 0, Skipped: 8, Time elapsed: 0.122 sec - in org.apache.phoenix.end2end.SkipRangeParallelIteratorRegionSplitterIT
Tests run: 3, Failures: 0, Errors: 0, Skipped: 1, Time elapsed: 3.878 sec - in org.apache.phoenix.end2end.InMemoryOrderByIT
Tests run: 34, Failures: 0, Errors: 0, Skipped: 0, Time elapsed: 29.318 sec - in org.apache.phoenix.end2end.RowValueConstructorIT
Tests run: 44, Failures: 0, Errors: 0, Skipped: 0, Time elapsed: 31.435 sec - in org.apache.phoenix.end2end.NotQueryIT
Results :
Tests run: 892, Failures: 0, Errors: 0, Skipped: 11
[INFO]
[INFO] --- maven-failsafe-plugin:2.17:integration-test (NeedTheirOwnClusterTests) @ phoenix-core ---
[INFO] Failsafe report directory: <https://builds.apache.org/job/Phoenix-3.0-hadoop1/ws/phoenix-core/target/failsafe-reports>
[INFO] parallel='none', perCoreThreadCount=true, threadCount=0, useUnlimitedThreads=false, threadCountSuites=0, threadCountClasses=0, threadCountMethods=0, parallelOptimized=true
-------------------------------------------------------
T E S T S
-------------------------------------------------------
-------------------------------------------------------
T E S T S
-------------------------------------------------------
Running org.apache.phoenix.hbase.index.covered.example.EndtoEndIndexingWithCompressionIT
Running org.apache.phoenix.hbase.index.covered.example.FailWithoutRetriesIT
Running org.apache.phoenix.hbase.index.covered.EndToEndCoveredColumnsIndexBuilderIT
Running org.apache.phoenix.hbase.index.covered.example.EndToEndCoveredIndexingIT
Tests run: 1, Failures: 0, Errors: 0, Skipped: 0, Time elapsed: 8.795 sec - in org.apache.phoenix.hbase.index.covered.example.FailWithoutRetriesIT
Running org.apache.phoenix.hbase.index.FailForUnsupportedHBaseVersionsIT
Tests run: 2, Failures: 0, Errors: 0, Skipped: 0, Time elapsed: 9.516 sec - in org.apache.phoenix.hbase.index.covered.EndToEndCoveredColumnsIndexBuilderIT
Tests run: 2, Failures: 0, Errors: 0, Skipped: 0, Time elapsed: 17.311 sec - in org.apache.phoenix.hbase.index.FailForUnsupportedHBaseVersionsIT
Running org.apache.phoenix.end2end.KeyOnlyIT
Tests run: 2, Failures: 0, Errors: 0, Skipped: 0, Time elapsed: 8.463 sec - in org.apache.phoenix.end2end.KeyOnlyIT
Running org.apache.phoenix.end2end.ParallelIteratorsIT
Running org.apache.phoenix.end2end.TenantSpecificTablesDDLIT
Tests run: 2, Failures: 0, Errors: 0, Skipped: 0, Time elapsed: 18.432 sec - in org.apache.phoenix.end2end.ParallelIteratorsIT
Running org.apache.phoenix.end2end.index.MutableIndexFailureIT
Tests run: 11, Failures: 0, Errors: 0, Skipped: 0, Time elapsed: 78.703 sec - in org.apache.phoenix.hbase.index.covered.example.EndtoEndIndexingWithCompressionIT
Tests run: 11, Failures: 0, Errors: 0, Skipped: 0, Time elapsed: 78.825 sec - in org.apache.phoenix.hbase.index.covered.example.EndToEndCoveredIndexingIT
Tests run: 18, Failures: 0, Errors: 0, Skipped: 0, Time elapsed: 29.044 sec - in org.apache.phoenix.end2end.TenantSpecificTablesDDLIT
Running org.apache.phoenix.end2end.ViewIT
Running org.apache.phoenix.end2end.ContextClassloaderIT
Running org.apache.phoenix.end2end.StatsCollectorIT
Tests run: 3, Failures: 0, Errors: 0, Skipped: 0, Time elapsed: 7.513 sec - in org.apache.phoenix.end2end.ContextClassloaderIT
Tests run: 2, Failures: 0, Errors: 0, Skipped: 0, Time elapsed: 9.144 sec - in org.apache.phoenix.end2end.StatsCollectorIT
Running org.apache.phoenix.end2end.TenantSpecificTablesDMLIT
Running org.apache.phoenix.end2end.SaltedViewIT
Tests run: 11, Failures: 0, Errors: 0, Skipped: 0, Time elapsed: 33.167 sec - in org.apache.phoenix.end2end.ViewIT
Running org.apache.phoenix.end2end.MultiCfQueryExecIT
Tests run: 1, Failures: 0, Errors: 0, Skipped: 0, Time elapsed: 7.393 sec - in org.apache.phoenix.end2end.SaltedViewIT
Tests run: 14, Failures: 0, Errors: 0, Skipped: 0, Time elapsed: 20.222 sec - in org.apache.phoenix.end2end.TenantSpecificTablesDMLIT
Tests run: 7, Failures: 0, Errors: 0, Skipped: 0, Time elapsed: 15.541 sec - in org.apache.phoenix.end2end.MultiCfQueryExecIT
Running org.apache.phoenix.mapreduce.CsvBulkLoadToolIT
Tests run: 2, Failures: 0, Errors: 0, Skipped: 0, Time elapsed: 136.371 sec - in org.apache.phoenix.end2end.index.MutableIndexFailureIT
Tests run: 4, Failures: 0, Errors: 0, Skipped: 0, Time elapsed: 173.969 sec - in org.apache.phoenix.mapreduce.CsvBulkLoadToolIT
Results :
Tests run: 93, Failures: 0, Errors: 0, Skipped: 0
[INFO]
[INFO] --- maven-failsafe-plugin:2.17:verify (HBaseManagedTimeTests) @ phoenix-core ---
[INFO] Failsafe report directory: <https://builds.apache.org/job/Phoenix-3.0-hadoop1/ws/phoenix-core/target/failsafe-reports>
[INFO] ------------------------------------------------------------------------
[INFO] Reactor Summary:
[INFO]
[INFO] Apache Phoenix .................................... SUCCESS [2.176s]
[INFO] Phoenix Hadoop Compatibility ...................... SUCCESS [0.557s]
[INFO] Phoenix Core ...................................... FAILURE [14:24.161s]
[INFO] Phoenix - Flume ................................... SKIPPED
[INFO] Phoenix - Pig ..................................... SKIPPED
[INFO] Phoenix Hadoop1 Compatibility ..................... SKIPPED
[INFO] Phoenix Assembly .................................. SKIPPED
[INFO] ------------------------------------------------------------------------
[INFO] BUILD FAILURE
[INFO] ------------------------------------------------------------------------
[INFO] Total time: 14:27.412s
[INFO] Finished at: Mon Oct 13 08:35:27 UTC 2014
[INFO] Final Memory: 31M/440M
[INFO] ------------------------------------------------------------------------
[ERROR] Failed to execute goal org.apache.maven.plugins:maven-failsafe-plugin:2.17:verify (HBaseManagedTimeTests) on project phoenix-core: There are test failures.
[ERROR]
[ERROR] Please refer to <https://builds.apache.org/job/Phoenix-3.0-hadoop1/ws/phoenix-core/target/failsafe-reports> for the individual test results.
[ERROR] -> [Help 1]
[ERROR]
[ERROR] To see the full stack trace of the errors, re-run Maven with the -e switch.
[ERROR] Re-run Maven using the -X switch to enable full debug logging.
[ERROR]
[ERROR] For more information about the errors and possible solutions, please read the following articles:
[ERROR] [Help 1] http://cwiki.apache.org/confluence/display/MAVEN/MojoFailureException
[ERROR]
[ERROR] After correcting the problems, you can resume the build with the command
[ERROR] mvn <goals> -rf :phoenix-core
Build step 'Invoke top-level Maven targets' marked build as failure
Archiving artifacts
Sending artifact delta relative to Phoenix | 3.0 | Hadoop1 #249
Archived 578 artifacts
Archive block size is 32768
Received 848 blocks and 200143948 bytes
Compression is 12.2%
Took 1 min 14 sec
Updating PHOENIX-1341
Updating PHOENIX-1333
Updating PHOENIX-1337
Recording test results
Jenkins build is back to normal : Phoenix | 3.0 | Hadoop1 #253
Posted by Apache Jenkins Server <je...@builds.apache.org>.
See <https://builds.apache.org/job/Phoenix-3.0-hadoop1/253/changes>
Build failed in Jenkins: Phoenix | 3.0 | Hadoop1 #252
Posted by Apache Jenkins Server <je...@builds.apache.org>.
See <https://builds.apache.org/job/Phoenix-3.0-hadoop1/252/changes>
Changes:
[ramkrishna] PHOENIX-1309 Ensure Phoenix table is created for Local index and view
------------------------------------------
Started by an SCM change
Building remotely on ubuntu-4 (docker Ubuntu ubuntu4 ubuntu) in workspace <https://builds.apache.org/job/Phoenix-3.0-hadoop1/ws/>
> git rev-parse --is-inside-work-tree
Fetching changes from the remote Git repository
> git config remote.origin.url https://git-wip-us.apache.org/repos/asf/phoenix.git
Fetching upstream changes from https://git-wip-us.apache.org/repos/asf/phoenix.git
> git --version
> git fetch --tags --progress https://git-wip-us.apache.org/repos/asf/phoenix.git +refs/heads/*:refs/remotes/origin/*
> git rev-parse origin/3.0^{commit}
Checking out Revision 28d7f638fca2bccfecc1d16c26efb5a3009eea6a (origin/3.0)
> git config core.sparsecheckout
> git checkout -f 28d7f638fca2bccfecc1d16c26efb5a3009eea6a
> git rev-list d42866918448d18e32fbdf3266dd8add7ec1b428
No emails were triggered.
[Phoenix-3.0-hadoop1] $ /home/jenkins/tools/maven/apache-maven-3.0.4/bin/mvn clean install -DnumForkedIT=4
[INFO] Scanning for projects...
[INFO] ------------------------------------------------------------------------
[INFO] Reactor Build Order:
[INFO]
[INFO] Apache Phoenix
[INFO] Phoenix Hadoop Compatibility
[INFO] Phoenix Core
[INFO] Phoenix - Flume
[INFO] Phoenix - Pig
[INFO] Phoenix Hadoop1 Compatibility
[INFO] Phoenix Assembly
[INFO]
[INFO] ------------------------------------------------------------------------
[INFO] Building Apache Phoenix 3.2.0-SNAPSHOT
[INFO] ------------------------------------------------------------------------
[INFO]
[INFO] --- maven-clean-plugin:2.5:clean (default-clean) @ phoenix ---
[INFO] Deleting <https://builds.apache.org/job/Phoenix-3.0-hadoop1/ws/target>
[INFO]
[INFO] --- maven-remote-resources-plugin:1.5:process (default) @ phoenix ---
[INFO]
[INFO] --- maven-source-plugin:2.2.1:jar-no-fork (attach-sources) @ phoenix ---
[INFO]
[INFO] --- maven-jar-plugin:2.4:test-jar (default) @ phoenix ---
[WARNING] JAR will be empty - no content was marked for inclusion!
[INFO] Building jar: <https://builds.apache.org/job/Phoenix-3.0-hadoop1/252/artifact/target/phoenix-3.2.0-SNAPSHOT-tests.jar>
[INFO]
[INFO] --- maven-site-plugin:3.2:attach-descriptor (attach-descriptor) @ phoenix ---
[INFO]
[INFO] --- maven-install-plugin:2.5.1:install (default-install) @ phoenix ---
[INFO] Installing <https://builds.apache.org/job/Phoenix-3.0-hadoop1/ws/pom.xml> to /home/jenkins/.m2/repository/org/apache/phoenix/phoenix/3.2.0-SNAPSHOT/phoenix-3.2.0-SNAPSHOT.pom
[INFO] Installing <https://builds.apache.org/job/Phoenix-3.0-hadoop1/252/artifact/target/phoenix-3.2.0-SNAPSHOT-tests.jar> to /home/jenkins/.m2/repository/org/apache/phoenix/phoenix/3.2.0-SNAPSHOT/phoenix-3.2.0-SNAPSHOT-tests.jar
[INFO]
[INFO] ------------------------------------------------------------------------
[INFO] Building Phoenix Hadoop Compatibility 3.2.0-SNAPSHOT
[INFO] ------------------------------------------------------------------------
[INFO]
[INFO] --- maven-clean-plugin:2.5:clean (default-clean) @ phoenix-hadoop-compat ---
[INFO] Deleting <https://builds.apache.org/job/Phoenix-3.0-hadoop1/ws/phoenix-hadoop-compat/target>
[INFO]
[INFO] --- maven-remote-resources-plugin:1.5:process (default) @ phoenix-hadoop-compat ---
[INFO]
[INFO] --- maven-resources-plugin:2.6:resources (default-resources) @ phoenix-hadoop-compat ---
[INFO] Using 'UTF-8' encoding to copy filtered resources.
[INFO] skip non existing resourceDirectory <https://builds.apache.org/job/Phoenix-3.0-hadoop1/ws/phoenix-hadoop-compat/src/main/resources>
[INFO] Copying 3 resources
[INFO]
[INFO] --- maven-compiler-plugin:3.0:compile (default-compile) @ phoenix-hadoop-compat ---
[INFO] No sources to compile
[INFO]
[INFO] --- maven-resources-plugin:2.6:testResources (default-testResources) @ phoenix-hadoop-compat ---
[INFO] Using 'UTF-8' encoding to copy filtered resources.
[INFO] skip non existing resourceDirectory <https://builds.apache.org/job/Phoenix-3.0-hadoop1/ws/phoenix-hadoop-compat/src/test/resources>
[INFO] Copying 3 resources
[INFO]
[INFO] --- maven-compiler-plugin:3.0:testCompile (default-testCompile) @ phoenix-hadoop-compat ---
[INFO] No sources to compile
[INFO]
[INFO] --- maven-surefire-plugin:2.17:test (default-test) @ phoenix-hadoop-compat ---
[INFO]
[INFO] --- maven-source-plugin:2.2.1:jar-no-fork (attach-sources) @ phoenix-hadoop-compat ---
[INFO] Building jar: <https://builds.apache.org/job/Phoenix-3.0-hadoop1/252/artifact/phoenix-hadoop-compat/target/phoenix-hadoop-compat-3.2.0-SNAPSHOT-sources.jar>
[INFO]
[INFO] --- maven-jar-plugin:2.4:test-jar (default) @ phoenix-hadoop-compat ---
[INFO] Building jar: <https://builds.apache.org/job/Phoenix-3.0-hadoop1/252/artifact/phoenix-hadoop-compat/target/phoenix-hadoop-compat-3.2.0-SNAPSHOT-tests.jar>
[INFO]
[INFO] --- maven-jar-plugin:2.4:jar (default-jar) @ phoenix-hadoop-compat ---
[INFO] Building jar: <https://builds.apache.org/job/Phoenix-3.0-hadoop1/252/artifact/phoenix-hadoop-compat/target/phoenix-hadoop-compat-3.2.0-SNAPSHOT.jar>
[INFO]
[INFO] --- maven-site-plugin:3.2:attach-descriptor (attach-descriptor) @ phoenix-hadoop-compat ---
[INFO]
[INFO] --- maven-install-plugin:2.5.1:install (default-install) @ phoenix-hadoop-compat ---
[INFO] Installing <https://builds.apache.org/job/Phoenix-3.0-hadoop1/252/artifact/phoenix-hadoop-compat/target/phoenix-hadoop-compat-3.2.0-SNAPSHOT.jar> to /home/jenkins/.m2/repository/org/apache/phoenix/phoenix-hadoop-compat/3.2.0-SNAPSHOT/phoenix-hadoop-compat-3.2.0-SNAPSHOT.jar
[INFO] Installing <https://builds.apache.org/job/Phoenix-3.0-hadoop1/ws/phoenix-hadoop-compat/pom.xml> to /home/jenkins/.m2/repository/org/apache/phoenix/phoenix-hadoop-compat/3.2.0-SNAPSHOT/phoenix-hadoop-compat-3.2.0-SNAPSHOT.pom
[INFO] Installing <https://builds.apache.org/job/Phoenix-3.0-hadoop1/252/artifact/phoenix-hadoop-compat/target/phoenix-hadoop-compat-3.2.0-SNAPSHOT-sources.jar> to /home/jenkins/.m2/repository/org/apache/phoenix/phoenix-hadoop-compat/3.2.0-SNAPSHOT/phoenix-hadoop-compat-3.2.0-SNAPSHOT-sources.jar
[INFO] Installing <https://builds.apache.org/job/Phoenix-3.0-hadoop1/252/artifact/phoenix-hadoop-compat/target/phoenix-hadoop-compat-3.2.0-SNAPSHOT-tests.jar> to /home/jenkins/.m2/repository/org/apache/phoenix/phoenix-hadoop-compat/3.2.0-SNAPSHOT/phoenix-hadoop-compat-3.2.0-SNAPSHOT-tests.jar
[INFO]
[INFO] ------------------------------------------------------------------------
[INFO] Building Phoenix Core 3.2.0-SNAPSHOT
[INFO] ------------------------------------------------------------------------
[INFO]
[INFO] --- maven-clean-plugin:2.5:clean (default-clean) @ phoenix-core ---
[INFO] Deleting <https://builds.apache.org/job/Phoenix-3.0-hadoop1/ws/phoenix-core/target>
[INFO]
[INFO] --- build-helper-maven-plugin:1.7:add-test-source (add-test-source) @ phoenix-core ---
[INFO] Test Source directory: <https://builds.apache.org/job/Phoenix-3.0-hadoop1/ws/phoenix-core/src/it/java> added.
[INFO]
[INFO] --- build-helper-maven-plugin:1.7:add-test-resource (add-test-resource) @ phoenix-core ---
[INFO]
[INFO] --- build-helper-maven-plugin:1.7:add-source (add-source) @ phoenix-core ---
[INFO] Source directory: <https://builds.apache.org/job/Phoenix-3.0-hadoop1/ws/phoenix-core/target/generated-sources/antlr3> added.
[INFO] Source directory: <https://builds.apache.org/job/Phoenix-3.0-hadoop1/ws/phoenix-core/src/main/antlr3> added.
[INFO]
[INFO] --- antlr3-maven-plugin:3.5:antlr (default) @ phoenix-core ---
[INFO] ANTLR: Processing source directory <https://builds.apache.org/job/Phoenix-3.0-hadoop1/ws/phoenix-core/src/main/antlr3>
ANTLR Parser Generator Version 3.5
Output file <https://builds.apache.org/job/Phoenix-3.0-hadoop1/ws/phoenix-core/target/generated-sources/antlr3/org/apache/phoenix/parse/PhoenixSQLParser.java> does not exist: must build <https://builds.apache.org/job/Phoenix-3.0-hadoop1/ws/phoenix-core/src/main/antlr3/PhoenixSQL.g>
PhoenixSQL.g
[INFO]
[INFO] --- maven-remote-resources-plugin:1.5:process (default) @ phoenix-core ---
[INFO]
[INFO] --- maven-resources-plugin:2.6:resources (default-resources) @ phoenix-core ---
[INFO] Using 'UTF-8' encoding to copy filtered resources.
[INFO] Copying 1 resource to META-INF/services
[INFO] Copying 3 resources
[INFO]
[INFO] --- maven-compiler-plugin:3.0:compile (default-compile) @ phoenix-core ---
[INFO] Changes detected - recompiling the module!
[INFO] Compiling 640 source files to <https://builds.apache.org/job/Phoenix-3.0-hadoop1/ws/phoenix-core/target/classes>
[INFO] -------------------------------------------------------------
[WARNING] COMPILATION WARNING :
[INFO] -------------------------------------------------------------
[WARNING] <https://builds.apache.org/job/Phoenix-3.0-hadoop1/ws/phoenix-core/src/main/java/org/apache/phoenix/jdbc/PhoenixResultSet.java>: Some input files use or override a deprecated API.
[WARNING] <https://builds.apache.org/job/Phoenix-3.0-hadoop1/ws/phoenix-core/src/main/java/org/apache/phoenix/jdbc/PhoenixResultSet.java>: Recompile with -Xlint:deprecation for details.
[WARNING] <https://builds.apache.org/job/Phoenix-3.0-hadoop1/ws/phoenix-core/src/main/java/org/apache/phoenix/jdbc/PhoenixStatement.java>: <https://builds.apache.org/job/Phoenix-3.0-hadoop1/ws/phoenix-core/src/main/java/org/apache/phoenix/jdbc/PhoenixStatement.java> uses unchecked or unsafe operations.
[WARNING] <https://builds.apache.org/job/Phoenix-3.0-hadoop1/ws/phoenix-core/src/main/java/org/apache/phoenix/jdbc/PhoenixStatement.java>: Recompile with -Xlint:unchecked for details.
[INFO] 4 warnings
[INFO] -------------------------------------------------------------
[INFO] -------------------------------------------------------------
[ERROR] COMPILATION ERROR :
[INFO] -------------------------------------------------------------
[ERROR] <https://builds.apache.org/job/Phoenix-3.0-hadoop1/ws/phoenix-core/src/main/java/org/apache/phoenix/schema/MetaDataClient.java>:[506,48] cannot find symbol
symbol: class DelegateTable
location: class org.apache.phoenix.schema.MetaDataClient
[INFO] 1 error
[INFO] -------------------------------------------------------------
[INFO] ------------------------------------------------------------------------
[INFO] Reactor Summary:
[INFO]
[INFO] Apache Phoenix .................................... SUCCESS [2.242s]
[INFO] Phoenix Hadoop Compatibility ...................... SUCCESS [0.721s]
[INFO] Phoenix Core ...................................... FAILURE [17.968s]
[INFO] Phoenix - Flume ................................... SKIPPED
[INFO] Phoenix - Pig ..................................... SKIPPED
[INFO] Phoenix Hadoop1 Compatibility ..................... SKIPPED
[INFO] Phoenix Assembly .................................. SKIPPED
[INFO] ------------------------------------------------------------------------
[INFO] BUILD FAILURE
[INFO] ------------------------------------------------------------------------
[INFO] Total time: 21.411s
[INFO] Finished at: Mon Oct 13 09:00:12 UTC 2014
[INFO] Final Memory: 30M/503M
[INFO] ------------------------------------------------------------------------
[ERROR] Failed to execute goal org.apache.maven.plugins:maven-compiler-plugin:3.0:compile (default-compile) on project phoenix-core: Compilation failure
[ERROR] <https://builds.apache.org/job/Phoenix-3.0-hadoop1/ws/phoenix-core/src/main/java/org/apache/phoenix/schema/MetaDataClient.java>:[506,48] cannot find symbol
[ERROR] symbol: class DelegateTable
[ERROR] location: class org.apache.phoenix.schema.MetaDataClient
[ERROR] -> [Help 1]
[ERROR]
[ERROR] To see the full stack trace of the errors, re-run Maven with the -e switch.
[ERROR] Re-run Maven using the -X switch to enable full debug logging.
[ERROR]
[ERROR] For more information about the errors and possible solutions, please read the following articles:
[ERROR] [Help 1] http://cwiki.apache.org/confluence/display/MAVEN/MojoFailureException
[ERROR]
[ERROR] After correcting the problems, you can resume the build with the command
[ERROR] mvn <goals> -rf :phoenix-core
Build step 'Invoke top-level Maven targets' marked build as failure
Archiving artifacts
Sending artifact delta relative to Phoenix | 3.0 | Hadoop1 #249
Archived 58 artifacts
Archive block size is 32768
Received 829 blocks and 11849633 bytes
Compression is 69.6%
Took 26 sec
Updating PHOENIX-1309
Recording test results