You are viewing a plain text version of this content. The canonical link for it is here.
Posted to dev@sling.apache.org by Apache Jenkins Server <je...@builds.apache.org> on 2014/12/12 12:15:22 UTC
Build failed in Jenkins: sling-trunk-1.6 #2859
See <https://builds.apache.org/job/sling-trunk-1.6/2859/changes>
Changes:
[jsedding] SLING-4237 - JCR Mock implementation should have "throws RepositoryException"
- add exceptions also to MockQuery* classes
[sseifert] remove unused import
[jsedding] SLING-4215 - Resource Editor :: Removal of duplicated file content
- patch by Sandro Boehme, thanks!
[jsedding] SLING-4238 - Jcr Mock does not normalize paths
[bdelacretaz] [maven-release-plugin] prepare for next development iteration
[bdelacretaz] [maven-release-plugin] prepare release org.apache.sling.junit.scriptable-1.0.10
[bdelacretaz] back to snapshot until core is released
[bdelacretaz] [maven-release-plugin] prepare for next development iteration
[bdelacretaz] [maven-release-plugin] prepare release org.apache.sling.junit.remote-1.0.10
[bdelacretaz] Preparing release of junit core, remote and scriptable modules
[bdelacretaz] [maven-release-plugin] prepare for next development iteration
[bdelacretaz] [maven-release-plugin] prepare release org.apache.sling.junit.core-1.0.10
[tommaso] SLING-4153 - renamed QueueItemState to QueueItemStatus
[jsedding] SLING-4237 - remove unused imports introduced in previous commit
------------------------------------------
[...truncated 59131 lines...]
[INFO] Apache Sling OSGi LogService Implementation ....... SUCCESS [2.803s]
[INFO] Apache Sling MIME type mapping support ............ SUCCESS [3.563s]
[INFO] Apache Sling Commons OSGi support ................. SUCCESS [3.079s]
[INFO] Apache Sling Scheduler Support .................... SUCCESS [2.859s]
[INFO] Apache Sling Testing Utilities .................... SUCCESS [35.022s]
[INFO] Apache Sling Thread Dumper ........................ SUCCESS [2.414s]
[INFO] Apache Sling Thread Support ....................... SUCCESS [2.843s]
[INFO] Apache Sling Authentication Service ............... SUCCESS [3.914s]
[INFO] Apache Sling Form Based Authentication Handler .... SUCCESS [6.716s]
[INFO] Apache Sling Engine Implementation ................ SUCCESS [16.549s]
[INFO] Apache Sling Repository API Bundle ................ SUCCESS [2.929s]
[INFO] Apache Sling JCR Base Bundle ...................... SUCCESS [4.136s]
[INFO] Apache Sling JCR ClassLoader ...................... SUCCESS [3.127s]
[INFO] Apache Sling Initial Content Loader ............... SUCCESS [4.216s]
[INFO] Apache Sling Jackrabbit Embedded Repository ....... SUCCESS [12.775s]
[INFO] Apache Sling Jackrabbit UserManager Support ....... SUCCESS [3.327s]
[INFO] Apache Sling Jackrabbit JSR-283 Access Control Manager Support SUCCESS [4.552s]
[INFO] Apache Sling Wrapper Bundle for the JCR API ....... SUCCESS [2.279s]
[INFO] Apache Sling JCR Resource Resolver ................ SUCCESS [1:43.687s]
[INFO] Apache Sling JCR Repository Registration .......... SUCCESS [3.929s]
[INFO] Apache Sling Simple WebDAV Access to repositories . SUCCESS [3.488s]
[INFO] Apache Sling DavEx Access to repositories ......... SUCCESS [3.659s]
[INFO] Apache Sling JCR WebConsole Bundle ................ SUCCESS [2.399s]
[INFO] Apache Sling Oak Repository Server ................ SUCCESS [3.516s]
[INFO] Apache Sling SlingRepository Integration Tests .... SUCCESS [1:09.501s]
[INFO] Apache Sling Servlet Resolver ..................... SUCCESS [4.291s]
[INFO] Apache Sling Default GET Servlets ................. SUCCESS [4.054s]
[INFO] Apache Sling Default POST Servlets ................ SUCCESS [4.487s]
[INFO] Apache Sling Compat Servlets ...................... SUCCESS [2.659s]
[INFO] Apache Sling Scripting Implementation API ......... SUCCESS [2.868s]
[INFO] Apache Sling Scripting Core implementation ........ SUCCESS [12.386s]
[INFO] Apache Sling Scripting JavaScript Support ......... SUCCESS [22.084s]
[INFO] Apache Sling Scripting JSP Support ................ SUCCESS [8.383s]
[INFO] Apache Sling JSP Tag Library ...................... SUCCESS [5.284s]
[INFO] Apache Sling JSP Standard Tag Library ............. SUCCESS [2.470s]
[INFO] Apache Sling Adapter Manager Implementation ....... SUCCESS [2.992s]
[INFO] Apache Sling Bundle Resource Provider ............. SUCCESS [2.305s]
[INFO] Apache Sling Distributed Event Admin .............. SUCCESS [5.450s]
[INFO] Apache Sling Discovery API ........................ SUCCESS [2.215s]
[INFO] Apache Sling Resource-Based Discovery Service ..... SUCCESS [1:20:16.410s]
[INFO] Apache Sling Discovery Support Bundle ............. SUCCESS [3.228s]
[INFO] Apache Sling Discovery Standalone Implementation .. SUCCESS [3.233s]
[INFO] Apache Sling Event Support ........................ SUCCESS [25:12.195s]
[INFO] Apache Sling Feature Flags ........................ SUCCESS [3.347s]
[INFO] Apache Sling Filesystem Resource Provider ......... SUCCESS [3.660s]
[INFO] Apache Sling javax.activation bundle .............. SUCCESS [3.360s]
[INFO] Apache Sling Service User Mapper .................. SUCCESS [4.803s]
[INFO] Apache Sling Settings ............................. SUCCESS [6.263s]
[INFO] Apache Sling Web Console Branding ................. SUCCESS [3.044s]
[INFO] Apache Sling Web Console Security Provider ........ SUCCESS [4.470s]
[INFO] Apache Sling Explorer ............................. SUCCESS [3.820s]
[INFO] Apache Sling Health Check Core .................... SUCCESS [10.479s]
[INFO] Apache Sling Health Check Annotations ............. SUCCESS [2.856s]
[INFO] Apache Sling Health Check Samples ................. SUCCESS [6.110s]
[INFO] Apache Sling Health Check Support Components ...... SUCCESS [5.092s]
[INFO] Apache Sling Health Check Webconsole Plugin ....... SUCCESS [3.266s]
[INFO] Apache Sling Health Check JUnit Bridge ............ SUCCESS [5.769s]
[INFO] Apache Sling Health Check Integration Tests ....... SUCCESS [22.724s]
[INFO] Apache Sling Health Check Reactor POM ............. SUCCESS [1.283s]
[INFO] Apache Sling Resource Access Security ............. SUCCESS [4.071s]
[INFO] Apache Sling Resource Access Security Integration Tests SUCCESS [1:25.408s]
[INFO] Apache Sling Models API ........................... SUCCESS [4.265s]
[INFO] Apache Sling Models Implementation ................ SUCCESS [7.501s]
[INFO] Apache Sling Test Tools ........................... SUCCESS [4.775s]
[INFO] Apache Sling Models Integration Tests ............. SUCCESS [1:07.754s]
[INFO] Apache Sling JUnit Core ........................... SUCCESS [6.624s]
[INFO] Apache Sling JUnit Scriptable Tests Provider ...... SUCCESS [4.596s]
[INFO] Apache Sling JUnit Health Checks .................. SUCCESS [5.872s]
[INFO] Apache Sling JUnit Remote Tests Runners ........... SUCCESS [3.729s]
[INFO] Apache Sling JUnit Performance .................... SUCCESS [6.330s]
[INFO] Apache Sling Testing Resource Resolver Mock ....... SUCCESS [4.011s]
[INFO] Apache Sling Testing JCR Mock ..................... SUCCESS [6.611s]
[INFO] Apache Sling Testing OSGi Mock .................... SUCCESS [6.244s]
[INFO] Apache Sling Testing Sling Mock ................... SUCCESS [10.367s]
[INFO] Apache Sling Testing Sling Mock Jackrabbit-based Resource Resolver SUCCESS [1:02.283s]
[INFO] Apache Sling Pax Exam Utilities ................... SUCCESS [1:23.454s]
[INFO] Apache Sling Sample Server-Side Tests ............. SUCCESS [3.797s]
[INFO] Apache Sling Failing Server-Side Tests ............ SUCCESS [3.674s]
[INFO] Apache Sling Launchpad Application Builder ........ SUCCESS [1:06.967s]
[INFO] Apache Sling Sample Integration Tests ............. SUCCESS [1:08.857s]
[INFO] Apache Sling Testing Modules Reactor .............. SUCCESS [3.154s]
[INFO] Apache Sling Installer ............................ SUCCESS [7.570s]
[INFO] Apache Sling Installer WebConsole Plugin .......... SUCCESS [4.144s]
[INFO] Apache Sling File Installer ....................... SUCCESS [3.222s]
[INFO] Apache Sling JCR Installer ........................ SUCCESS [2:41.049s]
[INFO] Apache Sling Installer Configuration Admin Support SUCCESS [4.125s]
[INFO] Apache Sling Deployment Package Installer ......... SUCCESS [3.854s]
[INFO] Apache Sling Subsystems Installer ................. SUCCESS [2.805s]
[INFO] Apache Sling Installer Integration Tests .......... SUCCESS [44.753s]
[INFO] Apache Sling Launchpad API ........................ SUCCESS [2.863s]
[INFO] Apache Sling Launchpad Base ....................... SUCCESS [15.373s]
[INFO] Apache Sling Launchpad Installer .................. SUCCESS [9.862s]
[INFO] Apache Sling Launchpad Content .................... SUCCESS [2.667s]
[INFO] Apache Sling Launchpad Testing Services ........... SUCCESS [9.108s]
[INFO] Apache Sling Launchpad Testing Services WAR ....... SUCCESS [3.218s]
[INFO] Apache Sling Launchpad Testing Fragment Bundle .... SUCCESS [3.304s]
[INFO] Apache Sling Launchpad Test Bundles ............... SUCCESS [3.866s]
[INFO] Apache Sling Integration Tests .................... FAILURE [0.634s]
[INFO] Apache Sling Launchpad Testing .................... SKIPPED
[INFO] Apache Sling (Builder) ............................ SKIPPED
[INFO] ------------------------------------------------------------------------
[INFO] BUILD FAILURE
[INFO] ------------------------------------------------------------------------
[INFO] Total time: 2:10:38.949s
[INFO] Finished at: Fri Dec 12 11:15:08 UTC 2014
[INFO] Final Memory: 170M/363M
[INFO] ------------------------------------------------------------------------
[JENKINS] Archiving disabled
[JENKINS] Archiving disabled
[JENKINS] Archiving disabled
[JENKINS] Archiving disabled
[JENKINS] Archiving disabled
[JENKINS] Archiving disabled
[JENKINS] Archiving disabled
[JENKINS] Archiving disabled
[JENKINS] Archiving disabled
[JENKINS] Archiving disabled
[JENKINS] Archiving disabled
[JENKINS] Archiving disabled
[JENKINS] Archiving disabled
[JENKINS] Archiving disabled
[JENKINS] Archiving disabled
[JENKINS] Archiving disabled
[JENKINS] Archiving disabled
[JENKINS] Archiving disabled
[JENKINS] Archiving disabled
[JENKINS] Archiving disabled
[JENKINS] Archiving disabled
[JENKINS] Archiving disabled
[JENKINS] Archiving disabled
[JENKINS] Archiving disabled
[JENKINS] Archiving disabled
[JENKINS] Archiving disabled
[JENKINS] Archiving disabled
[JENKINS] Archiving disabled
[JENKINS] Archiving disabled
[JENKINS] Archiving disabled
[JENKINS] Archiving disabled
[JENKINS] Archiving disabled
[JENKINS] Archiving disabled
[JENKINS] Archiving disabled
[JENKINS] Archiving disabled
[JENKINS] Archiving disabled
[JENKINS] Archiving disabled
[JENKINS] Archiving disabled
[JENKINS] Archiving disabled
[JENKINS] Archiving disabled
[JENKINS] Archiving disabled
[JENKINS] Archiving disabled
[JENKINS] Archiving disabled
[JENKINS] Archiving disabled
[JENKINS] Archiving disabled
[JENKINS] Archiving disabled
[JENKINS] Archiving disabled
[JENKINS] Archiving disabled
[JENKINS] Archiving disabled
[JENKINS] Archiving disabled
[JENKINS] Archiving disabled
[JENKINS] Archiving disabled
[JENKINS] Archiving disabled
[JENKINS] Archiving disabled
[JENKINS] Archiving disabled
[JENKINS] Archiving disabled
[JENKINS] Archiving disabled
[JENKINS] Archiving disabled
[JENKINS] Archiving disabled
[JENKINS] Archiving disabled
[JENKINS] Archiving disabled
[JENKINS] Archiving disabled
[JENKINS] Archiving disabled
[JENKINS] Archiving disabled
[JENKINS] Archiving disabled
[JENKINS] Archiving disabled
[JENKINS] Archiving disabled
[JENKINS] Archiving disabled
[JENKINS] Archiving disabled
[JENKINS] Archiving disabled
[JENKINS] Archiving disabled
[JENKINS] Archiving disabled
[JENKINS] Archiving disabled
[JENKINS] Archiving disabled
[JENKINS] Archiving disabled
[JENKINS] Archiving disabled
[JENKINS] Archiving disabled
[JENKINS] Archiving disabled
[JENKINS] Archiving disabled
[JENKINS] Archiving disabled
[JENKINS] Archiving disabled
[JENKINS] Archiving disabled
[JENKINS] Archiving disabled
[JENKINS] Archiving disabled
[JENKINS] Archiving disabled
[JENKINS] Archiving disabled
[JENKINS] Archiving disabled
[JENKINS] Archiving disabled
[JENKINS] Archiving disabled
[JENKINS] Archiving disabled
[JENKINS] Archiving disabled
[JENKINS] Archiving disabled
[JENKINS] Archiving disabled
[JENKINS] Archiving disabled
[JENKINS] Archiving disabled
[JENKINS] Archiving disabled
[JENKINS] Archiving disabled
[JENKINS] Archiving disabled
[JENKINS] Archiving disabled
[JENKINS] Archiving disabled
[JENKINS] Archiving disabled
[JENKINS] Archiving disabled
[JENKINS] Archiving disabled
[JENKINS] Archiving disabled
[JENKINS] Archiving disabled
[JENKINS] Archiving disabled
[JENKINS] Archiving disabled
[JENKINS] Archiving disabled
[JENKINS] Archiving disabled
[JENKINS] Archiving disabled
[JENKINS] Archiving disabled
[JENKINS] Archiving disabled
[JENKINS] Archiving disabled
[JENKINS] Archiving disabled
[JENKINS] Archiving disabled
[JENKINS] Archiving disabled
[JENKINS] Archiving disabled
[JENKINS] Archiving disabled
[JENKINS] Archiving disabled
[JENKINS] Archiving disabled
[JENKINS] Archiving disabled
[JENKINS] Archiving disabled
[JENKINS] Archiving disabled
[JENKINS] Archiving disabled
[JENKINS] Archiving disabled
[JENKINS] Archiving disabled
Waiting for Jenkins to finish collecting data
[ERROR] Failed to execute goal on project org.apache.sling.launchpad.integration-tests: Could not resolve dependencies for project org.apache.sling:org.apache.sling.launchpad.integration-tests:jar:1.0.1-SNAPSHOT: Could not find artifact org.apache.sling:org.apache.sling.junit.core:jar:1.0.10 in central (http://repo.maven.apache.org/maven2) -> [Help 1]
[ERROR]
[ERROR] To see the full stack trace of the errors, re-run Maven with the -e switch.
[ERROR] Re-run Maven using the -X switch to enable full debug logging.
[ERROR]
[ERROR] For more information about the errors and possible solutions, please read the following articles:
[ERROR] [Help 1] http://cwiki.apache.org/confluence/display/MAVEN/DependencyResolutionException
[ERROR]
[ERROR] After correcting the problems, you can resume the build with the command
[ERROR] mvn <goals> -rf :org.apache.sling.launchpad.integration-tests
Sending e-mails to: dev@sling.apache.org
Sending e-mails to: dev@sling.apache.org
Sending e-mails to: dev@sling.apache.org
Sending e-mails to: dev@sling.apache.org
channel stopped
Jenkins build is back to stable : sling-trunk-1.6 #2873
Posted by Apache Jenkins Server <je...@builds.apache.org>.
See <https://builds.apache.org/job/sling-trunk-1.6/2873/changes>
Jenkins build is still unstable: sling-trunk-1.6 #2872
Posted by Apache Jenkins Server <je...@builds.apache.org>.
See <https://builds.apache.org/job/sling-trunk-1.6/changes>
Jenkins build is still unstable: sling-trunk-1.6 #2871
Posted by Apache Jenkins Server <je...@builds.apache.org>.
See <https://builds.apache.org/job/sling-trunk-1.6/changes>
Jenkins build is still unstable: sling-trunk-1.6 #2870
Posted by Apache Jenkins Server <je...@builds.apache.org>.
See <https://builds.apache.org/job/sling-trunk-1.6/changes>
Jenkins build is still unstable: sling-trunk-1.6 #2869
Posted by Apache Jenkins Server <je...@builds.apache.org>.
See <https://builds.apache.org/job/sling-trunk-1.6/changes>
Jenkins build is still unstable: sling-trunk-1.6 #2868
Posted by Apache Jenkins Server <je...@builds.apache.org>.
See <https://builds.apache.org/job/sling-trunk-1.6/changes>
Jenkins build is still unstable: sling-trunk-1.6 #2867
Posted by Apache Jenkins Server <je...@builds.apache.org>.
See <https://builds.apache.org/job/sling-trunk-1.6/changes>
Jenkins build is still unstable: sling-trunk-1.6 #2866
Posted by Apache Jenkins Server <je...@builds.apache.org>.
See <https://builds.apache.org/job/sling-trunk-1.6/changes>
Jenkins build is still unstable: sling-trunk-1.6 #2865
Posted by Apache Jenkins Server <je...@builds.apache.org>.
See <https://builds.apache.org/job/sling-trunk-1.6/changes>
Jenkins build is still unstable: sling-trunk-1.6 #2864
Posted by Apache Jenkins Server <je...@builds.apache.org>.
See <https://builds.apache.org/job/sling-trunk-1.6/changes>
Jenkins build is still unstable: sling-trunk-1.6 #2863
Posted by Apache Jenkins Server <je...@builds.apache.org>.
See <https://builds.apache.org/job/sling-trunk-1.6/changes>
Jenkins build is unstable: sling-trunk-1.6 #2862
Posted by Apache Jenkins Server <je...@builds.apache.org>.
See <https://builds.apache.org/job/sling-trunk-1.6/2862/changes>
Build failed in Jenkins: sling-trunk-1.6 #2861
Posted by Apache Jenkins Server <je...@builds.apache.org>.
See <https://builds.apache.org/job/sling-trunk-1.6/2861/changes>
Changes:
[mpetria] SLING-4153: moving all extensions API from api package to core
[mpetria] SLING-4153: changing distribution response to a provider interface
------------------------------------------
[...truncated 61690 lines...]
[INFO] Apache Sling JSON Library ......................... SUCCESS [6.806s]
[INFO] Apache Sling SLF4J Implementation (Logback) ....... SUCCESS [33.036s]
[INFO] Apache Sling OSGi LogService Implementation ....... SUCCESS [5.054s]
[INFO] Apache Sling MIME type mapping support ............ SUCCESS [6.878s]
[INFO] Apache Sling Commons OSGi support ................. SUCCESS [6.385s]
[INFO] Apache Sling Scheduler Support .................... SUCCESS [5.849s]
[INFO] Apache Sling Testing Utilities .................... SUCCESS [15.792s]
[INFO] Apache Sling Thread Dumper ........................ SUCCESS [5.105s]
[INFO] Apache Sling Thread Support ....................... SUCCESS [13.936s]
[INFO] Apache Sling Authentication Service ............... SUCCESS [6.987s]
[INFO] Apache Sling Form Based Authentication Handler .... SUCCESS [8.247s]
[INFO] Apache Sling Engine Implementation ................ SUCCESS [16.063s]
[INFO] Apache Sling Repository API Bundle ................ SUCCESS [4.766s]
[INFO] Apache Sling JCR Base Bundle ...................... SUCCESS [5.936s]
[INFO] Apache Sling JCR ClassLoader ...................... SUCCESS [5.551s]
[INFO] Apache Sling Initial Content Loader ............... SUCCESS [6.625s]
[INFO] Apache Sling Jackrabbit Embedded Repository ....... SUCCESS [17.446s]
[INFO] Apache Sling Jackrabbit UserManager Support ....... SUCCESS [5.820s]
[INFO] Apache Sling Jackrabbit JSR-283 Access Control Manager Support SUCCESS [5.409s]
[INFO] Apache Sling Wrapper Bundle for the JCR API ....... SUCCESS [4.837s]
[INFO] Apache Sling JCR Resource Resolver ................ SUCCESS [30.898s]
[INFO] Apache Sling JCR Repository Registration .......... SUCCESS [6.904s]
[INFO] Apache Sling Simple WebDAV Access to repositories . SUCCESS [6.177s]
[INFO] Apache Sling DavEx Access to repositories ......... SUCCESS [6.567s]
[INFO] Apache Sling JCR WebConsole Bundle ................ SUCCESS [10.346s]
[INFO] Apache Sling Oak Repository Server ................ SUCCESS [6.635s]
[INFO] Apache Sling SlingRepository Integration Tests .... SUCCESS [52.324s]
[INFO] Apache Sling Servlet Resolver ..................... SUCCESS [7.149s]
[INFO] Apache Sling Default GET Servlets ................. SUCCESS [6.992s]
[INFO] Apache Sling Default POST Servlets ................ SUCCESS [7.489s]
[INFO] Apache Sling Compat Servlets ...................... SUCCESS [5.114s]
[INFO] Apache Sling Scripting Implementation API ......... SUCCESS [5.352s]
[INFO] Apache Sling Scripting Core implementation ........ SUCCESS [19.093s]
[INFO] Apache Sling Scripting JavaScript Support ......... SUCCESS [13.402s]
[INFO] Apache Sling Scripting JSP Support ................ SUCCESS [11.163s]
[INFO] Apache Sling JSP Tag Library ...................... SUCCESS [7.986s]
[INFO] Apache Sling JSP Standard Tag Library ............. SUCCESS [5.354s]
[INFO] Apache Sling Adapter Manager Implementation ....... SUCCESS [11.696s]
[INFO] Apache Sling Bundle Resource Provider ............. SUCCESS [4.858s]
[INFO] Apache Sling Distributed Event Admin .............. SUCCESS [7.964s]
[INFO] Apache Sling Discovery API ........................ SUCCESS [5.058s]
[INFO] Apache Sling Resource-Based Discovery Service ..... SUCCESS [2:36.460s]
[INFO] Apache Sling Discovery Support Bundle ............. SUCCESS [5.113s]
[INFO] Apache Sling Discovery Standalone Implementation .. SUCCESS [5.211s]
[INFO] Apache Sling Event Support ........................ SUCCESS [11:36.032s]
[INFO] Apache Sling Feature Flags ........................ SUCCESS [5.713s]
[INFO] Apache Sling Filesystem Resource Provider ......... SUCCESS [5.302s]
[INFO] Apache Sling javax.activation bundle .............. SUCCESS [5.208s]
[INFO] Apache Sling Service User Mapper .................. SUCCESS [6.085s]
[INFO] Apache Sling Settings ............................. SUCCESS [5.991s]
[INFO] Apache Sling Web Console Branding ................. SUCCESS [4.836s]
[INFO] Apache Sling Web Console Security Provider ........ SUCCESS [5.228s]
[INFO] Apache Sling Explorer ............................. SUCCESS [5.098s]
[INFO] Apache Sling Health Check Core .................... SUCCESS [10.230s]
[INFO] Apache Sling Health Check Annotations ............. SUCCESS [4.822s]
[INFO] Apache Sling Health Check Samples ................. SUCCESS [6.345s]
[INFO] Apache Sling Health Check Support Components ...... SUCCESS [6.137s]
[INFO] Apache Sling Health Check Webconsole Plugin ....... SUCCESS [5.126s]
[INFO] Apache Sling Health Check JUnit Bridge ............ SUCCESS [6.493s]
[INFO] Apache Sling Health Check Integration Tests ....... SUCCESS [19.762s]
[INFO] Apache Sling Health Check Reactor POM ............. SUCCESS [2.535s]
[INFO] Apache Sling Resource Access Security ............. SUCCESS [5.923s]
[INFO] Apache Sling Resource Access Security Integration Tests SUCCESS [26.194s]
[INFO] Apache Sling Models API ........................... SUCCESS [15.215s]
[INFO] Apache Sling Models Implementation ................ SUCCESS [10.038s]
[INFO] Apache Sling Test Tools ........................... SUCCESS [6.447s]
[INFO] Apache Sling Models Integration Tests ............. SUCCESS [33.712s]
[INFO] Apache Sling JUnit Core ........................... SUCCESS [6.326s]
[INFO] Apache Sling JUnit Scriptable Tests Provider ...... SUCCESS [5.673s]
[INFO] Apache Sling JUnit Health Checks .................. SUCCESS [5.654s]
[INFO] Apache Sling JUnit Remote Tests Runners ........... SUCCESS [5.183s]
[INFO] Apache Sling JUnit Performance .................... SUCCESS [5.667s]
[INFO] Apache Sling Testing Resource Resolver Mock ....... SUCCESS [5.330s]
[INFO] Apache Sling Testing JCR Mock ..................... SUCCESS [6.812s]
[INFO] Apache Sling Testing OSGi Mock .................... SUCCESS [7.264s]
[INFO] Apache Sling Testing Sling Mock ................... SUCCESS [12.981s]
[INFO] Apache Sling Testing Sling Mock Jackrabbit-based Resource Resolver SUCCESS [16.660s]
[INFO] Apache Sling Pax Exam Utilities ................... SUCCESS [34.023s]
[INFO] Apache Sling Sample Server-Side Tests ............. SUCCESS [6.050s]
[INFO] Apache Sling Failing Server-Side Tests ............ SUCCESS [4.890s]
[INFO] Apache Sling Launchpad Application Builder ........ SUCCESS [1:11.141s]
[INFO] Apache Sling Sample Integration Tests ............. SUCCESS [1:09.374s]
[INFO] Apache Sling Testing Modules Reactor .............. SUCCESS [2.795s]
[INFO] Apache Sling Installer ............................ SUCCESS [12.368s]
[INFO] Apache Sling Installer WebConsole Plugin .......... SUCCESS [5.089s]
[INFO] Apache Sling File Installer ....................... SUCCESS [4.981s]
[INFO] Apache Sling JCR Installer ........................ SUCCESS [1:59.446s]
[INFO] Apache Sling Installer Configuration Admin Support SUCCESS [5.030s]
[INFO] Apache Sling Deployment Package Installer ......... SUCCESS [5.093s]
[INFO] Apache Sling Subsystems Installer ................. SUCCESS [5.020s]
[INFO] Apache Sling Installer Integration Tests .......... SUCCESS [42.111s]
[INFO] Apache Sling Launchpad API ........................ SUCCESS [10.220s]
[INFO] Apache Sling Launchpad Base ....................... SUCCESS [16.208s]
[INFO] Apache Sling Launchpad Installer .................. SUCCESS [3:00.562s]
[INFO] Apache Sling Launchpad Content .................... SUCCESS [5.008s]
[INFO] Apache Sling Launchpad Testing Services ........... SUCCESS [7.885s]
[INFO] Apache Sling Launchpad Testing Services WAR ....... SUCCESS [5.393s]
[INFO] Apache Sling Launchpad Testing Fragment Bundle .... SUCCESS [5.096s]
[INFO] Apache Sling Launchpad Test Bundles ............... SUCCESS [6.226s]
[INFO] Apache Sling Integration Tests .................... FAILURE [8.643s]
[INFO] Apache Sling Launchpad Testing .................... SKIPPED
[INFO] Apache Sling (Builder) ............................ SKIPPED
[INFO] ------------------------------------------------------------------------
[INFO] BUILD FAILURE
[INFO] ------------------------------------------------------------------------
[INFO] Total time: 41:41.408s
[INFO] Finished at: Mon Dec 15 13:44:09 UTC 2014
[INFO] Final Memory: 167M/329M
[INFO] ------------------------------------------------------------------------
[JENKINS] Archiving disabled
[JENKINS] Archiving disabled
[JENKINS] Archiving disabled
[JENKINS] Archiving disabled
[JENKINS] Archiving disabled
[JENKINS] Archiving disabled
[JENKINS] Archiving disabled
[JENKINS] Archiving disabled
[JENKINS] Archiving disabled
[JENKINS] Archiving disabled
[JENKINS] Archiving disabled
[JENKINS] Archiving disabled
[JENKINS] Archiving disabled
[JENKINS] Archiving disabled
[JENKINS] Archiving disabled
[JENKINS] Archiving disabled
[JENKINS] Archiving disabled
[JENKINS] Archiving disabled
[JENKINS] Archiving disabled
[JENKINS] Archiving disabled
[JENKINS] Archiving disabled
[JENKINS] Archiving disabled
[JENKINS] Archiving disabled
[JENKINS] Archiving disabled
[JENKINS] Archiving disabled
[JENKINS] Archiving disabled
[JENKINS] Archiving disabled
[JENKINS] Archiving disabled
[JENKINS] Archiving disabled
[JENKINS] Archiving disabled
[JENKINS] Archiving disabled
[JENKINS] Archiving disabled
[JENKINS] Archiving disabled
[JENKINS] Archiving disabled
[JENKINS] Archiving disabled
[JENKINS] Archiving disabled
[JENKINS] Archiving disabled
[JENKINS] Archiving disabled
[JENKINS] Archiving disabled
[JENKINS] Archiving disabled
[JENKINS] Archiving disabled
[JENKINS] Archiving disabled
[JENKINS] Archiving disabled
[JENKINS] Archiving disabled
[JENKINS] Archiving disabled
[JENKINS] Archiving disabled
[JENKINS] Archiving disabled
[JENKINS] Archiving disabled
[JENKINS] Archiving disabled
[JENKINS] Archiving disabled
[JENKINS] Archiving disabled
[JENKINS] Archiving disabled
[JENKINS] Archiving disabled
[JENKINS] Archiving disabled
[JENKINS] Archiving disabled
[JENKINS] Archiving disabled
[JENKINS] Archiving disabled
[JENKINS] Archiving disabled
[JENKINS] Archiving disabled
[JENKINS] Archiving disabled
[JENKINS] Archiving disabled
[JENKINS] Archiving disabled
[JENKINS] Archiving disabled
[JENKINS] Archiving disabled
[JENKINS] Archiving disabled
[JENKINS] Archiving disabled
[JENKINS] Archiving disabled
[JENKINS] Archiving disabled
[JENKINS] Archiving disabled
[JENKINS] Archiving disabled
[JENKINS] Archiving disabled
[JENKINS] Archiving disabled
[JENKINS] Archiving disabled
[JENKINS] Archiving disabled
[JENKINS] Archiving disabled
[JENKINS] Archiving disabled
[JENKINS] Archiving disabled
[JENKINS] Archiving disabled
[JENKINS] Archiving disabled
[JENKINS] Archiving disabled
[JENKINS] Archiving disabled
[JENKINS] Archiving disabled
[JENKINS] Archiving disabled
[JENKINS] Archiving disabled
[JENKINS] Archiving disabled
[JENKINS] Archiving disabled
[JENKINS] Archiving disabled
[JENKINS] Archiving disabled
[JENKINS] Archiving disabled
[JENKINS] Archiving disabled
[JENKINS] Archiving disabled
[JENKINS] Archiving disabled
[JENKINS] Archiving disabled
[JENKINS] Archiving disabled
[JENKINS] Archiving disabled
[JENKINS] Archiving disabled
[JENKINS] Archiving disabled
[JENKINS] Archiving disabled
[JENKINS] Archiving disabled
[JENKINS] Archiving disabled
[JENKINS] Archiving disabled
[JENKINS] Archiving disabled
[JENKINS] Archiving disabled
[JENKINS] Archiving disabled
[JENKINS] Archiving disabled
[JENKINS] Archiving disabled
[JENKINS] Archiving disabled
[JENKINS] Archiving disabled
[JENKINS] Archiving disabled
[JENKINS] Archiving disabled
[JENKINS] Archiving disabled
[JENKINS] Archiving disabled
[JENKINS] Archiving disabled
[JENKINS] Archiving disabled
[JENKINS] Archiving disabled
[JENKINS] Archiving disabled
[JENKINS] Archiving disabled
[JENKINS] Archiving disabled
[JENKINS] Archiving disabled
[JENKINS] Archiving disabled
[JENKINS] Archiving disabled
[JENKINS] Archiving disabled
[JENKINS] Archiving disabled
[JENKINS] Archiving disabled
[JENKINS] Archiving disabled
[JENKINS] Archiving disabled
Waiting for Jenkins to finish collecting data
[ERROR] Failed to execute goal on project org.apache.sling.launchpad.integration-tests: Could not resolve dependencies for project org.apache.sling:org.apache.sling.launchpad.integration-tests:jar:1.0.1-SNAPSHOT: Could not find artifact org.apache.sling:org.apache.sling.junit.core:jar:1.0.10 in central (http://repo.maven.apache.org/maven2) -> [Help 1]
[ERROR]
[ERROR] To see the full stack trace of the errors, re-run Maven with the -e switch.
[ERROR] Re-run Maven using the -X switch to enable full debug logging.
[ERROR]
[ERROR] For more information about the errors and possible solutions, please read the following articles:
[ERROR] [Help 1] http://cwiki.apache.org/confluence/display/MAVEN/DependencyResolutionException
[ERROR]
[ERROR] After correcting the problems, you can resume the build with the command
[ERROR] mvn <goals> -rf :org.apache.sling.launchpad.integration-tests
Sending e-mails to: dev@sling.apache.org
Sending e-mails to: dev@sling.apache.org
channel stopped
Build failed in Jenkins: sling-trunk-1.6 #2860
Posted by Apache Jenkins Server <je...@builds.apache.org>.
See <https://builds.apache.org/job/sling-trunk-1.6/2860/changes>
Changes:
[cziegeler] SLING-4246 : Update to latest http service release
[mpetria] SLING-4153: adding distributor type and making DistributionRequest and interface
------------------------------------------
[...truncated 53702 lines...]
[INFO] Apache Sling OSGi LogService Implementation ....... SUCCESS [5.365s]
[INFO] Apache Sling MIME type mapping support ............ SUCCESS [7.768s]
[INFO] Apache Sling Commons OSGi support ................. SUCCESS [6.960s]
[INFO] Apache Sling Scheduler Support .................... SUCCESS [6.221s]
[INFO] Apache Sling Testing Utilities .................... SUCCESS [16.704s]
[INFO] Apache Sling Thread Dumper ........................ SUCCESS [5.516s]
[INFO] Apache Sling Thread Support ....................... SUCCESS [5.427s]
[INFO] Apache Sling Authentication Service ............... SUCCESS [6.765s]
[INFO] Apache Sling Form Based Authentication Handler .... SUCCESS [10.230s]
[INFO] Apache Sling Engine Implementation ................ SUCCESS [19.482s]
[INFO] Apache Sling Repository API Bundle ................ SUCCESS [5.111s]
[INFO] Apache Sling JCR Base Bundle ...................... SUCCESS [6.313s]
[INFO] Apache Sling JCR ClassLoader ...................... SUCCESS [5.417s]
[INFO] Apache Sling Initial Content Loader ............... SUCCESS [7.146s]
[INFO] Apache Sling Jackrabbit Embedded Repository ....... SUCCESS [18.520s]
[INFO] Apache Sling Jackrabbit UserManager Support ....... SUCCESS [6.737s]
[INFO] Apache Sling Jackrabbit JSR-283 Access Control Manager Support SUCCESS [5.862s]
[INFO] Apache Sling Wrapper Bundle for the JCR API ....... SUCCESS [4.870s]
[INFO] Apache Sling JCR Resource Resolver ................ SUCCESS [26.792s]
[INFO] Apache Sling JCR Repository Registration .......... SUCCESS [7.000s]
[INFO] Apache Sling Simple WebDAV Access to repositories . SUCCESS [6.523s]
[INFO] Apache Sling DavEx Access to repositories ......... SUCCESS [6.780s]
[INFO] Apache Sling JCR WebConsole Bundle ................ SUCCESS [5.470s]
[INFO] Apache Sling Oak Repository Server ................ SUCCESS [7.063s]
[INFO] Apache Sling SlingRepository Integration Tests .... SUCCESS [53.868s]
[INFO] Apache Sling Servlet Resolver ..................... SUCCESS [7.840s]
[INFO] Apache Sling Default GET Servlets ................. SUCCESS [7.316s]
[INFO] Apache Sling Default POST Servlets ................ SUCCESS [8.262s]
[INFO] Apache Sling Compat Servlets ...................... SUCCESS [5.298s]
[INFO] Apache Sling Scripting Implementation API ......... SUCCESS [5.496s]
[INFO] Apache Sling Scripting Core implementation ........ SUCCESS [14.186s]
[INFO] Apache Sling Scripting JavaScript Support ......... SUCCESS [14.959s]
[INFO] Apache Sling Scripting JSP Support ................ SUCCESS [12.582s]
[INFO] Apache Sling JSP Tag Library ...................... SUCCESS [8.617s]
[INFO] Apache Sling JSP Standard Tag Library ............. SUCCESS [5.351s]
[INFO] Apache Sling Adapter Manager Implementation ....... SUCCESS [5.962s]
[INFO] Apache Sling Bundle Resource Provider ............. SUCCESS [5.339s]
[INFO] Apache Sling Distributed Event Admin .............. SUCCESS [8.100s]
[INFO] Apache Sling Discovery API ........................ SUCCESS [5.662s]
[INFO] Apache Sling Resource-Based Discovery Service ..... SUCCESS [2:59.514s]
[INFO] Apache Sling Discovery Support Bundle ............. SUCCESS [5.037s]
[INFO] Apache Sling Discovery Standalone Implementation .. SUCCESS [5.010s]
[INFO] Apache Sling Event Support ........................ SUCCESS [11:54.725s]
[INFO] Apache Sling Feature Flags ........................ SUCCESS [5.693s]
[INFO] Apache Sling Filesystem Resource Provider ......... SUCCESS [5.556s]
[INFO] Apache Sling javax.activation bundle .............. SUCCESS [5.440s]
[INFO] Apache Sling Service User Mapper .................. SUCCESS [6.437s]
[INFO] Apache Sling Settings ............................. SUCCESS [6.116s]
[INFO] Apache Sling Web Console Branding ................. SUCCESS [5.424s]
[INFO] Apache Sling Web Console Security Provider ........ SUCCESS [5.332s]
[INFO] Apache Sling Explorer ............................. SUCCESS [5.402s]
[INFO] Apache Sling Health Check Core .................... SUCCESS [10.120s]
[INFO] Apache Sling Health Check Annotations ............. SUCCESS [4.951s]
[INFO] Apache Sling Health Check Samples ................. SUCCESS [6.453s]
[INFO] Apache Sling Health Check Support Components ...... SUCCESS [6.276s]
[INFO] Apache Sling Health Check Webconsole Plugin ....... SUCCESS [5.639s]
[INFO] Apache Sling Health Check JUnit Bridge ............ SUCCESS [5.998s]
[INFO] Apache Sling Health Check Integration Tests ....... SUCCESS [20.004s]
[INFO] Apache Sling Health Check Reactor POM ............. SUCCESS [2.739s]
[INFO] Apache Sling Resource Access Security ............. SUCCESS [5.778s]
[INFO] Apache Sling Resource Access Security Integration Tests SUCCESS [25.310s]
[INFO] Apache Sling Models API ........................... SUCCESS [5.946s]
[INFO] Apache Sling Models Implementation ................ SUCCESS [9.049s]
[INFO] Apache Sling Test Tools ........................... SUCCESS [6.253s]
[INFO] Apache Sling Models Integration Tests ............. SUCCESS [28.567s]
[INFO] Apache Sling JUnit Core ........................... SUCCESS [6.281s]
[INFO] Apache Sling JUnit Scriptable Tests Provider ...... SUCCESS [5.801s]
[INFO] Apache Sling JUnit Health Checks .................. SUCCESS [5.737s]
[INFO] Apache Sling JUnit Remote Tests Runners ........... SUCCESS [6.011s]
[INFO] Apache Sling JUnit Performance .................... SUCCESS [5.779s]
[INFO] Apache Sling Testing Resource Resolver Mock ....... SUCCESS [5.550s]
[INFO] Apache Sling Testing JCR Mock ..................... SUCCESS [6.526s]
[INFO] Apache Sling Testing OSGi Mock .................... SUCCESS [7.407s]
[INFO] Apache Sling Testing Sling Mock ................... SUCCESS [12.538s]
[INFO] Apache Sling Testing Sling Mock Jackrabbit-based Resource Resolver SUCCESS [16.555s]
[INFO] Apache Sling Pax Exam Utilities ................... SUCCESS [28.588s]
[INFO] Apache Sling Sample Server-Side Tests ............. SUCCESS [6.074s]
[INFO] Apache Sling Failing Server-Side Tests ............ SUCCESS [5.052s]
[INFO] Apache Sling Launchpad Application Builder ........ SUCCESS [1:07.690s]
[INFO] Apache Sling Sample Integration Tests ............. SUCCESS [59.577s]
[INFO] Apache Sling Testing Modules Reactor .............. SUCCESS [2.721s]
[INFO] Apache Sling Installer ............................ SUCCESS [6.983s]
[INFO] Apache Sling Installer WebConsole Plugin .......... SUCCESS [5.409s]
[INFO] Apache Sling File Installer ....................... SUCCESS [5.403s]
[INFO] Apache Sling JCR Installer ........................ SUCCESS [1:59.898s]
[INFO] Apache Sling Installer Configuration Admin Support SUCCESS [5.121s]
[INFO] Apache Sling Deployment Package Installer ......... SUCCESS [5.271s]
[INFO] Apache Sling Subsystems Installer ................. SUCCESS [5.390s]
[INFO] Apache Sling Installer Integration Tests .......... SUCCESS [41.543s]
[INFO] Apache Sling Launchpad API ........................ SUCCESS [5.067s]
[INFO] Apache Sling Launchpad Base ....................... SUCCESS [16.670s]
[INFO] Apache Sling Launchpad Installer .................. SUCCESS [8.617s]
[INFO] Apache Sling Launchpad Content .................... SUCCESS [5.046s]
[INFO] Apache Sling Launchpad Testing Services ........... SUCCESS [7.693s]
[INFO] Apache Sling Launchpad Testing Services WAR ....... SUCCESS [5.835s]
[INFO] Apache Sling Launchpad Testing Fragment Bundle .... SUCCESS [5.204s]
[INFO] Apache Sling Launchpad Test Bundles ............... SUCCESS [6.452s]
[INFO] Apache Sling Integration Tests .................... FAILURE [0.454s]
[INFO] Apache Sling Launchpad Testing .................... SKIPPED
[INFO] Apache Sling (Builder) ............................ SKIPPED
[INFO] ------------------------------------------------------------------------
[INFO] BUILD FAILURE
[INFO] ------------------------------------------------------------------------
[INFO] Total time: 38:28.292s
[INFO] Finished at: Mon Dec 15 09:39:05 UTC 2014
[INFO] Final Memory: 168M/365M
[INFO] ------------------------------------------------------------------------
[JENKINS] Archiving disabled
[JENKINS] Archiving disabled
[JENKINS] Archiving disabled
[JENKINS] Archiving disabled
[JENKINS] Archiving disabled
[JENKINS] Archiving disabled
[JENKINS] Archiving disabled
[JENKINS] Archiving disabled
[JENKINS] Archiving disabled
[JENKINS] Archiving disabled
[JENKINS] Archiving disabled
[JENKINS] Archiving disabled
[JENKINS] Archiving disabled
[JENKINS] Archiving disabled
[JENKINS] Archiving disabled
[JENKINS] Archiving disabled
[JENKINS] Archiving disabled
[JENKINS] Archiving disabled
[JENKINS] Archiving disabled
[JENKINS] Archiving disabled
[JENKINS] Archiving disabled
[JENKINS] Archiving disabled
[JENKINS] Archiving disabled
[JENKINS] Archiving disabled
[JENKINS] Archiving disabled
[JENKINS] Archiving disabled
[JENKINS] Archiving disabled
[JENKINS] Archiving disabled
[JENKINS] Archiving disabled
[JENKINS] Archiving disabled
[JENKINS] Archiving disabled
[JENKINS] Archiving disabled
[JENKINS] Archiving disabled
[JENKINS] Archiving disabled
[JENKINS] Archiving disabled
[JENKINS] Archiving disabled
[JENKINS] Archiving disabled
[JENKINS] Archiving disabled
[JENKINS] Archiving disabled
[JENKINS] Archiving disabled
[JENKINS] Archiving disabled
[JENKINS] Archiving disabled
[JENKINS] Archiving disabled
[JENKINS] Archiving disabled
[JENKINS] Archiving disabled
[JENKINS] Archiving disabled
[JENKINS] Archiving disabled
[JENKINS] Archiving disabled
[JENKINS] Archiving disabled
[JENKINS] Archiving disabled
[JENKINS] Archiving disabled
[JENKINS] Archiving disabled
[JENKINS] Archiving disabled
[JENKINS] Archiving disabled
[JENKINS] Archiving disabled
[JENKINS] Archiving disabled
[JENKINS] Archiving disabled
[JENKINS] Archiving disabled
[JENKINS] Archiving disabled
[JENKINS] Archiving disabled
[JENKINS] Archiving disabled
[JENKINS] Archiving disabled
[JENKINS] Archiving disabled
[JENKINS] Archiving disabled
[JENKINS] Archiving disabled
[JENKINS] Archiving disabled
[JENKINS] Archiving disabled
[JENKINS] Archiving disabled
[JENKINS] Archiving disabled
[JENKINS] Archiving disabled
[JENKINS] Archiving disabled
[JENKINS] Archiving disabled
[JENKINS] Archiving disabled
[JENKINS] Archiving disabled
[JENKINS] Archiving disabled
[JENKINS] Archiving disabled
[JENKINS] Archiving disabled
[JENKINS] Archiving disabled
[JENKINS] Archiving disabled
[JENKINS] Archiving disabled
[JENKINS] Archiving disabled
[JENKINS] Archiving disabled
[JENKINS] Archiving disabled
[JENKINS] Archiving disabled
[JENKINS] Archiving disabled
[JENKINS] Archiving disabled
[JENKINS] Archiving disabled
[JENKINS] Archiving disabled
[JENKINS] Archiving disabled
[JENKINS] Archiving disabled
[JENKINS] Archiving disabled
[JENKINS] Archiving disabled
[JENKINS] Archiving disabled
[JENKINS] Archiving disabled
[JENKINS] Archiving disabled
[JENKINS] Archiving disabled
[JENKINS] Archiving disabled
[JENKINS] Archiving disabled
[JENKINS] Archiving disabled
[JENKINS] Archiving disabled
[JENKINS] Archiving disabled
[JENKINS] Archiving disabled
[JENKINS] Archiving disabled
[JENKINS] Archiving disabled
[JENKINS] Archiving disabled
[JENKINS] Archiving disabled
[JENKINS] Archiving disabled
[JENKINS] Archiving disabled
[JENKINS] Archiving disabled
[JENKINS] Archiving disabled
[JENKINS] Archiving disabled
[JENKINS] Archiving disabled
[JENKINS] Archiving disabled
[JENKINS] Archiving disabled
[JENKINS] Archiving disabled
[JENKINS] Archiving disabled
[JENKINS] Archiving disabled
[JENKINS] Archiving disabled
[JENKINS] Archiving disabled
[JENKINS] Archiving disabled
[JENKINS] Archiving disabled
[JENKINS] Archiving disabled
[JENKINS] Archiving disabled
[JENKINS] Archiving disabled
[JENKINS] Archiving disabled
[JENKINS] Archiving disabled
Waiting for Jenkins to finish collecting data
[ERROR] Failed to execute goal on project org.apache.sling.launchpad.integration-tests: Could not resolve dependencies for project org.apache.sling:org.apache.sling.launchpad.integration-tests:jar:1.0.1-SNAPSHOT: Could not find artifact org.apache.sling:org.apache.sling.junit.core:jar:1.0.10 in central (http://repo.maven.apache.org/maven2) -> [Help 1]
[ERROR]
[ERROR] To see the full stack trace of the errors, re-run Maven with the -e switch.
[ERROR] Re-run Maven using the -X switch to enable full debug logging.
[ERROR]
[ERROR] For more information about the errors and possible solutions, please read the following articles:
[ERROR] [Help 1] http://cwiki.apache.org/confluence/display/MAVEN/DependencyResolutionException
[ERROR]
[ERROR] After correcting the problems, you can resume the build with the command
[ERROR] mvn <goals> -rf :org.apache.sling.launchpad.integration-tests
Sending e-mails to: dev@sling.apache.org
Sending e-mails to: dev@sling.apache.org
Sending e-mails to: dev@sling.apache.org
Sending e-mails to: dev@sling.apache.org
channel stopped