You are viewing a plain text version of this content. The canonical link for it is here.
Posted to dev@lucene.apache.org by Policeman Jenkins Server <je...@thetaphi.de> on 2017/09/21 09:50:20 UTC

[JENKINS] Lucene-Solr-7.x-MacOSX (64bit/jdk1.8.0) - Build # 199 - Unstable!

Build: https://jenkins.thetaphi.de/job/Lucene-Solr-7.x-MacOSX/199/
Java: 64bit/jdk1.8.0 -XX:+UseCompressedOops -XX:+UseG1GC

1 tests failed.
FAILED:  org.apache.solr.update.TestInPlaceUpdatesDistrib.test

Error Message:
This doc was supposed to have been deleted, but was: SolrDocument{id=0, title_s=title0, id_i=0, inplace_updatable_float=1.0, _version_=1579141076483047424, inplace_updatable_int_with_default=666, inplace_updatable_float_with_default=42.0}

Stack Trace:
java.lang.AssertionError: This doc was supposed to have been deleted, but was: SolrDocument{id=0, title_s=title0, id_i=0, inplace_updatable_float=1.0, _version_=1579141076483047424, inplace_updatable_int_with_default=666, inplace_updatable_float_with_default=42.0}
	at __randomizedtesting.SeedInfo.seed([A15276089B5A1BC7:290649D235A6763F]:0)
	at org.junit.Assert.fail(Assert.java:93)
	at org.junit.Assert.assertTrue(Assert.java:43)
	at org.junit.Assert.assertNull(Assert.java:551)
	at org.apache.solr.update.TestInPlaceUpdatesDistrib.reorderedDBQsSimpleTest(TestInPlaceUpdatesDistrib.java:247)
	at org.apache.solr.update.TestInPlaceUpdatesDistrib.test(TestInPlaceUpdatesDistrib.java:151)
	at sun.reflect.NativeMethodAccessorImpl.invoke0(Native Method)
	at sun.reflect.NativeMethodAccessorImpl.invoke(NativeMethodAccessorImpl.java:62)
	at sun.reflect.DelegatingMethodAccessorImpl.invoke(DelegatingMethodAccessorImpl.java:43)
	at java.lang.reflect.Method.invoke(Method.java:498)
	at com.carrotsearch.randomizedtesting.RandomizedRunner.invoke(RandomizedRunner.java:1737)
	at com.carrotsearch.randomizedtesting.RandomizedRunner$8.evaluate(RandomizedRunner.java:934)
	at com.carrotsearch.randomizedtesting.RandomizedRunner$9.evaluate(RandomizedRunner.java:970)
	at com.carrotsearch.randomizedtesting.RandomizedRunner$10.evaluate(RandomizedRunner.java:984)
	at org.apache.solr.BaseDistributedSearchTestCase$ShardsRepeatRule$ShardsFixedStatement.callStatement(BaseDistributedSearchTestCase.java:993)
	at org.apache.solr.BaseDistributedSearchTestCase$ShardsRepeatRule$ShardsStatement.evaluate(BaseDistributedSearchTestCase.java:968)
	at com.carrotsearch.randomizedtesting.rules.SystemPropertiesRestoreRule$1.evaluate(SystemPropertiesRestoreRule.java:57)
	at org.apache.lucene.util.TestRuleSetupTeardownChained$1.evaluate(TestRuleSetupTeardownChained.java:49)
	at org.apache.lucene.util.AbstractBeforeAfterRule$1.evaluate(AbstractBeforeAfterRule.java:45)
	at org.apache.lucene.util.TestRuleThreadAndTestName$1.evaluate(TestRuleThreadAndTestName.java:48)
	at org.apache.lucene.util.TestRuleIgnoreAfterMaxFailures$1.evaluate(TestRuleIgnoreAfterMaxFailures.java:64)
	at org.apache.lucene.util.TestRuleMarkFailure$1.evaluate(TestRuleMarkFailure.java:47)
	at com.carrotsearch.randomizedtesting.rules.StatementAdapter.evaluate(StatementAdapter.java:36)
	at com.carrotsearch.randomizedtesting.ThreadLeakControl$StatementRunner.run(ThreadLeakControl.java:368)
	at com.carrotsearch.randomizedtesting.ThreadLeakControl.forkTimeoutingTask(ThreadLeakControl.java:817)
	at com.carrotsearch.randomizedtesting.ThreadLeakControl$3.evaluate(ThreadLeakControl.java:468)
	at com.carrotsearch.randomizedtesting.RandomizedRunner.runSingleTest(RandomizedRunner.java:943)
	at com.carrotsearch.randomizedtesting.RandomizedRunner$5.evaluate(RandomizedRunner.java:829)
	at com.carrotsearch.randomizedtesting.RandomizedRunner$6.evaluate(RandomizedRunner.java:879)
	at com.carrotsearch.randomizedtesting.RandomizedRunner$7.evaluate(RandomizedRunner.java:890)
	at com.carrotsearch.randomizedtesting.rules.StatementAdapter.evaluate(StatementAdapter.java:36)
	at com.carrotsearch.randomizedtesting.rules.SystemPropertiesRestoreRule$1.evaluate(SystemPropertiesRestoreRule.java:57)
	at org.apache.lucene.util.AbstractBeforeAfterRule$1.evaluate(AbstractBeforeAfterRule.java:45)
	at com.carrotsearch.randomizedtesting.rules.StatementAdapter.evaluate(StatementAdapter.java:36)
	at org.apache.lucene.util.TestRuleStoreClassName$1.evaluate(TestRuleStoreClassName.java:41)
	at com.carrotsearch.randomizedtesting.rules.NoShadowingOrOverridesOnMethodsRule$1.evaluate(NoShadowingOrOverridesOnMethodsRule.java:40)
	at com.carrotsearch.randomizedtesting.rules.NoShadowingOrOverridesOnMethodsRule$1.evaluate(NoShadowingOrOverridesOnMethodsRule.java:40)
	at com.carrotsearch.randomizedtesting.rules.StatementAdapter.evaluate(StatementAdapter.java:36)
	at com.carrotsearch.randomizedtesting.rules.StatementAdapter.evaluate(StatementAdapter.java:36)
	at com.carrotsearch.randomizedtesting.rules.StatementAdapter.evaluate(StatementAdapter.java:36)
	at org.apache.lucene.util.TestRuleAssertionsRequired$1.evaluate(TestRuleAssertionsRequired.java:53)
	at org.apache.lucene.util.TestRuleMarkFailure$1.evaluate(TestRuleMarkFailure.java:47)
	at org.apache.lucene.util.TestRuleIgnoreAfterMaxFailures$1.evaluate(TestRuleIgnoreAfterMaxFailures.java:64)
	at org.apache.lucene.util.TestRuleIgnoreTestSuites$1.evaluate(TestRuleIgnoreTestSuites.java:54)
	at com.carrotsearch.randomizedtesting.rules.StatementAdapter.evaluate(StatementAdapter.java:36)
	at com.carrotsearch.randomizedtesting.ThreadLeakControl$StatementRunner.run(ThreadLeakControl.java:368)
	at java.lang.Thread.run(Thread.java:748)




Build Log:
[...truncated 13805 lines...]
   [junit4] Suite: org.apache.solr.update.TestInPlaceUpdatesDistrib
   [junit4]   2> Creating dataDir: /Users/jenkins/workspace/Lucene-Solr-7.x-MacOSX/solr/build/solr-core/test/J1/temp/solr.update.TestInPlaceUpdatesDistrib_A15276089B5A1BC7-001/init-core-data-001
   [junit4]   2> 3308628 WARN  (SUITE-TestInPlaceUpdatesDistrib-seed#[A15276089B5A1BC7]-worker) [    ] o.a.s.SolrTestCaseJ4 startTrackingSearchers: numOpens=7 numCloses=7
   [junit4]   2> 3308628 INFO  (SUITE-TestInPlaceUpdatesDistrib-seed#[A15276089B5A1BC7]-worker) [    ] o.a.s.SolrTestCaseJ4 Using PointFields (NUMERIC_POINTS_SYSPROP=true) w/NUMERIC_DOCVALUES_SYSPROP=true
   [junit4]   2> 3308633 INFO  (SUITE-TestInPlaceUpdatesDistrib-seed#[A15276089B5A1BC7]-worker) [    ] o.a.s.SolrTestCaseJ4 Randomized ssl (false) and clientAuth (false) via: @org.apache.solr.util.RandomizeSSL(reason=, value=NaN, ssl=NaN, clientAuth=NaN) w/ MAC_OS_X supressed clientAuth
   [junit4]   2> 3308633 INFO  (SUITE-TestInPlaceUpdatesDistrib-seed#[A15276089B5A1BC7]-worker) [    ] o.a.s.SolrTestCaseJ4 SecureRandom sanity checks: test.solr.allowed.securerandom=null & java.security.egd=file:/dev/./urandom
   [junit4]   2> 3308633 INFO  (SUITE-TestInPlaceUpdatesDistrib-seed#[A15276089B5A1BC7]-worker) [    ] o.a.s.BaseDistributedSearchTestCase Setting hostContext system property: /
   [junit4]   2> 3308634 INFO  (SUITE-TestInPlaceUpdatesDistrib-seed#[A15276089B5A1BC7]-worker) [    ] o.a.s.SolrTestCaseJ4 ####initCore
   [junit4]   2> 3308635 INFO  (SUITE-TestInPlaceUpdatesDistrib-seed#[A15276089B5A1BC7]-worker) [    ] o.a.s.c.SolrResourceLoader [null] Added 2 libs to classloader, from paths: [/Users/jenkins/workspace/Lucene-Solr-7.x-MacOSX/solr/core/src/test-files/solr/collection1/lib, /Users/jenkins/workspace/Lucene-Solr-7.x-MacOSX/solr/core/src/test-files/solr/collection1/lib/classes]
   [junit4]   2> 3308695 INFO  (SUITE-TestInPlaceUpdatesDistrib-seed#[A15276089B5A1BC7]-worker) [    ] o.a.s.c.SolrConfig Using Lucene MatchVersion: 7.1.0
   [junit4]   2> 3308704 INFO  (SUITE-TestInPlaceUpdatesDistrib-seed#[A15276089B5A1BC7]-worker) [    ] o.a.s.s.IndexSchema [null] Schema name=inplace-updates
   [junit4]   2> 3308706 INFO  (SUITE-TestInPlaceUpdatesDistrib-seed#[A15276089B5A1BC7]-worker) [    ] o.a.s.s.IndexSchema Loaded schema inplace-updates/1.6 with uniqueid field id
   [junit4]   2> 3308760 INFO  (SUITE-TestInPlaceUpdatesDistrib-seed#[A15276089B5A1BC7]-worker) [    ] o.a.s.m.r.SolrJmxReporter JMX monitoring for 'solr.node' (registry 'solr.node') enabled at server: com.sun.jmx.mbeanserver.JmxMBeanServer@7b282cef
   [junit4]   2> 3308766 INFO  (SUITE-TestInPlaceUpdatesDistrib-seed#[A15276089B5A1BC7]-worker) [    ] o.a.s.m.r.SolrJmxReporter JMX monitoring for 'solr.jvm' (registry 'solr.jvm') enabled at server: com.sun.jmx.mbeanserver.JmxMBeanServer@7b282cef
   [junit4]   2> 3308766 INFO  (SUITE-TestInPlaceUpdatesDistrib-seed#[A15276089B5A1BC7]-worker) [    ] o.a.s.m.r.SolrJmxReporter JMX monitoring for 'solr.jetty' (registry 'solr.jetty') enabled at server: com.sun.jmx.mbeanserver.JmxMBeanServer@7b282cef
   [junit4]   2> 3308768 INFO  (coreLoadExecutor-13798-thread-1) [    x:collection1] o.a.s.c.SolrResourceLoader [null] Added 2 libs to classloader, from paths: [/Users/jenkins/workspace/Lucene-Solr-7.x-MacOSX/solr/core/src/test-files/solr/collection1/lib, /Users/jenkins/workspace/Lucene-Solr-7.x-MacOSX/solr/core/src/test-files/solr/collection1/lib/classes]
   [junit4]   2> 3308829 INFO  (coreLoadExecutor-13798-thread-1) [    x:collection1] o.a.s.c.SolrConfig Using Lucene MatchVersion: 7.1.0
   [junit4]   2> 3308837 INFO  (coreLoadExecutor-13798-thread-1) [    x:collection1] o.a.s.s.IndexSchema [collection1] Schema name=inplace-updates
   [junit4]   2> 3308842 INFO  (coreLoadExecutor-13798-thread-1) [    x:collection1] o.a.s.s.IndexSchema Loaded schema inplace-updates/1.6 with uniqueid field id
   [junit4]   2> 3308842 INFO  (coreLoadExecutor-13798-thread-1) [    x:collection1] o.a.s.c.CoreContainer Creating SolrCore 'collection1' using configuration from instancedir /Users/jenkins/workspace/Lucene-Solr-7.x-MacOSX/solr/core/src/test-files/solr/collection1, trusted=true
   [junit4]   2> 3308843 INFO  (coreLoadExecutor-13798-thread-1) [    x:collection1] o.a.s.m.r.SolrJmxReporter JMX monitoring for 'solr.core.collection1' (registry 'solr.core.collection1') enabled at server: com.sun.jmx.mbeanserver.JmxMBeanServer@7b282cef
   [junit4]   2> 3308843 INFO  (coreLoadExecutor-13798-thread-1) [    x:collection1] o.a.s.c.SolrCore solr.RecoveryStrategy.Builder
   [junit4]   2> 3308843 INFO  (coreLoadExecutor-13798-thread-1) [    x:collection1] o.a.s.c.SolrCore [[collection1] ] Opening new SolrCore at [/Users/jenkins/workspace/Lucene-Solr-7.x-MacOSX/solr/core/src/test-files/solr/collection1], dataDir=[/Users/jenkins/workspace/Lucene-Solr-7.x-MacOSX/solr/build/solr-core/test/J1/temp/solr.update.TestInPlaceUpdatesDistrib_A15276089B5A1BC7-001/init-core-data-001/]
   [junit4]   2> 3308848 WARN  (coreLoadExecutor-13798-thread-1) [    x:collection1] o.a.s.c.RequestHandlers INVALID paramSet a in requestHandler {type = requestHandler,name = /dump,class = DumpRequestHandler,attributes = {initParams=a, name=/dump, class=DumpRequestHandler},args = {defaults={a=A,b=B}}}
   [junit4]   2> 3308914 INFO  (coreLoadExecutor-13798-thread-1) [    x:collection1] o.a.s.u.UpdateHandler Using UpdateLog implementation: org.apache.solr.update.UpdateLog
   [junit4]   2> 3308914 INFO  (coreLoadExecutor-13798-thread-1) [    x:collection1] o.a.s.u.UpdateLog Initializing UpdateLog: dataDir= defaultSyncLevel=FLUSH numRecordsToKeep=100 maxNumLogsToKeep=10 numVersionBuckets=65536
   [junit4]   2> 3308915 INFO  (coreLoadExecutor-13798-thread-1) [    x:collection1] o.a.s.u.CommitTracker Hard AutoCommit: disabled
   [junit4]   2> 3308915 INFO  (coreLoadExecutor-13798-thread-1) [    x:collection1] o.a.s.u.CommitTracker Soft AutoCommit: disabled
   [junit4]   2> 3308916 INFO  (coreLoadExecutor-13798-thread-1) [    x:collection1] o.a.s.s.SolrIndexSearcher Opening [Searcher@5efdf34b[collection1] main]
   [junit4]   2> 3308916 WARN  (coreLoadExecutor-13798-thread-1) [    x:collection1] o.a.s.r.ManagedResourceStorage Cannot write to config directory /Users/jenkins/workspace/Lucene-Solr-7.x-MacOSX/solr/core/src/test-files/solr/collection1/conf; switching to use InMemory storage instead.
   [junit4]   2> 3308917 INFO  (coreLoadExecutor-13798-thread-1) [    x:collection1] o.a.s.h.ReplicationHandler Commits will be reserved for  10000
   [junit4]   2> 3308918 INFO  (searcherExecutor-13799-thread-1-processing-x:collection1) [    x:collection1] o.a.s.c.SolrCore [collection1] Registered new searcher Searcher@5efdf34b[collection1] main{ExitableDirectoryReader(UninvertingDirectoryReader())}
   [junit4]   2> 3308918 INFO  (coreLoadExecutor-13798-thread-1) [    x:collection1] o.a.s.u.UpdateLog Could not find max version in index or recent updates, using new clock 1579140873476636672
   [junit4]   2> 3308920 INFO  (SUITE-TestInPlaceUpdatesDistrib-seed#[A15276089B5A1BC7]-worker) [    ] o.a.s.SolrTestCaseJ4 ####initCore end
   [junit4]   2> 3308938 INFO  (TEST-TestInPlaceUpdatesDistrib.test-seed#[A15276089B5A1BC7]) [    ] o.a.s.c.ZkTestServer STARTING ZK TEST SERVER
   [junit4]   2> 3308938 INFO  (Thread-6178) [    ] o.a.s.c.ZkTestServer client port:0.0.0.0/0.0.0.0:0
   [junit4]   2> 3308938 INFO  (Thread-6178) [    ] o.a.s.c.ZkTestServer Starting server
   [junit4]   2> 3308946 ERROR (Thread-6178) [    ] o.a.z.s.ZooKeeperServer ZKShutdownHandler is not registered, so ZooKeeper server won't take any action on ERROR or SHUTDOWN server state changes
   [junit4]   2> 3309040 INFO  (TEST-TestInPlaceUpdatesDistrib.test-seed#[A15276089B5A1BC7]) [    ] o.a.s.c.ZkTestServer start zk server on port:62486
   [junit4]   2> 3309082 INFO  (TEST-TestInPlaceUpdatesDistrib.test-seed#[A15276089B5A1BC7]) [    ] o.a.s.c.AbstractZkTestCase put /Users/jenkins/workspace/Lucene-Solr-7.x-MacOSX/solr/core/src/test-files/solr/collection1/conf/solrconfig-tlog.xml to /configs/conf1/solrconfig.xml
   [junit4]   2> 3309085 INFO  (TEST-TestInPlaceUpdatesDistrib.test-seed#[A15276089B5A1BC7]) [    ] o.a.s.c.AbstractZkTestCase put /Users/jenkins/workspace/Lucene-Solr-7.x-MacOSX/solr/core/src/test-files/solr/collection1/conf/schema-inplace-updates.xml to /configs/conf1/schema.xml
   [junit4]   2> 3309088 INFO  (TEST-TestInPlaceUpdatesDistrib.test-seed#[A15276089B5A1BC7]) [    ] o.a.s.c.AbstractZkTestCase put /Users/jenkins/workspace/Lucene-Solr-7.x-MacOSX/solr/core/src/test-files/solr/collection1/conf/solrconfig.snippet.randomindexconfig.xml to /configs/conf1/solrconfig.snippet.randomindexconfig.xml
   [junit4]   2> 3309090 INFO  (TEST-TestInPlaceUpdatesDistrib.test-seed#[A15276089B5A1BC7]) [    ] o.a.s.c.AbstractZkTestCase put /Users/jenkins/workspace/Lucene-Solr-7.x-MacOSX/solr/core/src/test-files/solr/collection1/conf/stopwords.txt to /configs/conf1/stopwords.txt
   [junit4]   2> 3309093 INFO  (TEST-TestInPlaceUpdatesDistrib.test-seed#[A15276089B5A1BC7]) [    ] o.a.s.c.AbstractZkTestCase put /Users/jenkins/workspace/Lucene-Solr-7.x-MacOSX/solr/core/src/test-files/solr/collection1/conf/protwords.txt to /configs/conf1/protwords.txt
   [junit4]   2> 3309095 INFO  (TEST-TestInPlaceUpdatesDistrib.test-seed#[A15276089B5A1BC7]) [    ] o.a.s.c.AbstractZkTestCase put /Users/jenkins/workspace/Lucene-Solr-7.x-MacOSX/solr/core/src/test-files/solr/collection1/conf/currency.xml to /configs/conf1/currency.xml
   [junit4]   2> 3309097 INFO  (TEST-TestInPlaceUpdatesDistrib.test-seed#[A15276089B5A1BC7]) [    ] o.a.s.c.AbstractZkTestCase put /Users/jenkins/workspace/Lucene-Solr-7.x-MacOSX/solr/core/src/test-files/solr/collection1/conf/enumsConfig.xml to /configs/conf1/enumsConfig.xml
   [junit4]   2> 3309100 INFO  (TEST-TestInPlaceUpdatesDistrib.test-seed#[A15276089B5A1BC7]) [    ] o.a.s.c.AbstractZkTestCase put /Users/jenkins/workspace/Lucene-Solr-7.x-MacOSX/solr/core/src/test-files/solr/collection1/conf/open-exchange-rates.json to /configs/conf1/open-exchange-rates.json
   [junit4]   2> 3309102 INFO  (TEST-TestInPlaceUpdatesDistrib.test-seed#[A15276089B5A1BC7]) [    ] o.a.s.c.AbstractZkTestCase put /Users/jenkins/workspace/Lucene-Solr-7.x-MacOSX/solr/core/src/test-files/solr/collection1/conf/mapping-ISOLatin1Accent.txt to /configs/conf1/mapping-ISOLatin1Accent.txt
   [junit4]   2> 3309103 INFO  (TEST-TestInPlaceUpdatesDistrib.test-seed#[A15276089B5A1BC7]) [    ] o.a.s.c.AbstractZkTestCase put /Users/jenkins/workspace/Lucene-Solr-7.x-MacOSX/solr/core/src/test-files/solr/collection1/conf/old_synonyms.txt to /configs/conf1/old_synonyms.txt
   [junit4]   2> 3309106 INFO  (TEST-TestInPlaceUpdatesDistrib.test-seed#[A15276089B5A1BC7]) [    ] o.a.s.c.AbstractZkTestCase put /Users/jenkins/workspace/Lucene-Solr-7.x-MacOSX/solr/core/src/test-files/solr/collection1/conf/synonyms.txt to /configs/conf1/synonyms.txt
   [junit4]   2> 3309110 INFO  (TEST-TestInPlaceUpdatesDistrib.test-seed#[A15276089B5A1BC7]) [    ] o.a.s.c.AbstractFullDistribZkTestBase Will use TLOG replicas unless explicitly asked otherwise
   [junit4]   2> 3309620 INFO  (TEST-TestInPlaceUpdatesDistrib.test-seed#[A15276089B5A1BC7]) [    ] o.e.j.s.Server jetty-9.3.20.v20170531
   [junit4]   2> 3309622 INFO  (TEST-TestInPlaceUpdatesDistrib.test-seed#[A15276089B5A1BC7]) [    ] o.e.j.s.h.ContextHandler Started o.e.j.s.ServletContextHandler@51824cdc{/,null,AVAILABLE}
   [junit4]   2> 3309624 INFO  (TEST-TestInPlaceUpdatesDistrib.test-seed#[A15276089B5A1BC7]) [    ] o.e.j.s.AbstractConnector Started ServerConnector@3fbf1be1{HTTP/1.1,[http/1.1]}{127.0.0.1:62489}
   [junit4]   2> 3309624 INFO  (TEST-TestInPlaceUpdatesDistrib.test-seed#[A15276089B5A1BC7]) [    ] o.e.j.s.Server Started @3313375ms
   [junit4]   2> 3309624 INFO  (TEST-TestInPlaceUpdatesDistrib.test-seed#[A15276089B5A1BC7]) [    ] o.a.s.c.s.e.JettySolrRunner Jetty properties: {solr.data.dir=/Users/jenkins/workspace/Lucene-Solr-7.x-MacOSX/solr/build/solr-core/test/J1/temp/solr.update.TestInPlaceUpdatesDistrib_A15276089B5A1BC7-001/tempDir-001/control/data, replicaType=NRT, hostContext=/, hostPort=62489, coreRootDirectory=/Users/jenkins/workspace/Lucene-Solr-7.x-MacOSX/solr/build/solr-core/test/J1/temp/solr.update.TestInPlaceUpdatesDistrib_A15276089B5A1BC7-001/control-001/cores}
   [junit4]   2> 3309625 ERROR (TEST-TestInPlaceUpdatesDistrib.test-seed#[A15276089B5A1BC7]) [    ] o.a.s.u.StartupLoggingUtils Missing Java Option solr.log.dir. Logging may be missing or incomplete.
   [junit4]   2> 3309625 INFO  (TEST-TestInPlaceUpdatesDistrib.test-seed#[A15276089B5A1BC7]) [    ] o.a.s.s.SolrDispatchFilter  ___      _       Welcome to Apache Solr? version 7.1.0
   [junit4]   2> 3309625 INFO  (TEST-TestInPlaceUpdatesDistrib.test-seed#[A15276089B5A1BC7]) [    ] o.a.s.s.SolrDispatchFilter / __| ___| |_ _   Starting in cloud mode on port null
   [junit4]   2> 3309625 INFO  (TEST-TestInPlaceUpdatesDistrib.test-seed#[A15276089B5A1BC7]) [    ] o.a.s.s.SolrDispatchFilter \__ \/ _ \ | '_|  Install dir: null, Default config dir: null
   [junit4]   2> 3309625 INFO  (TEST-TestInPlaceUpdatesDistrib.test-seed#[A15276089B5A1BC7]) [    ] o.a.s.s.SolrDispatchFilter |___/\___/_|_|    Start time: 2017-09-21T09:28:13.729Z
   [junit4]   2> 3309628 INFO  (TEST-TestInPlaceUpdatesDistrib.test-seed#[A15276089B5A1BC7]) [    ] o.a.s.s.SolrDispatchFilter Loading solr.xml from SolrHome (not found in ZooKeeper)
   [junit4]   2> 3309628 INFO  (TEST-TestInPlaceUpdatesDistrib.test-seed#[A15276089B5A1BC7]) [    ] o.a.s.c.SolrXmlConfig Loading container configuration from /Users/jenkins/workspace/Lucene-Solr-7.x-MacOSX/solr/build/solr-core/test/J1/temp/solr.update.TestInPlaceUpdatesDistrib_A15276089B5A1BC7-001/control-001/solr.xml
   [junit4]   2> 3309636 INFO  (TEST-TestInPlaceUpdatesDistrib.test-seed#[A15276089B5A1BC7]) [    ] o.a.s.c.SolrXmlConfig MBean server found: com.sun.jmx.mbeanserver.JmxMBeanServer@7b282cef, but no JMX reporters were configured - adding default JMX reporter.
   [junit4]   2> 3309640 INFO  (TEST-TestInPlaceUpdatesDistrib.test-seed#[A15276089B5A1BC7]) [    ] o.a.s.c.ZkContainer Zookeeper client=127.0.0.1:62486/solr
   [junit4]   2> 3309769 INFO  (TEST-TestInPlaceUpdatesDistrib.test-seed#[A15276089B5A1BC7]) [n:127.0.0.1:62489_    ] o.a.s.c.Overseer Overseer (id=null) closing
   [junit4]   2> 3309770 INFO  (TEST-TestInPlaceUpdatesDistrib.test-seed#[A15276089B5A1BC7]) [n:127.0.0.1:62489_    ] o.a.s.c.OverseerElectionContext I am going to be the leader 127.0.0.1:62489_
   [junit4]   2> 3309771 INFO  (TEST-TestInPlaceUpdatesDistrib.test-seed#[A15276089B5A1BC7]) [n:127.0.0.1:62489_    ] o.a.s.c.Overseer Overseer (id=98696304593862660-127.0.0.1:62489_-n_0000000000) starting
   [junit4]   2> 3309784 INFO  (TEST-TestInPlaceUpdatesDistrib.test-seed#[A15276089B5A1BC7]) [n:127.0.0.1:62489_    ] o.a.s.c.ZkController Register node as live in ZooKeeper:/live_nodes/127.0.0.1:62489_
   [junit4]   2> 3309790 INFO  (zkCallback-6183-thread-1-processing-n:127.0.0.1:62489_) [n:127.0.0.1:62489_    ] o.a.s.c.c.ZkStateReader Updated live nodes from ZooKeeper... (0) -> (1)
   [junit4]   2> 3309862 INFO  (TEST-TestInPlaceUpdatesDistrib.test-seed#[A15276089B5A1BC7]) [n:127.0.0.1:62489_    ] o.a.s.m.r.SolrJmxReporter JMX monitoring for 'solr.node' (registry 'solr.node') enabled at server: com.sun.jmx.mbeanserver.JmxMBeanServer@7b282cef
   [junit4]   2> 3309870 INFO  (TEST-TestInPlaceUpdatesDistrib.test-seed#[A15276089B5A1BC7]) [n:127.0.0.1:62489_    ] o.a.s.m.r.SolrJmxReporter JMX monitoring for 'solr.jvm' (registry 'solr.jvm') enabled at server: com.sun.jmx.mbeanserver.JmxMBeanServer@7b282cef
   [junit4]   2> 3309871 INFO  (TEST-TestInPlaceUpdatesDistrib.test-seed#[A15276089B5A1BC7]) [n:127.0.0.1:62489_    ] o.a.s.m.r.SolrJmxReporter JMX monitoring for 'solr.jetty' (registry 'solr.jetty') enabled at server: com.sun.jmx.mbeanserver.JmxMBeanServer@7b282cef
   [junit4]   2> 3309872 INFO  (TEST-TestInPlaceUpdatesDistrib.test-seed#[A15276089B5A1BC7]) [n:127.0.0.1:62489_    ] o.a.s.c.CorePropertiesLocator Found 0 core definitions underneath /Users/jenkins/workspace/Lucene-Solr-7.x-MacOSX/solr/build/solr-core/test/J1/temp/solr.update.TestInPlaceUpdatesDistrib_A15276089B5A1BC7-001/control-001/cores
   [junit4]   2> 3309901 INFO  (TEST-TestInPlaceUpdatesDistrib.test-seed#[A15276089B5A1BC7]) [    ] o.a.s.c.c.ZkStateReader Updated live nodes from ZooKeeper... (0) -> (1)
   [junit4]   2> 3309902 INFO  (TEST-TestInPlaceUpdatesDistrib.test-seed#[A15276089B5A1BC7]) [    ] o.a.s.c.s.i.ZkClientClusterStateProvider Cluster at 127.0.0.1:62486/solr ready
   [junit4]   2> 3309910 INFO  (qtp1273987890-31637) [n:127.0.0.1:62489_    ] o.a.s.h.a.CollectionsHandler Invoked Collection Action :create with params replicationFactor=1&collection.configName=conf1&name=control_collection&nrtReplicas=1&action=CREATE&numShards=1&createNodeSet=127.0.0.1:62489_&wt=javabin&version=2 and sendToOCPQueue=true
   [junit4]   2> 3309913 INFO  (OverseerThreadFactory-13809-thread-1-processing-n:127.0.0.1:62489_) [n:127.0.0.1:62489_    ] o.a.s.c.CreateCollectionCmd Create collection control_collection
   [junit4]   2> 3310032 INFO  (qtp1273987890-31638) [n:127.0.0.1:62489_    ] o.a.s.h.a.CoreAdminOperation core create command qt=/admin/cores&collection.configName=conf1&newCollection=true&name=control_collection_shard1_replica_n1&action=CREATE&numShards=1&collection=control_collection&shard=shard1&wt=javabin&version=2&replicaType=NRT
   [junit4]   2> 3310033 INFO  (qtp1273987890-31638) [n:127.0.0.1:62489_    ] o.a.s.c.TransientSolrCoreCacheDefault Allocating transient cache for 4 transient cores
   [junit4]   2> 3310149 INFO  (zkCallback-6183-thread-1-processing-n:127.0.0.1:62489_) [n:127.0.0.1:62489_    ] o.a.s.c.c.ZkStateReader A cluster state change: [WatchedEvent state:SyncConnected type:NodeDataChanged path:/collections/control_collection/state.json] for collection [control_collection] has occurred - updating... (live nodes size: [1])
   [junit4]   2> 3311059 INFO  (qtp1273987890-31638) [n:127.0.0.1:62489_ c:control_collection s:shard1  x:control_collection_shard1_replica_n1] o.a.s.c.SolrConfig Using Lucene MatchVersion: 7.1.0
   [junit4]   2> 3311066 INFO  (qtp1273987890-31638) [n:127.0.0.1:62489_ c:control_collection s:shard1  x:control_collection_shard1_replica_n1] o.a.s.s.IndexSchema [control_collection_shard1_replica_n1] Schema name=inplace-updates
   [junit4]   2> 3311071 INFO  (qtp1273987890-31638) [n:127.0.0.1:62489_ c:control_collection s:shard1  x:control_collection_shard1_replica_n1] o.a.s.s.IndexSchema Loaded schema inplace-updates/1.6 with uniqueid field id
   [junit4]   2> 3311071 INFO  (qtp1273987890-31638) [n:127.0.0.1:62489_ c:control_collection s:shard1  x:control_collection_shard1_replica_n1] o.a.s.c.CoreContainer Creating SolrCore 'control_collection_shard1_replica_n1' using configuration from collection control_collection, trusted=true
   [junit4]   2> 3311071 INFO  (qtp1273987890-31638) [n:127.0.0.1:62489_ c:control_collection s:shard1  x:control_collection_shard1_replica_n1] o.a.s.m.r.SolrJmxReporter JMX monitoring for 'solr.core.control_collection.shard1.replica_n1' (registry 'solr.core.control_collection.shard1.replica_n1') enabled at server: com.sun.jmx.mbeanserver.JmxMBeanServer@7b282cef
   [junit4]   2> 3311071 INFO  (qtp1273987890-31638) [n:127.0.0.1:62489_ c:control_collection s:shard1  x:control_collection_shard1_replica_n1] o.a.s.c.SolrCore solr.RecoveryStrategy.Builder
   [junit4]   2> 3311071 INFO  (qtp1273987890-31638) [n:127.0.0.1:62489_ c:control_collection s:shard1  x:control_collection_shard1_replica_n1] o.a.s.c.SolrCore [[control_collection_shard1_replica_n1] ] Opening new SolrCore at [/Users/jenkins/workspace/Lucene-Solr-7.x-MacOSX/solr/build/solr-core/test/J1/temp/solr.update.TestInPlaceUpdatesDistrib_A15276089B5A1BC7-001/control-001/cores/control_collection_shard1_replica_n1], dataDir=[/Users/jenkins/workspace/Lucene-Solr-7.x-MacOSX/solr/build/solr-core/test/J1/temp/solr.update.TestInPlaceUpdatesDistrib_A15276089B5A1BC7-001/control-001/cores/control_collection_shard1_replica_n1/data/]
   [junit4]   2> 3311078 WARN  (qtp1273987890-31638) [n:127.0.0.1:62489_ c:control_collection s:shard1  x:control_collection_shard1_replica_n1] o.a.s.c.RequestHandlers INVALID paramSet a in requestHandler {type = requestHandler,name = /dump,class = DumpRequestHandler,attributes = {initParams=a, name=/dump, class=DumpRequestHandler},args = {defaults={a=A,b=B}}}
   [junit4]   2> 3311138 INFO  (qtp1273987890-31638) [n:127.0.0.1:62489_ c:control_collection s:shard1  x:control_collection_shard1_replica_n1] o.a.s.u.UpdateHandler Using UpdateLog implementation: org.apache.solr.update.UpdateLog
   [junit4]   2> 3311138 INFO  (qtp1273987890-31638) [n:127.0.0.1:62489_ c:control_collection s:shard1  x:control_collection_shard1_replica_n1] o.a.s.u.UpdateLog Initializing UpdateLog: dataDir= defaultSyncLevel=FLUSH numRecordsToKeep=100 maxNumLogsToKeep=10 numVersionBuckets=65536
   [junit4]   2> 3311139 INFO  (qtp1273987890-31638) [n:127.0.0.1:62489_ c:control_collection s:shard1  x:control_collection_shard1_replica_n1] o.a.s.u.CommitTracker Hard AutoCommit: disabled
   [junit4]   2> 3311139 INFO  (qtp1273987890-31638) [n:127.0.0.1:62489_ c:control_collection s:shard1  x:control_collection_shard1_replica_n1] o.a.s.u.CommitTracker Soft AutoCommit: disabled
   [junit4]   2> 3311140 INFO  (qtp1273987890-31638) [n:127.0.0.1:62489_ c:control_collection s:shard1  x:control_collection_shard1_replica_n1] o.a.s.s.SolrIndexSearcher Opening [Searcher@3fd0f568[control_collection_shard1_replica_n1] main]
   [junit4]   2> 3311142 INFO  (qtp1273987890-31638) [n:127.0.0.1:62489_ c:control_collection s:shard1  x:control_collection_shard1_replica_n1] o.a.s.r.ManagedResourceStorage Configured ZooKeeperStorageIO with znodeBase: /configs/conf1
   [junit4]   2> 3311142 INFO  (qtp1273987890-31638) [n:127.0.0.1:62489_ c:control_collection s:shard1  x:control_collection_shard1_replica_n1] o.a.s.r.ManagedResourceStorage Loaded null at path _rest_managed.json using ZooKeeperStorageIO:path=/configs/conf1
   [junit4]   2> 3311143 INFO  (qtp1273987890-31638) [n:127.0.0.1:62489_ c:control_collection s:shard1  x:control_collection_shard1_replica_n1] o.a.s.h.ReplicationHandler Commits will be reserved for  10000
   [junit4]   2> 3311144 INFO  (qtp1273987890-31638) [n:127.0.0.1:62489_ c:control_collection s:shard1  x:control_collection_shard1_replica_n1] o.a.s.u.UpdateLog Could not find max version in index or recent updates, using new clock 1579140875810766848
   [junit4]   2> 3311144 INFO  (searcherExecutor-13812-thread-1-processing-n:127.0.0.1:62489_ x:control_collection_shard1_replica_n1 s:shard1 c:control_collection) [n:127.0.0.1:62489_ c:control_collection s:shard1  x:control_collection_shard1_replica_n1] o.a.s.c.SolrCore [control_collection_shard1_replica_n1] Registered new searcher Searcher@3fd0f568[control_collection_shard1_replica_n1] main{ExitableDirectoryReader(UninvertingDirectoryReader())}
   [junit4]   2> 3311152 INFO  (qtp1273987890-31638) [n:127.0.0.1:62489_ c:control_collection s:shard1  x:control_collection_shard1_replica_n1] o.a.s.c.ShardLeaderElectionContext Enough replicas found to continue.
   [junit4]   2> 3311152 INFO  (qtp1273987890-31638) [n:127.0.0.1:62489_ c:control_collection s:shard1  x:control_collection_shard1_replica_n1] o.a.s.c.ShardLeaderElectionContext I may be the new leader - try and sync
   [junit4]   2> 3311152 INFO  (qtp1273987890-31638) [n:127.0.0.1:62489_ c:control_collection s:shard1  x:control_collection_shard1_replica_n1] o.a.s.c.SyncStrategy Sync replicas to http://127.0.0.1:62489/control_collection_shard1_replica_n1/
   [junit4]   2> 3311152 INFO  (qtp1273987890-31638) [n:127.0.0.1:62489_ c:control_collection s:shard1  x:control_collection_shard1_replica_n1] o.a.s.c.SyncStrategy Sync Success - now sync replicas to me
   [junit4]   2> 3311152 INFO  (qtp1273987890-31638) [n:127.0.0.1:62489_ c:control_collection s:shard1  x:control_collection_shard1_replica_n1] o.a.s.c.SyncStrategy http://127.0.0.1:62489/control_collection_shard1_replica_n1/ has no replicas
   [junit4]   2> 3311152 INFO  (qtp1273987890-31638) [n:127.0.0.1:62489_ c:control_collection s:shard1  x:control_collection_shard1_replica_n1] o.a.s.c.ShardLeaderElectionContext Found all replicas participating in election, clear LIR
   [junit4]   2> 3311159 INFO  (qtp1273987890-31638) [n:127.0.0.1:62489_ c:control_collection s:shard1  x:control_collection_shard1_replica_n1] o.a.s.c.ShardLeaderElectionContext I am the new leader: http://127.0.0.1:62489/control_collection_shard1_replica_n1/ shard1
   [junit4]   2> 3311272 INFO  (zkCallback-6183-thread-1-processing-n:127.0.0.1:62489_) [n:127.0.0.1:62489_    ] o.a.s.c.c.ZkStateReader A cluster state change: [WatchedEvent state:SyncConnected type:NodeDataChanged path:/collections/control_collection/state.json] for collection [control_collection] has occurred - updating... (live nodes size: [1])
   [junit4]   2> 3311331 INFO  (qtp1273987890-31638) [n:127.0.0.1:62489_ c:control_collection s:shard1  x:control_collection_shard1_replica_n1] o.a.s.c.ZkController I am the leader, no recovery necessary
   [junit4]   2> 3311333 INFO  (qtp1273987890-31638) [n:127.0.0.1:62489_ c:control_collection s:shard1  x:control_collection_shard1_replica_n1] o.a.s.s.HttpSolrCall [admin] webapp=null path=/admin/cores params={qt=/admin/cores&collection.configName=conf1&newCollection=true&name=control_collection_shard1_replica_n1&action=CREATE&numShards=1&collection=control_collection&shard=shard1&wt=javabin&version=2&replicaType=NRT} status=0 QTime=1301
   [junit4]   2> 3311339 INFO  (qtp1273987890-31637) [n:127.0.0.1:62489_    ] o.a.s.h.a.CollectionsHandler Wait for new collection to be active for at most 30 seconds. Check all shard replicas
   [junit4]   2> 3311447 INFO  (zkCallback-6183-thread-1-processing-n:127.0.0.1:62489_) [n:127.0.0.1:62489_    ] o.a.s.c.c.ZkStateReader A cluster state change: [WatchedEvent state:SyncConnected type:NodeDataChanged path:/collections/control_collection/state.json] for collection [control_collection] has occurred - updating... (live nodes size: [1])
   [junit4]   2> 3311918 INFO  (OverseerCollectionConfigSetProcessor-98696304593862660-127.0.0.1:62489_-n_0000000000) [n:127.0.0.1:62489_    ] o.a.s.c.OverseerTaskQueue Response ZK path: /overseer/collection-queue-work/qnr-0000000000 doesn't exist.  Requestor may have disconnected from ZooKeeper
   [junit4]   2> 3312348 INFO  (qtp1273987890-31637) [n:127.0.0.1:62489_    ] o.a.s.s.HttpSolrCall [admin] webapp=null path=/admin/collections params={replicationFactor=1&collection.configName=conf1&name=control_collection&nrtReplicas=1&action=CREATE&numShards=1&createNodeSet=127.0.0.1:62489_&wt=javabin&version=2} status=0 QTime=2437
   [junit4]   2> 3312355 INFO  (TEST-TestInPlaceUpdatesDistrib.test-seed#[A15276089B5A1BC7]) [    ] o.a.s.c.c.ZkStateReader Updated live nodes from ZooKeeper... (0) -> (1)
   [junit4]   2> 3312357 INFO  (TEST-TestInPlaceUpdatesDistrib.test-seed#[A15276089B5A1BC7]) [    ] o.a.s.c.s.i.ZkClientClusterStateProvider Cluster at 127.0.0.1:62486/solr ready
   [junit4]   2> 3312357 INFO  (TEST-TestInPlaceUpdatesDistrib.test-seed#[A15276089B5A1BC7]) [    ] o.a.s.c.ChaosMonkey monkey: init - expire sessions:false cause connection loss:false
   [junit4]   2> 3312358 INFO  (qtp1273987890-31635) [n:127.0.0.1:62489_    ] o.a.s.h.a.CollectionsHandler Invoked Collection Action :create with params replicationFactor=1&collection.configName=conf1&name=collection1&nrtReplicas=1&action=CREATE&numShards=1&createNodeSet=&stateFormat=2&wt=javabin&version=2 and sendToOCPQueue=true
   [junit4]   2> 3312361 INFO  (OverseerThreadFactory-13809-thread-2-processing-n:127.0.0.1:62489_) [n:127.0.0.1:62489_    ] o.a.s.c.CreateCollectionCmd Create collection collection1
   [junit4]   2> 3312362 WARN  (OverseerThreadFactory-13809-thread-2-processing-n:127.0.0.1:62489_) [n:127.0.0.1:62489_    ] o.a.s.c.CreateCollectionCmd It is unusual to create a collection (collection1) without cores.
   [junit4]   2> 3312585 INFO  (qtp1273987890-31635) [n:127.0.0.1:62489_    ] o.a.s.h.a.CollectionsHandler Wait for new collection to be active for at most 30 seconds. Check all shard replicas
   [junit4]   2> 3312586 INFO  (qtp1273987890-31635) [n:127.0.0.1:62489_    ] o.a.s.s.HttpSolrCall [admin] webapp=null path=/admin/collections params={replicationFactor=1&collection.configName=conf1&name=collection1&nrtReplicas=1&action=CREATE&numShards=1&createNodeSet=&stateFormat=2&wt=javabin&version=2} status=0 QTime=227
   [junit4]   2> 3312995 INFO  (TEST-TestInPlaceUpdatesDistrib.test-seed#[A15276089B5A1BC7]) [    ] o.a.s.c.AbstractFullDistribZkTestBase create jetty 1 in directory /Users/jenkins/workspace/Lucene-Solr-7.x-MacOSX/solr/build/solr-core/test/J1/temp/solr.update.TestInPlaceUpdatesDistrib_A15276089B5A1BC7-001/shard-1-001 of type TLOG
   [junit4]   2> 3312996 INFO  (TEST-TestInPlaceUpdatesDistrib.test-seed#[A15276089B5A1BC7]) [    ] o.e.j.s.Server jetty-9.3.20.v20170531
   [junit4]   2> 3312997 INFO  (TEST-TestInPlaceUpdatesDistrib.test-seed#[A15276089B5A1BC7]) [    ] o.e.j.s.h.ContextHandler Started o.e.j.s.ServletContextHandler@150a4fd3{/,null,AVAILABLE}
   [junit4]   2> 3312998 INFO  (TEST-TestInPlaceUpdatesDistrib.test-seed#[A15276089B5A1BC7]) [    ] o.e.j.s.AbstractConnector Started ServerConnector@7b929c91{HTTP/1.1,[http/1.1]}{127.0.0.1:62520}
   [junit4]   2> 3313000 INFO  (TEST-TestInPlaceUpdatesDistrib.test-seed#[A15276089B5A1BC7]) [    ] o.e.j.s.Server Started @3316750ms
   [junit4]   2> 3313000 INFO  (TEST-TestInPlaceUpdatesDistrib.test-seed#[A15276089B5A1BC7]) [    ] o.a.s.c.s.e.JettySolrRunner Jetty properties: {solr.data.dir=/Users/jenkins/workspace/Lucene-Solr-7.x-MacOSX/solr/build/solr-core/test/J1/temp/solr.update.TestInPlaceUpdatesDistrib_A15276089B5A1BC7-001/tempDir-001/jetty1, replicaType=TLOG, solrconfig=solrconfig.xml, hostContext=/, hostPort=62520, coreRootDirectory=/Users/jenkins/workspace/Lucene-Solr-7.x-MacOSX/solr/build/solr-core/test/J1/../../../../../../../../../Users/jenkins/workspace/Lucene-Solr-7.x-MacOSX/solr/build/solr-core/test/J1/temp/solr.update.TestInPlaceUpdatesDistrib_A15276089B5A1BC7-001/shard-1-001/cores}
   [junit4]   2> 3313000 ERROR (TEST-TestInPlaceUpdatesDistrib.test-seed#[A15276089B5A1BC7]) [    ] o.a.s.u.StartupLoggingUtils Missing Java Option solr.log.dir. Logging may be missing or incomplete.
   [junit4]   2> 3313001 INFO  (TEST-TestInPlaceUpdatesDistrib.test-seed#[A15276089B5A1BC7]) [    ] o.a.s.s.SolrDispatchFilter  ___      _       Welcome to Apache Solr? version 7.1.0
   [junit4]   2> 3313001 INFO  (TEST-TestInPlaceUpdatesDistrib.test-seed#[A15276089B5A1BC7]) [    ] o.a.s.s.SolrDispatchFilter / __| ___| |_ _   Starting in cloud mode on port null
   [junit4]   2> 3313001 INFO  (TEST-TestInPlaceUpdatesDistrib.test-seed#[A15276089B5A1BC7]) [    ] o.a.s.s.SolrDispatchFilter \__ \/ _ \ | '_|  Install dir: null, Default config dir: null
   [junit4]   2> 3313001 INFO  (TEST-TestInPlaceUpdatesDistrib.test-seed#[A15276089B5A1BC7]) [    ] o.a.s.s.SolrDispatchFilter |___/\___/_|_|    Start time: 2017-09-21T09:28:17.105Z
   [junit4]   2> 3313004 INFO  (TEST-TestInPlaceUpdatesDistrib.test-seed#[A15276089B5A1BC7]) [    ] o.a.s.s.SolrDispatchFilter Loading solr.xml from SolrHome (not found in ZooKeeper)
   [junit4]   2> 3313004 INFO  (TEST-TestInPlaceUpdatesDistrib.test-seed#[A15276089B5A1BC7]) [    ] o.a.s.c.SolrXmlConfig Loading container configuration from /Users/jenkins/workspace/Lucene-Solr-7.x-MacOSX/solr/build/solr-core/test/J1/temp/solr.update.TestInPlaceUpdatesDistrib_A15276089B5A1BC7-001/shard-1-001/solr.xml
   [junit4]   2> 3313009 INFO  (TEST-TestInPlaceUpdatesDistrib.test-seed#[A15276089B5A1BC7]) [    ] o.a.s.c.SolrXmlConfig MBean server found: com.sun.jmx.mbeanserver.JmxMBeanServer@7b282cef, but no JMX reporters were configured - adding default JMX reporter.
   [junit4]   2> 3313013 INFO  (TEST-TestInPlaceUpdatesDistrib.test-seed#[A15276089B5A1BC7]) [    ] o.a.s.c.ZkContainer Zookeeper client=127.0.0.1:62486/solr
   [junit4]   2> 3313025 INFO  (TEST-TestInPlaceUpdatesDistrib.test-seed#[A15276089B5A1BC7]) [n:127.0.0.1:62520_    ] o.a.s.c.c.ZkStateReader Updated live nodes from ZooKeeper... (0) -> (1)
   [junit4]   2> 3313028 INFO  (TEST-TestInPlaceUpdatesDistrib.test-seed#[A15276089B5A1BC7]) [n:127.0.0.1:62520_    ] o.a.s.c.Overseer Overseer (id=null) closing
   [junit4]   2> 3313031 INFO  (TEST-TestInPlaceUpdatesDistrib.test-seed#[A15276089B5A1BC7]) [n:127.0.0.1:62520_    ] o.a.s.c.ZkController Register node as live in ZooKeeper:/live_nodes/127.0.0.1:62520_
   [junit4]   2> 3313035 INFO  (zkCallback-6190-thread-1) [    ] o.a.s.c.c.ZkStateReader Updated live nodes from ZooKeeper... (1) -> (2)
   [junit4]   2> 3313037 INFO  (zkCallback-6195-thread-1-processing-n:127.0.0.1:62520_) [n:127.0.0.1:62520_    ] o.a.s.c.c.ZkStateReader Updated live nodes from ZooKeeper... (1) -> (2)
   [junit4]   2> 3313037 INFO  (zkCallback-6183-thread-1-processing-n:127.0.0.1:62489_) [n:127.0.0.1:62489_    ] o.a.s.c.c.ZkStateReader Updated live nodes from ZooKeeper... (1) -> (2)
   [junit4]   2> 3313322 INFO  (TEST-TestInPlaceUpdatesDistrib.test-seed#[A15276089B5A1BC7]) [n:127.0.0.1:62520_    ] o.a.s.m.r.SolrJmxReporter JMX monitoring for 'solr.node' (registry 'solr.node') enabled at server: com.sun.jmx.mbeanserver.JmxMBeanServer@7b282cef
   [junit4]   2> 3313331 INFO  (TEST-TestInPlaceUpdatesDistrib.test-seed#[A15276089B5A1BC7]) [n:127.0.0.1:62520_    ] o.a.s.m.r.SolrJmxReporter JMX monitoring for 'solr.jvm' (registry 'solr.jvm') enabled at server: com.sun.jmx.mbeanserver.JmxMBeanServer@7b282cef
   [junit4]   2> 3313331 INFO  (TEST-TestInPlaceUpdatesDistrib.test-seed#[A15276089B5A1BC7]) [n:127.0.0.1:62520_    ] o.a.s.m.r.SolrJmxReporter JMX monitoring for 'solr.jetty' (registry 'solr.jetty') enabled at server: com.sun.jmx.mbeanserver.JmxMBeanServer@7b282cef
   [junit4]   2> 3313333 INFO  (TEST-TestInPlaceUpdatesDistrib.test-seed#[A15276089B5A1BC7]) [n:127.0.0.1:62520_    ] o.a.s.c.CorePropertiesLocator Found 0 core definitions underneath /Users/jenkins/workspace/Lucene-Solr-7.x-MacOSX/solr/build/solr-core/test/J1/../../../../../../../../../Users/jenkins/workspace/Lucene-Solr-7.x-MacOSX/solr/build/solr-core/test/J1/temp/solr.update.TestInPlaceUpdatesDistrib_A15276089B5A1BC7-001/shard-1-001/cores
   [junit4]   2> 3313372 INFO  (qtp1273987890-31639) [n:127.0.0.1:62489_    ] o.a.s.h.a.CollectionsHandler Invoked Collection Action :addreplica with params node=127.0.0.1:62520_&action=ADDREPLICA&collection=collection1&shard=shard1&type=TLOG&wt=javabin&version=2 and sendToOCPQueue=true
   [junit4]   2> 3313376 INFO  (OverseerCollectionConfigSetProcessor-98696304593862660-127.0.0.1:62489_-n_0000000000) [n:127.0.0.1:62489_    ] o.a.s.c.OverseerTaskQueue Response ZK path: /overseer/collection-queue-work/qnr-0000000002 doesn't exist.  Requestor may have disconnected from ZooKeeper
   [junit4]   2> 3313376 INFO  (OverseerThreadFactory-13809-thread-3-processing-n:127.0.0.1:62489_) [n:127.0.0.1:62489_    ] o.a.s.c.AddReplicaCmd Node Identified 127.0.0.1:62520_ for creating new replica
   [junit4]   2> 3313387 INFO  (qtp2078430411-31678) [n:127.0.0.1:62520_    ] o.a.s.h.a.CoreAdminOperation core create command qt=/admin/cores&collection.configName=conf1&name=collection1_shard1_replica_t21&action=CREATE&collection=collection1&shard=shard1&wt=javabin&version=2&replicaType=TLOG
   [junit4]   2> 3313387 INFO  (qtp2078430411-31678) [n:127.0.0.1:62520_    ] o.a.s.c.TransientSolrCoreCacheDefault Allocating transient cache for 4 transient cores
   [junit4]   2> 3313497 INFO  (zkCallback-6195-thread-1-processing-n:127.0.0.1:62520_) [n:127.0.0.1:62520_    ] o.a.s.c.c.ZkStateReader A cluster state change: [WatchedEvent state:SyncConnected type:NodeDataChanged path:/collections/collection1/state.json] for collection [collection1] has occurred - updating... (live nodes size: [2])
   [junit4]   2> 3314406 INFO  (qtp2078430411-31678) [n:127.0.0.1:62520_ c:collection1 s:shard1  x:collection1_shard1_replica_t21] o.a.s.c.SolrConfig Using Lucene MatchVersion: 7.1.0
   [junit4]   2> 3314413 INFO  (qtp2078430411-31678) [n:127.0.0.1:62520_ c:collection1 s:shard1  x:collection1_shard1_replica_t21] o.a.s.s.IndexSchema [collection1_shard1_replica_t21] Schema name=inplace-updates
   [junit4]   2> 3314436 INFO  (qtp2078430411-31678) [n:127.0.0.1:62520_ c:collection1 s:shard1  x:collection1_shard1_replica_t21] o.a.s.s.IndexSchema Loaded schema inplace-updates/1.6 with uniqueid field id
   [junit4]   2> 3314436 INFO  (qtp2078430411-31678) [n:127.0.0.1:62520_ c:collection1 s:shard1  x:collection1_shard1_replica_t21] o.a.s.c.CoreContainer Creating SolrCore 'collection1_shard1_replica_t21' using configuration from collection collection1, trusted=true
   [junit4]   2> 3314437 INFO  (qtp2078430411-31678) [n:127.0.0.1:62520_ c:collection1 s:shard1  x:collection1_shard1_replica_t21] o.a.s.m.r.SolrJmxReporter JMX monitoring for 'solr.core.collection1.shard1.replica_t21' (registry 'solr.core.collection1.shard1.replica_t21') enabled at server: com.sun.jmx.mbeanserver.JmxMBeanServer@7b282cef
   [junit4]   2> 3314437 INFO  (qtp2078430411-31678) [n:127.0.0.1:62520_ c:collection1 s:shard1  x:collection1_shard1_replica_t21] o.a.s.c.SolrCore solr.RecoveryStrategy.Builder
   [junit4]   2> 3314437 INFO  (qtp2078430411-31678) [n:127.0.0.1:62520_ c:collection1 s:shard1  x:collection1_shard1_replica_t21] o.a.s.c.SolrCore [[collection1_shard1_replica_t21] ] Opening new SolrCore at [/Users/jenkins/workspace/Lucene-Solr-7.x-MacOSX/solr/build/solr-core/test/J1/temp/solr.update.TestInPlaceUpdatesDistrib_A15276089B5A1BC7-001/shard-1-001/cores/collection1_shard1_replica_t21], dataDir=[/Users/jenkins/workspace/Lucene-Solr-7.x-MacOSX/solr/build/solr-core/test/J1/../../../../../../../../../Users/jenkins/workspace/Lucene-Solr-7.x-MacOSX/solr/build/solr-core/test/J1/temp/solr.update.TestInPlaceUpdatesDistrib_A15276089B5A1BC7-001/shard-1-001/cores/collection1_shard1_replica_t21/data/]
   [junit4]   2> 3314442 WARN  (qtp2078430411-31678) [n:127.0.0.1:62520_ c:collection1 s:shard1  x:collection1_shard1_replica_t21] o.a.s.c.RequestHandlers INVALID paramSet a in requestHandler {type = requestHandler,name = /dump,class = DumpRequestHandler,attributes = {initParams=a, name=/dump, class=DumpRequestHandler},args = {defaults={a=A,b=B}}}
   [junit4]   2> 3314494 INFO  (qtp2078430411-31678) [n:127.0.0.1:62520_ c:collection1 s:shard1  x:collection1_shard1_replica_t21] o.a.s.u.UpdateHandler Using UpdateLog implementation: org.apache.solr.update.UpdateLog
   [junit4]   2> 3314494 INFO  (qtp2078430411-31678) [n:127.0.0.1:62520_ c:collection1 s:shard1  x:collection1_shard1_replica_t21] o.a.s.u.UpdateLog Initializing UpdateLog: dataDir= defaultSyncLevel=FLUSH numRecordsToKeep=100 maxNumLogsToKeep=10 numVersionBuckets=65536
   [junit4]   2> 3314495 INFO  (qtp2078430411-31678) [n:127.0.0.1:62520_ c:collection1 s:shard1  x:collection1_shard1_replica_t21] o.a.s.u.CommitTracker Hard AutoCommit: disabled
   [junit4]   2> 3314495 INFO  (qtp2078430411-31678) [n:127.0.0.1:62520_ c:collection1 s:shard1  x:collection1_shard1_replica_t21] o.a.s.u.CommitTracker Soft AutoCommit: disabled
   [junit4]   2> 3314496 INFO  (qtp2078430411-31678) [n:127.0.0.1:62520_ c:collection1 s:shard1  x:collection1_shard1_replica_t21] o.a.s.s.SolrIndexSearcher Opening [Searcher@78b57a50[collection1_shard1_replica_t21] main]
   [junit4]   2> 3314498 INFO  (qtp2078430411-31678) [n:127.0.0.1:62520_ c:collection1 s:shard1  x:collection1_shard1_replica_t21] o.a.s.r.ManagedResourceStorage Configured ZooKeeperStorageIO with znodeBase: /configs/conf1
   [junit4]   2> 3314498 INFO  (qtp2078430411-31678) [n:127.0.0.1:62520_ c:collection1 s:shard1  x:collection1_shard1_replica_t21] o.a.s.r.ManagedResourceStorage Loaded null at path _rest_managed.json using ZooKeeperStorageIO:path=/configs/conf1
   [junit4]   2> 3314499 INFO  (qtp2078430411-31678) [n:127.0.0.1:62520_ c:collection1 s:shard1  x:collection1_shard1_replica_t21] o.a.s.h.ReplicationHandler Commits will be reserved for  10000
   [junit4]   2> 3314499 INFO  (qtp2078430411-31678) [n:127.0.0.1:62520_ c:collection1 s:shard1  x:collection1_shard1_replica_t21] o.a.s.u.UpdateLog Could not find max version in index or recent updates, using new clock 1579140879328739328
   [junit4]   2> 3314499 INFO  (searcherExecutor-13823-thread-1-processing-n:127.0.0.1:62520_ x:collection1_shard1_replica_t21 s:shard1 c:collection1) [n:127.0.0.1:62520_ c:collection1 s:shard1  x:collection1_shard1_replica_t21] o.a.s.c.SolrCore [collection1_shard1_replica_t21] Registered new searcher Searcher@78b57a50[collection1_shard1_replica_t21] main{ExitableDirectoryReader(UninvertingDirectoryReader())}
   [junit4]   2> 3314506 INFO  (qtp2078430411-31678) [n:127.0.0.1:62520_ c:collection1 s:shard1  x:collection1_shard1_replica_t21] o.a.s.c.ShardLeaderElectionContext Enough replicas found to continue.
   [junit4]   2> 3314506 INFO  (qtp2078430411-31678) [n:127.0.0.1:62520_ c:collection1 s:shard1  x:collection1_shard1_replica_t21] o.a.s.c.ShardLeaderElectionContext I may be the new leader - try and sync
   [junit4]   2> 3314506 INFO  (qtp2078430411-31678) [n:127.0.0.1:62520_ c:collection1 s:shard1  x:collection1_shard1_replica_t21] o.a.s.c.SyncStrategy Sync replicas to http://127.0.0.1:62520/collection1_shard1_replica_t21/
   [junit4]   2> 3314506 INFO  (qtp2078430411-31678) [n:127.0.0.1:62520_ c:collection1 s:shard1  x:collection1_shard1_replica_t21] o.a.s.c.SyncStrategy Sync Success - now sync replicas to me
   [junit4]   2> 3314506 INFO  (qtp2078430411-31678) [n:127.0.0.1:62520_ c:collection1 s:shard1  x:collection1_shard1_replica_t21] o.a.s.c.SyncStrategy http://127.0.0.1:62520/collection1_shard1_replica_t21/ has no replicas
   [junit4]   2> 3314506 INFO  (qtp2078430411-31678) [n:127.0.0.1:62520_ c:collection1 s:shard1  x:collection1_shard1_replica_t21] o.a.s.c.ShardLeaderElectionContext Found all replicas participating in election, clear LIR
   [junit4]   2> 3314506 INFO  (qtp2078430411-31678) [n:127.0.0.1:62520_ c:collection1 s:shard1  x:collection1_shard1_replica_t21] o.a.s.c.ZkController collection1_shard1_replica_t21 stopping background replication from leader
   [junit4]   2> 3314510 INFO  (qtp2078430411-31678) [n:127.0.0.1:62520_ c:collection1 s:shard1  x:collection1_shard1_replica_t21] o.a.s.c.ShardLeaderElectionContext I am the new leader: http://127.0.0.1:62520/collection1_shard1_replica_t21/ shard1
   [junit4]   2> 3314625 INFO  (zkCallback-6195-thread-1-processing-n:127.0.0.1:62520_) [n:127.0.0.1:62520_    ] o.a.s.c.c.ZkStateReader A cluster state change: [WatchedEvent state:SyncConnected type:NodeDataChanged path:/collections/collection1/state.json] for collection [collection1] has occurred - updating... (live nodes size: [2])
   [junit4]   2> 3314676 INFO  (qtp2078430411-31678) [n:127.0.0.1:62520_ c:collection1 s:shard1  x:collection1_shard1_replica_t21] o.a.s.c.ZkController I am the leader, no recovery necessary
   [junit4]   2> 3314679 INFO  (qtp2078430411-31678) [n:127.0.0.1:62520_ c:collection1 s:shard1  x:collection1_shard1_replica_t21] o.a.s.s.HttpSolrCall [admin] webapp=null path=/admin/cores params={qt=/admin/cores&collection.configName=conf1&name=collection1_shard1_replica_t21&action=CREATE&collection=collection1&shard=shard1&wt=javabin&version=2&replicaType=TLOG} status=0 QTime=1292
   [junit4]   2> 3314686 INFO  (qtp1273987890-31639) [n:127.0.0.1:62489_    ] o.a.s.s.HttpSolrCall [admin] webapp=null path=/admin/collections params={node=127.0.0.1:62520_&action=ADDREPLICA&collection=collection1&shard=shard1&type=TLOG&wt=javabin&version=2} status=0 QTime=1314
   [junit4]   2> 3314787 INFO  (zkCallback-6195-thread-1-processing-n:127.0.0.1:62520_) [n:127.0.0.1:62520_    ] o.a.s.c.c.ZkStateReader A cluster state change: [WatchedEvent state:SyncConnected type:NodeDataChanged path:/collections/collection1/state.json] for collection [collection1] has occurred - updating... (live nodes size: [2])
   [junit4]   2> 3314997 INFO  (TEST-TestInPlaceUpdatesDistrib.test-seed#[A15276089B5A1BC7]) [    ] o.a.s.c.AbstractFullDistribZkTestBase create jetty 2 in directory /Users/jenkins/workspace/Lucene-Solr-7.x-MacOSX/solr/build/solr-core/test/J1/temp/solr.update.TestInPlaceUpdatesDistrib_A15276089B5A1BC7-001/shard-2-001 of type TLOG
   [junit4]   2> 3314997 INFO  (TEST-TestInPlaceUpdatesDistrib.test-seed#[A15276089B5A1BC7]) [    ] o.e.j.s.Server jetty-9.3.20.v20170531
   [junit4]   2> 3314999 INFO  (TEST-TestInPlaceUpdatesDistrib.test-seed#[A15276089B5A1BC7]) [    ] o.e.j.s.h.ContextHandler Started o.e.j.s.ServletContextHandler@5630a8bc{/,null,AVAILABLE}
   [junit4]   2> 3314999 INFO  (TEST-TestInPlaceUpdatesDistrib.test-seed#[A15276089B5A1BC7]) [    ] o.e.j.s.AbstractConnector Started ServerConnector@44b62b9a{HTTP/1.1,[http/1.1]}{127.0.0.1:62529}
   [junit4]   2> 3314999 INFO  (TEST-TestInPlaceUpdatesDistrib.test-seed#[A15276089B5A1BC7]) [    ] o.e.j.s.Server Started @3318750ms
   [junit4]   2> 3315000 INFO  (TEST-TestInPlaceUpdatesDistrib.test-seed#[A15276089B5A1BC7]) [    ] o.a.s.c.s.e.JettySolrRunner Jetty properties: {solr.data.dir=/Users/jenkins/workspace/Lucene-Solr-7.x-MacOSX/solr/build/solr-core/test/J1/temp/solr.update.TestInPlaceUpdatesDistrib_A15276089B5A1BC7-001/tempDir-001/jetty2, replicaType=TLOG, solrconfig=solrconfig.xml, hostContext=/, hostPort=62529, coreRootDirectory=/Users/jenkins/workspace/Lucene-Solr-7.x-MacOSX/solr/build/solr-core/test/J1/temp/solr.update.TestInPlaceUpdatesDistrib_A15276089B5A1BC7-001/shard-2-001/cores}
   [junit4]   2> 3315000 ERROR (TEST-TestInPlaceUpdatesDistrib.test-seed#[A15276089B5A1BC7]) [    ] o.a.s.u.StartupLoggingUtils Missing Java Option solr.log.dir. Logging may be missing or incomplete.
   [junit4]   2> 3315000 INFO  (TEST-TestInPlaceUpdatesDistrib.test-seed#[A15276089B5A1BC7]) [    ] o.a.s.s.SolrDispatchFilter  ___      _       Welcome to Apache Solr? version 7.1.0
   [junit4]   2> 3315000 INFO  (TEST-TestInPlaceUpdatesDistrib.test-seed#[A15276089B5A1BC7]) [    ] o.a.s.s.SolrDispatchFilter / __| ___| |_ _   Starting in cloud mode on port null
   [junit4]   2> 3315000 INFO  (TEST-TestInPlaceUpdatesDistrib.test-seed#[A15276089B5A1BC7]) [    ] o.a.s.s.SolrDispatchFilter \__ \/ _ \ | '_|  Install dir: null, Default config dir: null
   [junit4]   2> 3315000 INFO  (TEST-TestInPlaceUpdatesDistrib.test-seed#[A15276089B5A1BC7]) [    ] o.a.s.s.SolrDispatchFilter |___/\___/_|_|    Start time: 2017-09-21T09:28:19.104Z
   [junit4]   2> 3315009 INFO  (TEST-TestInPlaceUpdatesDistrib.test-seed#[A15276089B5A1BC7]) [    ] o.a.s.s.SolrDispatchFilter Loading solr.xml from SolrHome (not found in ZooKeeper)
   [junit4]   2> 3315009 INFO  (TEST-TestInPlaceUpdatesDistrib.test-seed#[A15276089B5A1BC7]) [    ] o.a.s.c.SolrXmlConfig Loading container configuration from /Users/jenkins/workspace/Lucene-Solr-7.x-MacOSX/solr/build/solr-core/test/J1/temp/solr.update.TestInPlaceUpdatesDistrib_A15276089B5A1BC7-001/shard-2-001/solr.xml
   [junit4]   2> 3315016 INFO  (TEST-TestInPlaceUpdatesDistrib.test-seed#[A15276089B5A1BC7]) [    ] o.a.s.c.SolrXmlConfig MBean server found: com.sun.jmx.mbeanserver.JmxMBeanServer@7b282cef, but no JMX reporters were configured - adding default JMX reporter.
   [junit4]   2> 3315020 INFO  (TEST-TestInPlaceUpdatesDistrib.test-seed#[A15276089B5A1BC7]) [    ] o.a.s.c.ZkContainer Zookeeper client=127.0.0.1:62486/solr
   [junit4]   2> 3315035 INFO  (TEST-TestInPlaceUpdatesDistrib.test-seed#[A15276089B5A1BC7]) [n:127.0.0.1:62529_    ] o.a.s.c.c.ZkStateReader Updated live nodes from ZooKeeper... (0) -> (2)
   [junit4]   2> 3315040 INFO  (TEST-TestInPlaceUpdatesDistrib.test-seed#[A15276089B5A1BC7]) [n:127.0.0.1:62529_    ] o.a.s.c.Overseer Overseer (id=null) closing
   [junit4]   2> 3315044 INFO  (TEST-TestInPlaceUpdatesDistrib.test-seed#[A15276089B5A1BC7]) [n:127.0.0.1:62529_    ] o.a.s.c.ZkController Register node as live in ZooKeeper:/live_nodes/127.0.0.1:62529_
   [junit4]   2> 3315047 INFO  (zkCallback-6195-thread-1-processing-n:127.0.0.1:62520_) [n:127.0.0.1:62520_    ] o.a.s.c.c.ZkStateReader Updated live nodes from ZooKeeper... (2) -> (3)
   [junit4]   2> 3315047 INFO  (zkCallback-6183-thread-1-processing-n:127.0.0.1:62489_) [n:127.0.0.1:62489_    ] o.a.s.c.c.ZkStateReader Updated live nodes from ZooKeeper... (2) -> (3)
   [junit4]   2> 3315047 INFO  (zkCallback-6190-thread-1) [    ] o.a.s.c.c.ZkStateReader Updated live nodes from ZooKeeper... (2) -> (3)
   [junit4]   2> 3315049 INFO  (zkCallback-6201-thread-1-processing-n:127.0.0.1:62529_) [n:127.0.0.1:62529_    ] o.a.s.c.c.ZkStateReader Updated live nodes from ZooKeeper... (2) -> (3)
   [junit4]   2> 3315133 INFO  (TEST-TestInPlaceUpdatesDistrib.test-seed#[A15276089B5A1BC7]) [n:127.0.0.1:62529_    ] o.a.s.m.r.SolrJmxReporter JMX monitoring for 'solr.node' (registry 'solr.node') enabled at server: com.sun.jmx.mbeanserver.JmxMBeanServer@7b282cef
   [junit4]   2> 3315144 INFO  (TEST-TestInPlaceUpdatesDistrib.test-seed#[A15276089B5A1BC7]) [n:127.0.0.1:62529_    ] o.a.s.m.r.SolrJmxReporter JMX monitoring for 'solr.jvm' (registry 'solr.jvm') enabled at server: com.sun.jmx.mbeanserver.JmxMBeanServer@7b282cef
   [junit4]   2> 3315144 INFO  (TEST-TestInPlaceUpdatesDistrib.test-seed#[A15276089B5A1BC7]) [n:127.0.0.1:62529_    ] o.a.s.m.r.SolrJmxReporter JMX monitoring for 'solr.jetty' (registry 'solr.jetty') enabled at server: com.sun.jmx.mbeanserver.JmxMBeanServer@7b282cef
   [junit4]   2> 3315146 INFO  (TEST-TestInPlaceUpdatesDistrib.test-seed#[A15276089B5A1BC7]) [n:127.0.0.1:62529_    ] o.a.s.c.CorePropertiesLocator Found 0 core definitions underneath /Users/jenkins/workspace/Lucene-Solr-7.x-MacOSX/solr/build/solr-core/test/J1/temp/solr.update.TestInPlaceUpdatesDistrib_A15276089B5A1BC7-001/shard-2-001/cores
   [junit4]   2> 3315184 INFO  (qtp1273987890-31638) [n:127.0.0.1:62489_    ] o.a.s.h.a.CollectionsHandler Invoked Collection Action :addreplica with params node=127.0.0.1:62529_&action=ADDREPLICA&collection=collection1&shard=shard1&type=TLOG&wt=javabin&version=2 and sendToOCPQueue=true
   [junit4]   2> 3315187 INFO  (OverseerCollectionConfigSetProcessor-98696304593862660-127.0.0.1:62489_-n_0000000000) [n:127.0.0.1:62489_    ] o.a.s.c.OverseerTaskQueue Response ZK path: /overseer/collection-queue-work/qnr-0000000004 doesn't exist.  Requestor may have disconnected from ZooKeeper
   [junit4]   2> 3315187 INFO  (OverseerThreadFactory-13809-thread-4-processing-n:127.0.0.1:62489_) [n:127.0.0.1:62489_    ] o.a.s.c.AddReplicaCmd Node Identified 127.0.0.1:62529_ for creating new replica
   [junit4]   2> 3315196 INFO  (qtp236829946-31708) [n:127.0.0.1:62529_    ] o.a.s.h.a.CoreAdminOperation core create command qt=/admin/cores&collection.configName=conf1&name=collection1_shard1_replica_t23&action=CREATE&collection=collection1&shard=shard1&wt=javabin&version=2&replicaType=TLOG
   [junit4]   2> 3315196 INFO  (qtp236829946-31708) [n:127.0.0.1:62529_    ] o.a.s.c.TransientSolrCoreCacheDefault Allocating transient cache for 4 transient cores
   [junit4]   2> 3315314 INFO  (zkCallback-6195-thread-1-processing-n:127.0.0.1:62520_) [n:127.0.0.1:62520_    ] o.a.s.c.c.ZkStateReader A cluster state change: [WatchedEvent state:SyncConnected type:NodeDataChanged path:/collections/collection1/state.json] for collection [collection1] has occurred - updating... (live nodes size: [3])
   [junit4]   2> 3315314 INFO  (zkCallback-6201-thread-1-processing-n:127.0.0.1:62529_) [n:127.0.0.1:62529_    ] o.a.s.c.c.ZkStateReader A cluster state change: [WatchedEvent state:SyncConnected type:NodeDataChanged path:/collections/collection1/state.json] for collection [collection1] has occurred - updating... (live nodes size: [3])
   [junit4]   2> 3316218 INFO  (qtp236829946-31708) [n:127.0.0.1:62529_ c:collection1 s:shard1  x:collection1_shard1_replica_t23] o.a.s.c.SolrConfig Using Lucene MatchVersion: 7.1.0
   [junit4]   2> 3316225 INFO  (qtp236829946-31708) [n:127.0.0.1:62529_ c:collection1 s:shard1  x:collection1_shard1_replica_t23] o.a.s.s.IndexSchema [collection1_shard1_replica_t23] Schema name=inplace-updates
   [junit4]   2> 3316229 INFO  (qtp236829946-31708) [n:127.0.0.1:62529_ c:collection1 s:shard1  x:collection1_shard1_replica_t23] o.a.s.s.IndexSchema Loaded schema inplace-updates/1.6 with uniqueid field id
   [junit4]   2> 3316229 INFO  (qtp236829946-31708) [n:127.0.0.1:62529_ c:collection1 s:shard1  x:collection1_shard1_replica_t23] o.a.s.c.CoreContainer Creating SolrCore 'collection1_shard1_replica_t23' using configuration from collection collection1, trusted=true
   [junit4]   2> 3316229 INFO  (qtp236829946-31708) [n:127.0.0.1:62529_ c:collection1 s:shard1  x:collection1_shard1_replica_t23] o.a.s.m.r.SolrJmxReporter JMX monitoring for 'solr.core.collection1.shard1.replica_t23' (registry 'solr.core.collection1.shard1.replica_t23') enabled at server: com.sun.jmx.mbeanserver.JmxMBeanServer@7b282cef
   [junit4]   2> 3316229 INFO  (qtp236829946-31708) [n:127.0.0.1:62529_ c:collection1 s:shard1  x:collection1_shard1_replica_t23] o.a.s.c.SolrCore solr.RecoveryStrategy.Builder
   [junit4]   2> 3316229 INFO  (qtp236829946-31708) [n:127.0.0.1:62529_ c:collection1 s:shard1  x:collection1_shard1_replica_t23] o.a.s.c.SolrCore [[collection1_shard1_replica_t23] ] Opening new SolrCore at [/Users/jenkins/workspace/Lucene-Solr-7.x-MacOSX/solr/build/solr-core/test/J1/temp/solr.update.TestInPlaceUpdatesDistrib_A15276089B5A1BC7-001/shard-2-001/cores/collection1_shard1_replica_t23], dataDir=[/Users/jenkins/workspace/Lucene-Solr-7.x-MacOSX/solr/build/solr-core/test/J1/temp/solr.update.TestInPlaceUpdatesDistrib_A15276089B5A1BC7-001/shard-2-001/cores/collection1_shard1_replica_t23/data/]
   [junit4]   2> 3316244 WARN  (qtp236829946-31708) [n:127.0.0.1:62529_ c:collection1 s:shard1  x:collection1_shard1_replica_t23] o.a.s.c.RequestHandlers INVALID paramSet a in requestHandler {type = requestHandler,name = /dump,class = DumpRequestHandler,attributes = {initParams=a, name=/dump, class=DumpRequestHandler},args = {defaults={a=A,b=B}}}
   [junit4]   2> 3316293 INFO  (qtp236829946-31708) [n:127.0.0.1:62529_ c:collection1 s:shard1  x:collection1_shard1_replica_t23] o.a.s.u.UpdateHandler Using UpdateLog implementation: org.apache.solr.update.UpdateLog
   [junit4]   2> 3316293 INFO  (qtp236829946-31708) [n:127.0.0.1:62529_ c:collection1 s:shard1  x:collection1_shard1_replica_t23] o.a.s.u.UpdateLog Initializing UpdateLog: dataDir= defaultSyncLevel=FLUSH numRecordsToKeep=100 maxNumLogsToKeep=10 numVersionBuckets=65536
   [junit4]   2> 3316294 INFO  (qtp236829946-31708) [n:127.0.0.1:62529_ c:collection1 s:shard1  x:collection1_shard1_replica_t23] o.a.s.u.CommitTracker Hard AutoCommit: disabled
   [junit4]   2> 3316294 INFO  (qtp236829946-31708) [n:127.0.0.1:62529_ c:collection1 s:shard1  x:collection1_shard1_replica_t23] o.a.s.u.CommitTracker Soft AutoCommit: disabled
   [junit4]   2> 3316295 INFO  (qtp236829946-31708) [n:127.0.0.1:62529_ c:collection1 s:shard1  x:collection1_shard1_replica_t23] o.a.s.s.SolrIndexSearcher Opening [Searcher@a8c0b94[collection1_shard1_replica_t23] main]
   [junit4]   2> 3316298 INFO  (qtp236829946-31708) [n:127.0.0.1:62529_ c:collection1 s:shard1  x:collection1_shard1_replica_t23] o.a.s.r.ManagedResourceStorage Configured ZooKeeperStorageIO with znodeBase: /configs/conf1
   [junit4]   2> 3316298 INFO  (qtp236829946-31708) [n:127.0.0.1:62529_ c:collection1 s:shard1  x:collection1_shard1_replica_t23] o.a.s.r.ManagedResourceStorage Loaded null at path _rest_managed.json using ZooKeeperStorageIO:path=/configs/conf1
   [junit4]   2> 3316299 INFO  (qtp236829946-31708) [n:127.0.0.1:62529_ c:collection1 s:shard1  x:collection1_shard1_replica_t23] o.a.s.h.ReplicationHandler Commits will be reserved for  10000
   [junit4]   2> 3316299 INFO  (qtp236829946-31708) [n:127.0.0.1:62529_ c:collection1 s:shard1  x:collection1_shard1_replica_t23] o.a.s.u.UpdateLog Could not find max version in index or recent updates, using new clock 1579140881216176128
   [junit4]   2> 3316299 INFO  (searcherExecutor-13834-thread-1-processing-n:127.0.0.1:62529_ x:collection1_shard1_replica_t23 s:shard1 c:collection1) [n:127.0.0.1:62529_ c:collection1 s:shard1  x:collection1_shard1_replica_t23] o.a.s.c.SolrCore [collection1_shard1_replica_t23] Registered new searcher Searcher@a8c0b94[collection1_shard1_replica_t23] main{ExitableDirectoryReader(UninvertingDirectoryReader())}
   [junit4]   2> 3316303 INFO  (qtp236829946-31708) [n:127.0.0.1:62529_ c:collection1 s:shard1  x:collection1_shard1_replica_t23] o.a.s.c.ZkController Core needs to recover:collection1_shard1_replica_t23
   [junit4]   2> 3316303 INFO  (updateExecutor-6198-thread-1-processing-n:127.0.0.1:62529_ x:collection1_shard1_replica_t23 s:shard1 c:collection1) [n:127.0.0.1:62529_ c:collection1 s:shard1 r:core_node24 x:collection1_shard1_replica_t23] o.a.s.u.DefaultSolrCoreState Running recovery
   [junit4]   2> 3316304 INFO  (qtp236829946-31708) [n:127.0.0.1:62529_ c:collection1 s:shard1  x:collection1_shard1_replica_t23] o.a.s.s.HttpSolrCall [admin] webapp=null path=/admin/cores params={qt=/admin/cores&collection.configName=conf1&name=collection1_shard1_replica_t23&action=CREATE&collection=collection1&shard=shard1&wt=javabin&version=2&replicaType=TLOG} status=0 QTime=1108
   [junit4]   2> 3316304 INFO  (recoveryExecutor-6199-thread-1-processing-n:127.0.0.1:62529_ x:collection1_shard1_replica_t23 s:shard1 c:collection1 r:core_node24) [n:127.0.0.1:62529_ c:collection1 s:shard1 r:core_node24 x:collection1_shard1_replica_t23] o.a.s.c.RecoveryStrategy Starting recovery process. recoveringAfterStartup=true
   [junit4]   2> 3316304 INFO  (recoveryExecutor-6199-thread-1-processing-n:127.0.0.1:62529_ x:collection1_shard1_replica_t23 s:shard1 c:collection1 r:core_node24) [n:127.0.0.1:62529_ c:collection1 s:shard1 r:core_node24 x:collection1_shard1_replica_t23] o.a.s.c.RecoveryStrategy ###### startupVersions=[[]]
   [junit4]   2> 3316304 INFO  (recoveryExecutor-6199-thread-1-processing-n:127.0.0.1:62529_ x:collection1_shard1_replica_t23 s:shard1 c:collection1 r:core_node24) [n:127.0.0.1:62529_ c:collection1 s:shard1 r:core_node24 x:collection1_shard1_replica_t23] o.a.s.c.ZkController collection1_shard1_replica_t23 stopping background replication from leader
   [junit4]   2> 3316304 INFO  (recoveryExecutor-6199-thread-1-processing-n:127.0.0.1:62529_ x:collection1_shard1_replica_t23 s:shard1 c:collection1 r:core_node24) [n:127.0.0.1:62529_ c:collection1 s:shard1 r:core_node24 x:collection1_shard1_replica_t23] o.a.s.c.RecoveryStrategy Begin buffering updates. core=[collection1_shard1_replica_t23]
   [junit4]   2> 3316304 INFO  (recoveryExecutor-6199-thread-1-processing-n:127.0.0.1:62529_ x:collection1_shard1_replica_t23 s:shard1 c:collection1 r:core_node24) [n:127.0.0.1:62529_ c:collection1 s:shard1 r:core_node24 x:collection1_shard1_replica_t23] o.a.s.u.UpdateLog Starting to buffer updates. FSUpdateLog{state=ACTIVE, tlog=null}
   [junit4]   2> 3316304 INFO  (recoveryExecutor-6199-thread-1-processing-n:127.0.0.1:62529_ x:collection1_shard1_replica_t23 s:shard1 c:collection1 r:core_node24) [n:127.0.0.1:62529_ c:collection1 s:shard1 r:core_node24 x:collection1_shard1_replica_t23] o.a.s.c.RecoveryStrategy Publishing state of core [collection1_shard1_replica_t23] as recovering, leader is [http://127.0.0.1:62520/collection1_shard1_replica_t21/] and I am [http://127.0.0.1:62529/collection1_shard1_replica_t23/]
   [junit4]   2> 3316307 INFO  (qtp1273987890-31638) [n:127.0.0.1:62489_    ] o.a.s.s.HttpSolrCall [admin] webapp=null path=/admin/collections params={node=127.0.0.1:62529_&action=ADDREPLICA&collection=collection1&shard=shard1&type=TLOG&wt=javabin&version=2} status=0 QTime=1123
   [junit4]   2> 3316308 INFO  (recoveryExecutor-6199-thread-1-processing-n:127.0.0.1:62529_ x:collection1_shard1_replica_t23 s:shard1 c:collection1 r:core_node24) [n:127.0.0.1:62529_ c:collection1 s:shard1 r:core_node24 x:collection1_shard1_replica_t23] o.a.s.c.RecoveryStrategy Sending prep recovery command to [http://127.0.0.1:62520]; [WaitForState: action=PREPRECOVERY&core=collection1_shard1_replica_t21&nodeName=127.0.0.1:62529_&coreNodeName=core_node24&state=recovering&checkLive=true&onlyIfLeader=true&onlyIfLeaderActive=true]
   [junit4]   2> 3316309 INFO  (qtp2078430411-31680) [n:127.0.0.1:62520_    ] o.a.s.h.a.PrepRecoveryOp Going to wait for coreNodeName: core_node24, state: recovering, checkLive: true, onlyIfLeader: true, onlyIfLeaderActive: true, maxTime: 183 s
   [junit4]   2> 3316309 INFO  (qtp2078430411-31680) [n:127.0.0.1:62520_    ] o.a.s.h.a.PrepRecoveryOp In WaitForState(recovering): collection=collection1, shard=shard1, thisCore=collection1_shard1_replica_t21, leaderDoesNotNeedRecovery=false, isLeader? true, live=true, checkLive=true, currentState=down, localState=active, nodeName=127.0.0.1:62529_, coreNodeName=core_node24, onlyIfActiveCheckResult=false, nodeProps: core_node24:{"core":"collection1_shard1_replica_t23","base_url":"http://127.0.0.1:62529","node_name":"127.0.0.1:62529_","state":"down","type":"TLOG"}
   [junit4]   2> 3316411 INFO  (zkCallback-6195-thread-1-processing-n:127.0.0.1:62520_) [n:127.0.0.1:62520_    ] o.a.s.c.c.ZkStateReader A cluster state change: [WatchedEvent state:SyncConnected type:NodeDataChanged path:/collections/collection1/state.json] for collection [collection1] has occurred - updating... (live nodes size: [3])
   [junit4]   2> 3316411 INFO  (zkCallback-6201-thread-1-processing-n:127.0.0.1:62529_) [n:127.0.0.1:62529_    ] o.a.s.c.c.ZkStateReader A cluster state change: [WatchedEvent state:SyncConnected type:NodeDataChanged path:/collections/collection1/state.json] for collection [collection1] has occurred - updating... (live nodes size: [3])
   [junit4]   2> 3316552 INFO  (TEST-TestInPlaceUpdatesDistrib.test-seed#[A15276089B5A1BC7]) [    ] o.a.s.c.AbstractFullDistribZkTestBase create jetty 3 in directory /Users/jenkins/workspace/Lucene-Solr-7.x-MacOSX/solr/build/solr-core/test/J1/temp/solr.update.TestInPlaceUpdatesDistrib_A15276089B5A1BC7-001/shard-3-001 of type TLOG
   [junit4]   2> 3316553 INFO  (TEST-TestInPlaceUpdatesDistrib.test-seed#[A15276089B5A1BC7]) [    ] o.e.j.s.Server jetty-9.3.20.v20170531
   [junit4]   2> 3316554 INFO  (TEST-TestInPlaceUpdatesDistrib.test-seed#[A15276089B5A1BC7]) [    ] o.e.j.s.h.ContextHandler Started o.e.j.s.ServletContextHandler@63b75111{/,null,AVAILABLE}
   [junit4]   2> 3316554 INFO  (TEST-TestInPlaceUpdatesDistrib.test-seed#[A15276089B5A1BC7]) [    ] o.e.j.s.AbstractConnector Started ServerConnector@52b929fa{HTTP/1.1,[http/1.1]}{127.0.0.1:62535}
   [junit4]   2> 3316556 INFO  (TEST-TestInPlaceUpdatesDistrib.test-seed#[A15276089B5A1BC7]) [    ] o.e.j.s.Server Started @3320307ms
   [junit4]   2> 3316556 INFO  (TEST-TestInPlaceUpdatesDistrib.test-seed#[A15276089B5A1BC7]) [    ] o.a.s.c.s.e.JettySolrRunner Jetty properties: {solr.data.dir=/Users/jenkins/workspace/Lucene-Solr-7.x-MacOSX/solr/build/solr-core/test/J1/temp/solr.update.TestInPlaceUpdatesDistrib_A15276089B5A1BC7-001/tempDir-001/jetty3, replicaType=TLOG, solrconfig=solrconfig.xml, hostContext=/, hostPort=62535, coreRootDirectory=/Users/jenkins/workspace/Lucene-Solr-7.x-MacOSX/solr/build/solr-core/test/J1/temp/solr.update.TestInPlaceUpdatesDistrib_A15276089B5A1BC7-001/shard-3-001/cores}
   [junit4]   2> 3316557 ERROR (TEST-TestInPlaceUpdatesDistrib.test-seed#[A15276089B5A1BC7]) [    ] o.a.s.u.StartupLoggingUtils Missing Java Option solr.log.dir. Logging may be missing or incomplete.
   [junit4]   2> 3316557 INFO  (TEST-TestInPlaceUpdatesDistrib.test-seed#[A15276089B5A1BC7]) [    ] o.a.s.s.SolrDispatchFilter  ___      _       Welcome to Apache Solr? version 7.1.0
   [junit4]   2> 3316557 INFO  (TEST-TestInPlaceUpdatesDistrib.test-seed#[A15276089B5A1BC7]) [    ] o.a.s.s.SolrDispatchFilter / __| ___| |_ _   Starting in cloud mode on port null
   [junit4]   2> 3316557 INFO  (TEST-TestInPlaceUpdatesDistrib.test-seed#[A15276089B5A1BC7]) [    ] o.a.s.s.SolrDispatchFilter \__ \/ _ \ | '_|  Install dir: null, Default config dir: null
   [junit4]   2> 3316557 INFO  (TEST-TestInPlaceUpdatesDistrib.test-seed#[A15276089B5A1BC7]) [    ] o.a.s.s.SolrDispatchFilter |___/\___/_|_|    Start time: 2017-09-21T09:28:20.661Z
   [junit4]   2> 3316560 INFO  (TEST-TestInPlaceUpdatesDistrib.test-seed#[A15276089B5A1BC7]) [    ] o.a.s.s.SolrDispatchFilter Loading solr.xml from SolrHome (not found in ZooKeeper)
   [junit4]   2> 3316560 INFO  (TEST-TestInPlaceUpdatesDistrib.test-seed#[A15276089B5A1BC7]) [    ] o.a.s.c.SolrXmlConfig Loading container configuration from /Users/jenkins/workspace/Lucene-Solr-7.x-MacOSX/solr/build/solr-core/test/J1/temp/solr.update.TestInPlaceUpdatesDistrib_A15276089B5A1BC7-001/shard-3-001/solr.xml
   [junit4]   2> 3316564 INFO  (TEST-TestInPlaceUpdatesDistrib.test-seed#[A15276089B5A1BC7]) [    ] o.a.s.c.SolrXmlConfig MBean server found: com.sun.jmx.mbeanserver.JmxMBeanServer@7b282cef, but no JMX reporters were configured - adding default JMX reporter.
   [junit4]   2> 3316568 INFO  (TEST-TestInPlaceUpdatesDistrib.test-seed#[A15276089B5A1BC7]) [    ] o.a.s.c.ZkContainer Zookeeper client=127.0.0.1:62486/solr
   [junit4]   2> 3316580 INFO  (TEST-TestInPlaceUpdatesDistrib.test-seed#[A15276089B5A1BC7]) [n:127.0.0.1:62535_    ] o.a.s.c.c.ZkStateReader Updated live nodes from ZooKeeper... (0) -> (3)
   [junit4]   2> 3316583 INFO  (TEST-TestInPlaceUpdatesDistrib.test-seed#[A15276089B5A1BC7]) [n:127.0.0.1:62535_    ] o.a.s.c.Overseer Overseer (id=null) closing
   [junit4]   2> 3316585 INFO  (TEST-TestInPlaceUpdatesDistrib.test-seed#[A15276089B5A1BC7]) [n:127.0.0.1:62535_    ] o.a.s.c.ZkController Register node as live in ZooKeeper:/live_nodes/127.0.0.1:62535_
   [junit4]   2> 3316587 INFO  (zkCallback-6190-thread-1) [    ] o.a.s.c.c.ZkStateReader Updated live nodes from ZooKeeper... (3) -> (4)
   [junit4]   2> 3316587 INFO  (zkCallback-6195-thread-1-processing-n:127.0.0.1:62520_) [n:127.0.0.1:62520_    ] o.a.s.c.c.ZkStateReader Updated live nodes from ZooKeeper... (3) -> (4)
   [junit4]   2> 3316590 INFO  (zkCallback-6208-thread-1-processing-n:127.0.0.1:62535_) [n:127.0.0.1:62535_    ] o.a.s.c.c.ZkStateReader Updated live nodes from ZooKeeper... (3) -> (4)
   [junit4]   2> 3316590 INFO  (zkCallback-6201-thread-1-processing-n:127.0.0.1:62529_) [n:127.0.0.1:62529_    ] o.a.s.c.c.ZkStateReader Updated live nodes from ZooKeeper... (3) -> (4)
   [junit4]   2> 3316590 INFO  (zkCallback-6183-thread-1-processing-n:127.0.0.1:62489_) [n:127.0.0.1:62489_    ] o.a.s.c.c.ZkStateReader Updated live nodes from ZooKeeper... (3) -> (4)
   [junit4]   2> 3316681 INFO  (TEST-TestInPlaceUpdatesDistrib.test-seed#[A15276089B5A1BC7]) [n:127.0.0.1:62535_    ] o.a.s.m.r.SolrJmxReporter JMX monitoring for 'solr.node' (registry 'solr.node') enabled at server: com.sun.jmx.mbeanserver.JmxMBeanServer@7b282cef
   [junit4]   2> 3316690 INFO  (TEST-TestInPlaceUpdatesDistrib.test-seed#[A15276089B5A1BC7]) [n:127.0.0.1:62535_    ] o.a.s.m.r.SolrJmxReporter JMX monitoring for 'solr.jvm' (registry 'solr.jvm') enabled at server: com.sun.jmx.mbeanserver.JmxMBeanServer@7b282cef
   [junit4]   2> 3316690 INFO  (TEST-TestInPlaceUpdatesDistrib.test-seed#[A15276089B5A1BC7]) [n:127.0.0.1:62535_    ] o.a.s.m.r.SolrJmxReporter JMX monitoring for 'solr.jetty' (registry 'solr.jetty') enabled at server: com.sun.jmx.mbeanserver.JmxMBeanServer@7b282cef
   [junit4]   2> 3316692 INFO  (TEST-TestInPlaceUpdatesDistrib.test-seed#[A15276089B5A1BC7]) [n:127.0.0.1:62535_    ] o.a.s.c.CorePropertiesLocator Found 0 core definitions underneath /Users/jenkins/workspace/Lucene-Solr-7.x-MacOSX/solr/build/solr-core/test/J1/temp/solr.update.TestInPlaceUpdatesDistrib_A15276089B5A1BC7-001/shard-3-001/cores
   [junit4]   2> 3316733 INFO  (qtp1273987890-31637) [n:127.0.0.1:62489_    ] o.a.s.h.a.CollectionsHandler Invoked Collection Action :addreplica with params node=127.0.0.1:62535_&action=ADDREPLICA&collection=collection1&shard=shard1&type=TLOG&wt=javabin&version=2 and sendToOCPQueue=true
   [junit4]   2> 3316736 INFO  (OverseerCollectionConfigSetProcessor-98696304593862660-127.0.0.1:62489_-n_0000000000) [n:127.0.0.1:62489_    ] o.a.s.c.OverseerTaskQueue Response ZK path: /overseer/collection-queue-work/qnr-0000000006 doesn't exist.  Requestor may have disconnected from ZooKeeper
   [junit4]   2> 3316737 INFO  (OverseerThreadFactory-13809-thread-5-processing-n:127.0.0.1:62489_) [n:127.0.0.1:62489_    ] o.a.s.c.AddReplicaCmd Node Identified 127.0.0.1:62535_ for creating new replica
   [junit4]   2> 3316746 INFO  (qtp439588170-31741) [n:127.0.0.1:62535_    ] o.a.s.h.a.CoreAdminOperation core create command qt=/admin/cores&collection.configName=conf1&name=collection1_shard1_replica_t25&action=CREATE&collection=collection1&shard=shard1&wt=javabin&version=2&replicaType=TLOG
   [junit4]   2> 3316747 INFO  (qtp439588170-31741) [n:127.0.0.1:62535_    ] o.a.s.c.TransientSolrCoreCacheDefault Allocating transient cache for 4 transient cores
   [junit4]   2> 3316859 INFO  (zkCallback-6195-thread-1-processing-n:127.0.0.1:62520_) [n:127.0.0.1:62520_    ] o.a.s.c.c.ZkStateReader A cluster state change: [WatchedEvent state:SyncConnected type:NodeDataChanged path:/collections/collection1/state.json] for collection [collection1] has occurred - updating... (live nodes size: [4])
   [junit4]   2> 3316859 INFO  (zkCallback-6208-thread-1-processing-n:127.0.0.1:62535_) [n:127.0.0.1:62535_    ] o.a.s.c.c.ZkStateReader A cluster state change: [WatchedEvent state:SyncConnected type:NodeDataChanged path:/collections/collection1/state.json] for collection [collection1] has occurred - updating... (live nodes size: [4])
   [junit4]   2> 3316859 INFO  (zkCallback-6201-thread-1-processing-n:127.0.0.1:62529_) [n:127.0.0.1:62529_    ] o.a.s.c.c.ZkStateReader A cluster state change: [WatchedEvent state:SyncConnected type:NodeDataChanged path:/collections/collection1/state.json] for collection [collection1] has occurred - updating... (live nodes size: [4])
   [junit4]   2> 3317319 INFO  (qtp2078430411-31680) [n:127.0.0.1:62520_    ] o.a.s.h.a.PrepRecoveryOp In WaitForState(recovering): collection=collection1, shard=shard1, thisCore=collection1_shard1_replica_t21, leaderDoesNotNeedRecovery=false, isLeader? true, live=true, checkLive=true, currentState=recovering, localState=active, nodeName=127.0.0.1:62529_, coreNodeName=core_node24, onlyIfActiveCheckResult=false, nodeProps: core_node24:{"core":"collection1_shard1_replica_t23","base_url":"http://127.0.0.1:62529","node_name":"127.0.0.1:62529_","state":"recovering","type":"TLOG"}
   [junit4]   2> 3317319 INFO  (qtp2078430411-31680) [n:127.0.0.1:62520_    ] o.a.s.h.a.PrepRecoveryOp Waited coreNodeName: core_node24, state: recovering, checkLive: true, onlyIfLeader: true for: 1 seconds.
   [junit4]   2> 3317319 INFO  (qtp2078430411-31680) [n:127.0.0.1:62520_    ] o.a.s.s.HttpSolrCall [admin] webapp=null path=/admin/cores params={nodeName=127.0.0.1:62529_&onlyIfLeaderActive=true&core=collection1_shard1_replica_t21&coreNodeName=core_node24&action=PREPRECOVERY&checkLive=true&state=recovering&onlyIfLeader=true&wt=javabin&version=2} status=0 QTime=1010
   [junit4]   2> 3317773 INFO  (qtp439588170-31741) [n:127.0.0.1:62535_ c:collection1 s:shard1  x:collection1_shard1_replica_t25] o.a.s.c.SolrConfig Using Lucene MatchVersion: 7.1.0
   [junit4]   2> 3317779 INFO  (qtp439588170-31741) [n:127.0.0.1:62535_ c:collection1 s:shard1  x:collection1_shard1_replica_t25] o.a.s.s.IndexSchema [collection1_shard1_replica_t25] Schema name=inplace-updates
   [junit4]   2> 3317810 INFO  (qtp439588170-31741) [n:127.0.0.1:62535_ c:collection1 s:shard1  x:collection1_shard1_replica_t25] o.a.s.s.IndexSchema Loaded schema inplace-updates/1.6 with uniqueid field id
   [junit4]   2> 3317810 INFO  (qtp439588170-31741) [n:127.0.0.1:62535_ c:collection1 s:shard1  x:collection1_shard1_replica_t25] o.a.s.c.CoreContainer Creating SolrCore 'collection1_shard1_replica_t25' using configuration from collection collection1, trusted=true
   [junit4]   2> 3317810 INFO  (qtp439588170-31741) [n:127.0.0.1:62535_ c:collection1 s:shard1  x:collection1_shard1_replica_t25] o.a.s.m.r.SolrJmxReporter JMX monitoring for 'solr.core.collection1.shard1.replica_t25' (registry 'solr.core.collection1.shard1.replica_t25') enabled at server: com.sun.jmx.mbeanserver.JmxMBeanServer@7b282cef
   [junit4]   2> 3317811 INFO  (qtp439588170-31741) [n:127.0.0.1:62535_ c:collection1 s:shard1  x:collection1_shard1_replica_t25] o.a.s.c.SolrCore solr.RecoveryStrategy.Builder
   [junit4]   2> 3317811 INFO  (qtp439588170-31741) [n:127.0.0.1:62535_ c:collection1 s:shard1  x:collection1_shard1_replica_t25] o.a.s.c.SolrCore [[collection1_shard1_replica_t25] ] Opening new SolrCore at [/Users/jenkins/workspace/Lucene-Solr-7.x-MacOSX/solr/build/solr-core/test/J1/temp/solr.update.TestInPlaceUpdatesDistrib_A15276089B5A1BC7-001/shard-3-001/cores/collection1_shard1_replica_t25], dataDir=[/Users/jenkins/workspace/Lucene-Solr-7.x-MacOSX/solr/build/solr-core/test/J1/temp/solr.update.TestInPlaceUpdatesDistrib_A15276089B5A1BC7-001/shard-3-001/cores/collection1_shard1_replica_t25/data/]
   [junit4]   2> 3317817 WARN  (qtp439588170-31741) [n:127.0.0.1:62535_ c:collection1 s:shard1  x:collection1_shard1_replica_t25] o.a.s.c.RequestHandlers INVALID paramSet a in requestHandler {type = requestHandler,name = /dump,class = DumpRequestHandler,attributes = {initParams=a, name=/dump, class=DumpRequestHandler},args = {defaults={a=A,b=B}}}
   [junit4]   2> 3317820 INFO  (recoveryExecutor-6199-thread-1-processing-n:127.0.0.1:62529_ x:collection1_shard1_replica_t23 s:shard1 c:collection1 r:core_node24) [n:127.0.0.1:62529_ c:collection1 s:shard1 r:core_node24 x:collection1_shard1_replica_t23] o.a.s.c.RecoveryStrategy Starting Replication Recovery.
   [junit4]   2> 3317820 INFO  (recoveryExecutor-6199-thread-1-processing-n:127.0.0.1:62529_ x:collection1_shard1_replica_t23 s:shard1 c:collection1 r:core_node24) [n:127.0.0.1:62529_ c:collection1 s:shard1 r:core_node24 x:collection1_shard1_replica_t23] o.a.s.c.RecoveryStrategy Attempting to replicate from [http://127.0.0.1:62520/collection1_shard1_replica_t21/].
   [junit4]   2> 3317824 INFO  (qtp2078430411-31683) [n:127.0.0.1:62520_ c:collection1 s:shard1 r:core_node22 x:collection1_shard1_replica_t21] o.a.s.u.DirectUpdateHandler2 start commit{_version_=1579140882815254528,optimize=false,openSearcher=false,waitSearcher=true,expungeDeletes=false,softCommit=false,prepareCommit=false}
   [junit4]   2> 3317824 INFO  (qtp2078430411-31683) [n:127.0.0.1:62520_ c:collection1 s:shard1 r:core_node22 x:collection1_shard1_replica_t21] o.a.s.u.DirectUpdateHandler2 No uncommitted changes. Skipping IW.commit.
   [junit4]   2> 3317824 INFO  (qtp2078430411-31683) [n:127.0.0.1:62520_ c:collection1 s:shard1 r:core_node22 x:collection1_shard1_replica_t21] o.a.s.u.DirectUpdateHandler2 end_commit_flush
   [junit4]   2> 3317824 INFO  (qtp2078430411-31683) [n:127.0.0.1:62520_ c:collection1 s:shard1 r:core_node22 x:collection1_shard1_replica_t21] o.a.s.u.p.LogUpdateProcessorFactory [collection1_shard1_replica_t21]  webapp= path=/update params={waitSearcher=true&openSearcher=false&commit=true&softCommit=false&commit_end_point=true&wt=javabin&version=2}{commit=} 0 0
   [junit4]   2> 3317827 INFO  (qtp2078430411-31676) [n:127.0.0.1:62520_ c:collection1 s:shard1 r:core_node22 x:collection1_shard1_replica_t21] o.a.s.c.S.Request [collection1_shard1_replica_t21]  webapp= path=/replication params={qt=/replication&wt=javabin&version=2&command=indexversion} status=0 QTime=0
   [junit4]   2> 3317827 INFO  (recoveryExecutor-6199-thread-1-processing-n:127.0.0.1:62529_ x:collection1_shard1_replica_t23 s:shard1 c:collection1 r:core_node24) [n:127.0.0.1:62529_ c:collection1 s:shard1 r:core_node24 x:collection1_shard1_replica_t23] o.a.s.h.IndexFetcher Master's generation: 1
   [junit4]   2> 3317827 INFO  (recoveryExecutor-6199-thread-1-processing-n:127.0.0.1:62529_ x:collection1_shard1_replica_t23 s:shard1 c:collection1 r:core_node24) [n:127.0.0.1:62529_ c:collection1 s:shard1 r:core_node24 x:collection1_shard1_replica_t23] o.a.s.h.IndexFetcher Master's version: 0
   [junit4]   2> 3317827 INFO  (recoveryExecutor-6199-thread-1-processing-n:127.0.0.1:62529_ x:collection1_shard1_replica_t23 s:shard1 c:collection1 r:core_node24) [n:127.0.0.1:62529_ c:collection1 s:shard1 r:core_node24 x:collection1_shard1_replica_t23] o.a.s.h.IndexFetcher Slave's generation: 1
   [junit4]   2> 3317827 INFO  (recoveryExecutor-6199-thread-1-processing-n:127.0.0.1:62529_ x:collection1_shard1_replica_t23 s:shard1 c:collection1 r:core_node24) [n:127.0.0.1:62529_ c:collection1 s:shard1 r:core_node24 x:collection1_shard1_replica_t23] o.a.s.h.IndexFetcher Slave's version: 0
   [junit4]   2> 3317827 INFO  (recoveryExecutor-6199-thread-1-processing-n:127.0.0.1:62529_ x:collection1_shard1_replica_t23 s:shard1 c:collection1 r:core_node24) [n:127.0.0.1:62529_ c:collection1 s:shard1 r:core_node24 x:collection1_shard1_replica_t23] o.a.s.c.RecoveryStrategy Replication Recovery was successful.
   [junit4]   2> 3317827 INFO  (recoveryExecutor-6199-thread-1-processing-n:127.0.0.1:62529_ x:collection1_shard1_replica_t23 s:shard1 c:collection1 r:core_node24) [n:127.0.0.1:62529_ c:collection1 s:shard1 r:core_node24 x:collection1_shard1_replica_t23] o.a.s.c.RecoveryStrategy Registering as Active after recovery.
   [junit4]   2> 3317828 INFO  (recoveryExecutor-6199-thread-1-processing-n:127.0.0.1:62529_ x:collection1_shard1_replica_t23 s:shard1 c:collection1 r:core_node24) [n:127.0.0.1:62529_ c:collection1 s:shard1 r:core_node24 x:collection1_shard1_replica_t23] o.a.s.c.ZkController collection1_shard1_replica_t23 starting background replication from leader
   [junit4]   2> 3317828 INFO  (recoveryExecutor-6199-thread-1-processing-n:127.0.0.1:62529_ x:collection1_shard1_replica_t23 s:shard1 c:collection1 r:core_node24) [n:127.0.0.1:62529_ c:collection1 s:shard1 r:core_node24 x:collection1_shard1_replica_t23] o.a.s.c.ReplicateFromLeader Will start replication from leader with poll interval: 00:00:03
   [junit4]   2> 3317829 INFO  (recoveryExecutor-6199-thread-1-processing-n:127.0.0.1:62529_ x:collection1_shard1_replica_t23 s:shard1 c:collection1 r:core_node24) [n:127.0.0.1:62529_ c:collection1 s:shard1 r:core_node24 x:collection1_shard1_replica_t23] o.a.s.h.ReplicationHandler Poll scheduled at an interval of 3000ms
   [junit4]   2> 3317830 INFO  (recoveryExecutor-6199-thread-1-processing-n:127.0.0.1:62529_ x:collection1_shard1_replica_t23 s:shard1 c:collection1 r:core_node24) [n:127.0.0.1:62529_ c:collection1 s:shard1 r:core_node24 x:collection1_shard1_replica_t23] o.a.s.c.RecoveryStrategy Updating version bucket highest from index after successful recovery.
   [junit4]   2> 3317830 INFO  (recoveryExecutor-6199-thread-1-processing-n:127.0.0.1:62529_ x:collection1_shard1_replica_t23 s:shard1 c:collection1 r:core_node24) [n:127.0.0.1:62529_ c:collection1 s:shard1 r:core_node24 x:collection1_shard1_replica_t23] o.a.s.u.UpdateLog Could not find max version in index or recent updates, using new clock 1579140882821545984
   [junit4]   2> 3317831 INFO  (recoveryExecutor-6199-thread-1-processing-n:127.0.0.1:62529_ x:collection1_shard1_replica_t23 s:shard1 c:collection1 r:core_node24) [n:127.0.0.1:62529_ c:collection1 s:shard1 r:core_node24 x:collection1_shard1_replica_t23] o.a.s.c.RecoveryStrategy Finished recovery process, successful=[true]
   [junit4]   2> 3317872 INFO  (qtp439588170-31741) [n:127.0.0.1:62535_ c:collection1 s:shard1  x:collection1_shard1_replica_t25] o.a.s.u.UpdateHandler Using UpdateLog implementation: org.apache.solr.update.UpdateLog
   [junit4]   2> 3317872 INFO  (qtp439588170-31741) [n:127.0.0.1:62535_ c:collection1 s:shard1  x:collection1_shard1_replica_t25] o.a.s.u.UpdateLog Initializing UpdateLog: dataDir= defaultSyncLevel=FLUSH numRecordsToKeep=100 maxNumLogsToKeep=10 numVersionBuckets=65536
   [junit4]   2> 3317874 INFO  (qtp439588170-31741) [n:127.0.0.1:62535_ c:collection1 s:shard1  x:collection1_shard1_replica_t25] o.a.s.u.CommitTracker Hard AutoCommit: disabled
   [junit4]   2> 3317874 INFO  (qtp439588170-31741) [n:127.0.0.1:62535_ c:collection1 s:shard1  x:collection1_shard1_replica_t25] o.a.s.u.CommitTracker Soft AutoCommit: disabled
   [junit4]   2> 3317875 INFO  (qtp439588170-31741) [n:127.0.0.1:62535_ c:collection1 s:shard1  x:collection1_shard1_replica_t25] o.a.s.s.SolrIndexSearcher Opening [Searcher@174aa010[collection1_shard1_replica_t25] main]
   [junit4]   2> 3317877 INFO  (qtp439588170-31741) [n:127.0.0.1:62535_ c:collection1 s:shard1  x:collection1_shard1_replica_t25] o.a.s.r.ManagedResourceStorage Configured ZooKeeperStorageIO with znodeBase: /configs/conf1
   [junit4]   2> 3317877 INFO  (qtp439588170-31741) [n:127.0.0.1:62535_ c:collection1 s:shard1  x:collection1_shard1_replica_t25] o.a.s.r.ManagedResourceStorage Loaded null at path _rest_managed.json using ZooKeeperStorageIO:path=/configs/conf1
   [junit4]   2> 3317878 INFO  (qtp439588170-31741) [n:127.0.0.1:62535_ c:collection1 s:shard1  x:collection1_shard1_replica_t25] o.a.s.h.ReplicationHandler Commits will be reserved for  10000
   [junit4]   2> 3317878 INFO  (qtp439588170-31741) [n:127.0.0.1:62535_ c:collection1 s:shard1  x:collection1_shard1_replica_t25] o.a.s.u.UpdateLog Could not find max version in index or recent updates, using new clock 1579140882871877632
   [junit4]   2> 3317879 INFO  (searcherExecutor-13845-thread-1-processing-n:127.0.0.1:62535_ x:collection1_shard1_replica_t25 s:shard1 c:collection1) [n:127.0.0.1:62535_ c:collection1 s:shard1  x:collection1_shard1_replica_t25] o.a.s.c.SolrCore [collection1_shard1_replica_t25] Registered new searcher Searcher@174aa010[collection1_shard1_replica_t25] main{ExitableDirectoryReader(UninvertingDirectoryReader())}
   [junit4]   2> 3317882 INFO  (qtp439588170-31741) [n:127.0.0.1:62535_ c:collection1 s:shard1  x:collection1_shard1_replica_t25] o.a.s.c.ZkController Core needs to recover:collection1_shard1_replica_t25
   [junit4]   2> 3317882 INFO  (updateExecutor-6205-thread-1-processing-n:127.0.0.1:62535_ x:collection1_shard1_replica_t25 s:shard1 c:collection1) [n:127.0.0.1:62535_ c:collection1 s:shard1 r:core_node26 x:collection1_shard1_replica_t25] o.a.s.u.DefaultSolrCoreState Running recovery
   [junit4]   2> 3317882 INFO  (qtp439588170-31741) [n:127.0.0.1:62535_ c:collection1 s:shard1  x:collection1_shard1_replica_t25] o.a.s.s.HttpSolrCall [admin] webapp=null path=/admin/cores params={qt=/admin/cores&collection.configName=conf1&name=collection1_shard1_replica_t25&action=CREATE&collection=collection1&shard=shard1&wt=javabin&version=2&replicaType=TLOG} status=0 QTime=1136
   [junit4]   2> 3317882 INFO  (recoveryExecutor-6206-thread-1-processing-n:127.0.0.1:62535_ x:collection1_shard1_replica_t25 s:shard1 c:collection1 r:core_node26) [n:127.0.0.1:62535_ c:collection1 s:shard1 r:core_node26 x:collection1_shard1_replica_t25] o.a.s.c.RecoveryStrategy Starting recovery process. recoveringAfterStartup=true
   [junit4]   2> 3317882 INFO  (recoveryExecutor-6206-thread-1-processing-n:127.0.0.1:62535_ x:collection1_shard1_replica_t25 s:shard1 c:collection1 r:core_node26) [n:127.0.0.1:62535_ c:collection1 s:shard1 r:core_node26 x:collection1_shard1_replica_t25] o.a.s.c.RecoveryStrategy ###### startupVersions=[[]]
   [junit4]   2> 3317882 INFO  (recoveryExecutor-6206-thread-1-processing-n:127.0.0.1:62535_ x:collection1_shard1_replica_t25 s:shard1 c:collection1 r:core_node26) [n:127.0.0.1:62535_ c:collection1 s:shard1 r:core_node26 x:collection1_shard1_replica_t25] o.a.s.c.ZkController collection1_shard1_replica_t25 stopping background replication from leader
   [junit4]   2> 3317882 INFO  (recoveryExecutor-6206-thread-1-processing-n:127.0.0.1:62535_ x:collection1_shard1_replica_t25 s:shard1 c:collection1 r:core_node26) [n:127.0.0.1:62535_ c:collection1 s:shard1 r:core_node26 x:collection1_shard1_replica_t25] o.a.s.c.RecoveryStrategy Begin buffering updates. core=[collection1_shard1_replica_t25]
   [junit4]   2> 3317883 INFO  (recoveryExecutor-6206-thread-1-processing-n:127.0.0.1:62535_ x:collection1_shard1_replica_t25 s:shard1 c:collection1 r:core_node26) [n:127.0.0.1:62535_ c:collection1 s:shard1 r:core_node26 x:collection1_shard1_replica_t25] o.a.s.u.UpdateLog Starting to buffer updates. FSUpdateLog{state=ACTIVE, tlog=null}
   [junit4]   2> 3317883 INFO  (recoveryExecutor-6206-thread-1-processing-n:127.0.0.1:62535_ x:collection1_shard1_replica_t25 s:shard1 c:collection1 r:core_node26) [n:12

[...truncated too long message...]

ry), id=DocValuesFormat(name=Lucene70), inplace_updatable_int_with_default=DocValuesFormat(name=Memory), inplace_updatable_int=DocValuesFormat(name=Lucene70), inplace_updatable_float_with_default=DocValuesFormat(name=Lucene70)}, maxPointsInLeafNode=1646, maxMBSortInHeap=7.046437581694667, sim=RandomSimilarity(queryNorm=false): {}, locale=es-GT, timezone=Asia/Barnaul
   [junit4]   2> NOTE: Mac OS X 10.11.6 x86_64/Oracle Corporation 1.8.0_144 (64-bit)/cpus=3,threads=1,free=301688248,total=536870912
   [junit4]   2> NOTE: All tests run in this JVM: [PeerSyncWithIndexFingerprintCachingTest, TestFastOutputStream, TestCloudInspectUtil, TestPayloadCheckQParserPlugin, SolrCloudReportersTest, TestBlendedInfixSuggestions, DocExpirationUpdateProcessorFactoryTest, ClassificationUpdateProcessorTest, SolrCoreCheckLockOnStartupTest, TestRemoteStreaming, TestSolrDeletionPolicy1, QueryResultKeyTest, TestJsonFacets, TestImpersonationWithHadoopAuth, TestQueryWrapperFilter, FileUtilsTest, TestCoreDiscovery, FullSolrCloudDistribCmdsTest, ShardRoutingCustomTest, RequestLoggingTest, TestReqParamsAPI, DeleteLastCustomShardedReplicaTest, SaslZkACLProviderTest, DocumentBuilderTest, DocumentAnalysisRequestHandlerTest, CollectionsAPIDistributedZkTest, TestCloudSchemaless, SolrPluginUtilsTest, DeleteStatusTest, TestZkChroot, TestComponentsName, TestLRUCache, BigEndianAscendingWordSerializerTest, TestHdfsUpdateLog, TestSchemaNameResource, ConvertedLegacyTest, BadComponentTest, TestTlogReplica, TestOnReconnectListenerSupport, TestSolrQueryParser, CollectionsAPIAsyncDistributedZkTest, SOLR749Test, VersionInfoTest, ZkFailoverTest, TestIndexSearcher, TestCloudPivotFacet, TriLevelCompositeIdRoutingTest, TestBM25SimilarityFactory, TestConfigOverlay, TestSolrCloudSnapshots, CurrencyFieldTypeTest, MoveReplicaTest, TestMissingGroups, LukeRequestHandlerTest, TestCollectionsAPIViaSolrCloudCluster, AssignTest, TestAuthenticationFramework, TestDistribIDF, TestRangeQuery, SpellPossibilityIteratorTest, TestSSLRandomization, ZkStateWriterTest, TestCryptoKeys, TestSystemIdResolver, TestBulkSchemaConcurrent, TestLMJelinekMercerSimilarityFactory, LargeFieldTest, TestBlobHandler, TestLuceneMatchVersion, LeaderElectionIntegrationTest, HdfsNNFailoverTest, TestScoreJoinQPScore, ExitableDirectoryReaderTest, TestPullReplica, TestStandardQParsers, TestNamedUpdateProcessors, SignatureUpdateProcessorFactoryTest, BlockJoinFacetRandomTest, SpellingQueryConverterTest, MigrateRouteKeyTest, TestCustomSort, TestFieldTypeCollectionResource, TestPointFields, BufferStoreTest, TestSmileRequest, InfoHandlerTest, CachingDirectoryFactoryTest, TestNRTOpen, DebugComponentTest, TestSuggestSpellingConverter, TestSubQueryTransformerDistrib, TestPushWriter, TestHdfsBackupRestoreCore, TestFiltering, TestTrie, DistributedFacetPivotSmallTest, TestDistributedMissingSort, AliasIntegrationTest, TestNumericTerms64, TestCloudRecovery, BooleanFieldTest, TestSolrCloudWithDelegationTokens, JSONWriterTest, TestSolrJ, TermVectorComponentDistributedTest, TestRecovery, TestDocumentBuilder, DistribDocExpirationUpdateProcessorTest, DistributedTermsComponentTest, ShufflingReplicaListTransformerTest, TestHttpShardHandlerFactory, NodeMutatorTest, ExternalFileFieldSortTest, TestDynamicLoading, TestRecoveryHdfs, TestSchemaSimilarityResource, PluginInfoTest, TestTestInjection, TestIntervalFaceting, DirectSolrSpellCheckerTest, ChaosMonkeyNothingIsSafeWithPullReplicasTest, ReplicationFactorTest, CustomCollectionTest, TestSlowCompositeReaderWrapper, TestClusterStateMutator, TestCollationField, BadIndexSchemaTest, UUIDUpdateProcessorFallbackTest, SampleTest, TestFastLRUCache, TestSubQueryTransformer, TestRealTimeGet, HdfsTlogReplayBufferedWhileIndexingTest, SolrMetricsIntegrationTest, SchemaVersionSpecificBehaviorTest, SolrMetricManagerTest, TestSolrQueryResponse, IndexSchemaRuntimeFieldTest, TestClusterProperties, DOMUtilTest, MoreLikeThisHandlerTest, BlobRepositoryCloudTest, TestCorePropertiesReload, SpellCheckCollatorWithCollapseTest, TestExclusionRuleCollectionAccess, TestShortCircuitedRequests, LeaderFailoverAfterPartitionTest, TestFieldCacheSort, TestEmbeddedSolrServerAdminHandler, TestQueryUtils, TestLegacyNumericUtils, TestSQLHandler, DistributedIntervalFacetingTest, SolrCloudExampleTest, TestInPlaceUpdatesStandalone, TestFastWriter, BasicFunctionalityTest, PropertiesRequestHandlerTest, TestSolrCloudWithSecureImpersonation, TestBinaryResponseWriter, TestConfigsApi, DistributedQueryComponentCustomSortTest, DocValuesMultiTest, AtomicUpdateProcessorFactoryTest, MetricsConfigTest, TestApiFramework, TestComplexPhraseLeadingWildcard, HdfsWriteToMultipleCollectionsTest, PeerSyncReplicationTest, TestPartialUpdateDeduplication, DistributedMLTComponentTest, TestShardHandlerFactory, LoggingHandlerTest, SuggesterTSTTest, TestRequestForwarding, TestLockTree, TestAnalyzedSuggestions, MoveReplicaHDFSTest, ChaosMonkeySafeLeaderTest, BasicDistributedZk2Test, UnloadDistributedZkTest, OpenCloseCoreStressTest, BasicZkTest, RecoveryZkTest, TestReplicationHandler, TestRandomDVFaceting, AutoCommitTest, DistributedSpellCheckComponentTest, TestStressVersions, HardAutoCommitTest, TestSolr4Spatial, SpellCheckComponentTest, TestGroupingSearch, SolrCmdDistributorTest, QueryElevationComponentTest, TestSort, TestFunctionQuery, TestLazyCores, ShowFileRequestHandlerTest, DistributedQueryElevationComponentTest, SpellCheckCollatorTest, SuggesterFSTTest, CoreAdminHandlerTest, SolrRequestParserTest, SuggesterTest, TestStressLucene, SpatialFilterTest, SuggesterWFSTTest, TestCSVLoader, PolyFieldTest, NoCacheHeaderTest, FieldMutatingUpdateProcessorTest, TestAtomicUpdateErrorCases, TestWordDelimiterFilterFactory, QueryEqualityTest, DirectUpdateHandlerOptimizeTest, StatelessScriptUpdateProcessorFactoryTest, DistanceFunctionTest, SolrInfoBeanTest, XsltUpdateRequestHandlerTest, CacheHeaderTest, IndexBasedSpellCheckerTest, TestSurroundQueryParser, TestReversedWildcardFilterFactory, TestQueryTypes, PrimitiveFieldTypeTest, TestOmitPositions, FileBasedSpellCheckerTest, TermsComponentTest, RequestHandlersTest, TestValueSourceCache, TermVectorComponentTest, FastVectorHighlighterTest, IndexSchemaTest, UpdateRequestProcessorFactoryTest, TestCSVResponseWriter, MBeansHandlerTest, TestMergePolicyConfig, TestSolrDeletionPolicy2, MultiTermTest, TestDocSet, TestSearchPerf, MinimalSchemaTest, TestElisionMultitermQuery, TestConfig, TestPostingsSolrHighlighter, NotRequiredUniqueKeyTest, TestPhraseSuggestions, TestCharFilters, SynonymTokenizerTest, EchoParamsTest, TestSweetSpotSimilarityFactory, TestDFRSimilarityFactory, TestPerFieldSimilarity, TestLMDirichletSimilarityFactory, OpenExchangeRatesOrgProviderTest, ChaosMonkeyNothingIsSafeTest, RAMDirectoryFactoryTest, ClusterStateTest, ZkNodePropsTest, CircularListTest, TestRTGBase, TestCrossCoreJoin, TestSimpleTrackingShardHandler, ActionThrottleTest, CdcrReplicationDistributedZkTest, CdcrReplicationHandlerTest, CdcrRequestHandlerTest, CdcrVersionReplicationTest, CleanupOldIndexTest, ConcurrentDeleteAndCreateCollectionTest, ConfigSetsAPITest, ConnectionManagerTest, DeleteReplicaTest, DistributedVersionInfoTest, HttpPartitionTest, LeaderInitiatedRecoveryOnCommitTest, OverseerRolesTest, OverseerStatusTest, RemoteQueryErrorTest, RestartWhileUpdatingTest, RollingRestartTest, SharedFSAutoReplicaFailoverTest, SharedFSAutoReplicaFailoverUtilsTest, SimpleCollectionCreateDeleteTest, TestCloudSearcherWarming, TestConfigSetsAPI, TestConfigSetsAPIExclusivity, TestDeleteCollectionOnDownNodes, TestDistribDocBasedVersion, TestDownShardTolerantSearch, TestLeaderElectionWithEmptyReplica, TestLocalFSCloudBackupRestore, TestMiniSolrCloudClusterSSL, TestSegmentSorting, TestStressInPlaceUpdates, HdfsBasicDistributedZk2Test, HdfsBasicDistributedZkTest, HdfsChaosMonkeyNothingIsSafeTest, HdfsChaosMonkeySafeLeaderTest, HdfsRecoveryZkTest, HdfsSyncSliceTest, HdfsUnloadDistributedZkTest, ImplicitSnitchTest, RuleEngineTest, CoreSorterTest, TestConfigSetProperties, TestConfigSets, TestInfoStreamLogging, TestInitParams, TestReloadAndDeleteDocs, TestSolrConfigHandler, SearchHandlerTest, TestConfigReload, TestSystemCollAutoCreate, V2ApiIntegrationTest, V2StandaloneTest, CoreAdminRequestStatusTest, DistributedExpandComponentTest, DistributedFacetPivotLongTailTest, DistributedSuggestComponentTest, SuggestComponentContextFilterQueryTest, SuggestComponentTest, TestDistributedStatsComponentCardinality, JavabinLoaderTest, HighlighterMaxOffsetTest, TestUnifiedSolrHighlighter, UninvertDocValuesMergePolicyTest, WrapperMergePolicyFactoryTest, CheckHdfsIndexTest, TestLegacyField, TestLegacyFieldReuse, TestMultiValuedNumericRangeQuery, TestNumericRangeQuery32, TestNumericRangeQuery64, TestNumericTokenStream, JvmMetricsTest, SolrGraphiteReporterTest, SolrJmxReporterTest, SubstringBytesRefFilterTest, TestStreamBody, TestExportWriter, TestRetrieveFieldsOptimizer, TestSubQueryTransformerCrossCore, TestManagedResource, TestBulkSchemaAPI, ChangedSchemaMergeTest, DocValuesMissingTest, ManagedSchemaRoundRobinCloudTest, TestCollationFieldDocValues, TestHalfAndHalfDocValues, TestManagedSchemaAPI, TestManagedSchemaThreadSafety, TestSchemaManager, TestSchemalessBufferedUpdates, TestUseDocValuesAsStored2, AnalyticsMergeStrategyTest, TestOrdValues, TestSortByMinMaxFunction, BJQParserTest, TestCloudNestedDocsSort, SimpleMLTQParserTest, TestClassicSimilarityFactory, TestNonDefinedSimilarityFactory, TestDefaultStatsCache, TestExactStatsCache, PKIAuthenticationIntegrationTest, TestPKIAuthenticationPlugin, TestRuleBasedAuthorizationPlugin, TestSha256AuthenticationProvider, TestDelegationWithHadoopAuth, TestSolrCloudWithHadoopAuthPlugin, ResponseHeaderTest, TestFreeTextSuggestions, TestFieldCacheReopen, TestFieldCacheSortRandom, TestLegacyFieldCache, TestNumericTerms32, TestUninvertingReader, AddBlockUpdateTest, TestExceedMaxTermLength, TestInPlaceUpdatesDistrib]
   [junit4] Completed [732/732 (1!)] on J1 in 203.46s, 1 test, 1 failure <<< FAILURES!

[...truncated 46350 lines...]

[JENKINS] Lucene-Solr-7.x-MacOSX (64bit/jdk1.8.0) - Build # 200 - Still Unstable!

Posted by Policeman Jenkins Server <je...@thetaphi.de>.
Build: https://jenkins.thetaphi.de/job/Lucene-Solr-7.x-MacOSX/200/
Java: 64bit/jdk1.8.0 -XX:-UseCompressedOops -XX:+UseSerialGC

3 tests failed.
FAILED:  org.apache.solr.security.BasicAuthIntegrationTest.testBasicAuth

Error Message:
Too many open files

Stack Trace:
java.net.SocketException: Too many open files
	at __randomizedtesting.SeedInfo.seed([F41D92893DF2B0AB:4873E49B99A133D1]:0)
	at java.net.Socket.createImpl(Socket.java:460)
	at java.net.Socket.getImpl(Socket.java:520)
	at java.net.Socket.setSoTimeout(Socket.java:1141)
	at org.apache.http.impl.conn.DefaultHttpClientConnectionOperator.connect(DefaultHttpClientConnectionOperator.java:120)
	at org.apache.http.impl.conn.PoolingHttpClientConnectionManager.connect(PoolingHttpClientConnectionManager.java:359)
	at org.apache.http.impl.execchain.MainClientExec.establishRoute(MainClientExec.java:381)
	at org.apache.http.impl.execchain.MainClientExec.execute(MainClientExec.java:237)
	at org.apache.http.impl.execchain.ProtocolExec.execute(ProtocolExec.java:185)
	at org.apache.http.impl.execchain.RetryExec.execute(RetryExec.java:89)
	at org.apache.http.impl.execchain.RedirectExec.execute(RedirectExec.java:111)
	at org.apache.http.impl.client.InternalHttpClient.doExecute(InternalHttpClient.java:185)
	at org.apache.http.impl.client.CloseableHttpClient.execute(CloseableHttpClient.java:83)
	at org.apache.http.impl.client.CloseableHttpClient.execute(CloseableHttpClient.java:108)
	at org.apache.http.impl.client.CloseableHttpClient.execute(CloseableHttpClient.java:56)
	at org.apache.solr.security.BasicAuthIntegrationTest.verifySecurityStatus(BasicAuthIntegrationTest.java:261)
	at org.apache.solr.security.BasicAuthIntegrationTest.verifySecurityStatus(BasicAuthIntegrationTest.java:248)
	at org.apache.solr.security.BasicAuthIntegrationTest.testBasicAuth(BasicAuthIntegrationTest.java:108)
	at sun.reflect.NativeMethodAccessorImpl.invoke0(Native Method)
	at sun.reflect.NativeMethodAccessorImpl.invoke(NativeMethodAccessorImpl.java:62)
	at sun.reflect.DelegatingMethodAccessorImpl.invoke(DelegatingMethodAccessorImpl.java:43)
	at java.lang.reflect.Method.invoke(Method.java:498)
	at com.carrotsearch.randomizedtesting.RandomizedRunner.invoke(RandomizedRunner.java:1737)
	at com.carrotsearch.randomizedtesting.RandomizedRunner$8.evaluate(RandomizedRunner.java:934)
	at com.carrotsearch.randomizedtesting.RandomizedRunner$9.evaluate(RandomizedRunner.java:970)
	at com.carrotsearch.randomizedtesting.RandomizedRunner$10.evaluate(RandomizedRunner.java:984)
	at com.carrotsearch.randomizedtesting.rules.SystemPropertiesRestoreRule$1.evaluate(SystemPropertiesRestoreRule.java:57)
	at org.apache.lucene.util.TestRuleSetupTeardownChained$1.evaluate(TestRuleSetupTeardownChained.java:49)
	at org.apache.lucene.util.AbstractBeforeAfterRule$1.evaluate(AbstractBeforeAfterRule.java:45)
	at org.apache.lucene.util.TestRuleThreadAndTestName$1.evaluate(TestRuleThreadAndTestName.java:48)
	at org.apache.lucene.util.TestRuleIgnoreAfterMaxFailures$1.evaluate(TestRuleIgnoreAfterMaxFailures.java:64)
	at org.apache.lucene.util.TestRuleMarkFailure$1.evaluate(TestRuleMarkFailure.java:47)
	at com.carrotsearch.randomizedtesting.rules.StatementAdapter.evaluate(StatementAdapter.java:36)
	at com.carrotsearch.randomizedtesting.ThreadLeakControl$StatementRunner.run(ThreadLeakControl.java:368)
	at com.carrotsearch.randomizedtesting.ThreadLeakControl.forkTimeoutingTask(ThreadLeakControl.java:817)
	at com.carrotsearch.randomizedtesting.ThreadLeakControl$3.evaluate(ThreadLeakControl.java:468)
	at com.carrotsearch.randomizedtesting.RandomizedRunner.runSingleTest(RandomizedRunner.java:943)
	at com.carrotsearch.randomizedtesting.RandomizedRunner$5.evaluate(RandomizedRunner.java:829)
	at com.carrotsearch.randomizedtesting.RandomizedRunner$6.evaluate(RandomizedRunner.java:879)
	at com.carrotsearch.randomizedtesting.RandomizedRunner$7.evaluate(RandomizedRunner.java:890)
	at com.carrotsearch.randomizedtesting.rules.StatementAdapter.evaluate(StatementAdapter.java:36)
	at com.carrotsearch.randomizedtesting.rules.SystemPropertiesRestoreRule$1.evaluate(SystemPropertiesRestoreRule.java:57)
	at org.apache.lucene.util.AbstractBeforeAfterRule$1.evaluate(AbstractBeforeAfterRule.java:45)
	at com.carrotsearch.randomizedtesting.rules.StatementAdapter.evaluate(StatementAdapter.java:36)
	at org.apache.lucene.util.TestRuleStoreClassName$1.evaluate(TestRuleStoreClassName.java:41)
	at com.carrotsearch.randomizedtesting.rules.NoShadowingOrOverridesOnMethodsRule$1.evaluate(NoShadowingOrOverridesOnMethodsRule.java:40)
	at com.carrotsearch.randomizedtesting.rules.NoShadowingOrOverridesOnMethodsRule$1.evaluate(NoShadowingOrOverridesOnMethodsRule.java:40)
	at com.carrotsearch.randomizedtesting.rules.StatementAdapter.evaluate(StatementAdapter.java:36)
	at com.carrotsearch.randomizedtesting.rules.StatementAdapter.evaluate(StatementAdapter.java:36)
	at com.carrotsearch.randomizedtesting.rules.StatementAdapter.evaluate(StatementAdapter.java:36)
	at org.apache.lucene.util.TestRuleAssertionsRequired$1.evaluate(TestRuleAssertionsRequired.java:53)
	at org.apache.lucene.util.TestRuleMarkFailure$1.evaluate(TestRuleMarkFailure.java:47)
	at org.apache.lucene.util.TestRuleIgnoreAfterMaxFailures$1.evaluate(TestRuleIgnoreAfterMaxFailures.java:64)
	at org.apache.lucene.util.TestRuleIgnoreTestSuites$1.evaluate(TestRuleIgnoreTestSuites.java:54)
	at com.carrotsearch.randomizedtesting.rules.StatementAdapter.evaluate(StatementAdapter.java:36)
	at com.carrotsearch.randomizedtesting.ThreadLeakControl$StatementRunner.run(ThreadLeakControl.java:368)
	at java.lang.Thread.run(Thread.java:748)


FAILED:  junit.framework.TestSuite.org.apache.solr.security.BasicAuthIntegrationTest

Error Message:
12 threads leaked from SUITE scope at org.apache.solr.security.BasicAuthIntegrationTest:     1) Thread[id=11691, name=zkCallback-3039-thread-5, state=TIMED_WAITING, group=TGRP-BasicAuthIntegrationTest]         at sun.misc.Unsafe.park(Native Method)         at java.util.concurrent.locks.LockSupport.parkNanos(LockSupport.java:215)         at java.util.concurrent.SynchronousQueue$TransferStack.awaitFulfill(SynchronousQueue.java:460)         at java.util.concurrent.SynchronousQueue$TransferStack.transfer(SynchronousQueue.java:362)         at java.util.concurrent.SynchronousQueue.poll(SynchronousQueue.java:941)         at java.util.concurrent.ThreadPoolExecutor.getTask(ThreadPoolExecutor.java:1073)         at java.util.concurrent.ThreadPoolExecutor.runWorker(ThreadPoolExecutor.java:1134)         at java.util.concurrent.ThreadPoolExecutor$Worker.run(ThreadPoolExecutor.java:624)         at java.lang.Thread.run(Thread.java:748)    2) Thread[id=11672, name=TEST-BasicAuthIntegrationTest.testBasicAuth-seed#[F41D92893DF2B0AB]-EventThread, state=WAITING, group=TGRP-BasicAuthIntegrationTest]         at sun.misc.Unsafe.park(Native Method)         at java.util.concurrent.locks.LockSupport.park(LockSupport.java:175)         at java.util.concurrent.locks.AbstractQueuedSynchronizer$ConditionObject.await(AbstractQueuedSynchronizer.java:2039)         at java.util.concurrent.LinkedBlockingQueue.take(LinkedBlockingQueue.java:442)         at org.apache.zookeeper.ClientCnxn$EventThread.run(ClientCnxn.java:501)    3) Thread[id=11667, name=Connection evictor, state=TIMED_WAITING, group=TGRP-BasicAuthIntegrationTest]         at java.lang.Thread.sleep(Native Method)         at org.apache.http.impl.client.IdleConnectionEvictor$1.run(IdleConnectionEvictor.java:66)         at java.lang.Thread.run(Thread.java:748)    4) Thread[id=11689, name=zkCallback-3039-thread-3, state=TIMED_WAITING, group=TGRP-BasicAuthIntegrationTest]         at sun.misc.Unsafe.park(Native Method)         at java.util.concurrent.locks.LockSupport.parkNanos(LockSupport.java:215)         at java.util.concurrent.SynchronousQueue$TransferStack.awaitFulfill(SynchronousQueue.java:460)         at java.util.concurrent.SynchronousQueue$TransferStack.transfer(SynchronousQueue.java:362)         at java.util.concurrent.SynchronousQueue.poll(SynchronousQueue.java:941)         at java.util.concurrent.ThreadPoolExecutor.getTask(ThreadPoolExecutor.java:1073)         at java.util.concurrent.ThreadPoolExecutor.runWorker(ThreadPoolExecutor.java:1134)         at java.util.concurrent.ThreadPoolExecutor$Worker.run(ThreadPoolExecutor.java:624)         at java.lang.Thread.run(Thread.java:748)    5) Thread[id=11687, name=OverseerCollectionConfigSetProcessor-98698396070051854-127.0.0.1:64742_solr-n_0000000003, state=TIMED_WAITING, group=Overseer collection creation process.]         at java.lang.Thread.sleep(Native Method)         at org.apache.solr.common.cloud.ZkCmdExecutor.retryDelay(ZkCmdExecutor.java:111)         at org.apache.solr.common.cloud.ZkCmdExecutor.retryOperation(ZkCmdExecutor.java:70)         at org.apache.solr.common.cloud.SolrZkClient.getData(SolrZkClient.java:354)         at org.apache.solr.cloud.OverseerTaskProcessor.amILeader(OverseerTaskProcessor.java:387)         at org.apache.solr.cloud.OverseerTaskProcessor.run(OverseerTaskProcessor.java:193)         at java.lang.Thread.run(Thread.java:748)    6) Thread[id=11688, name=OverseerHdfsCoreFailoverThread-98698396070051854-127.0.0.1:64742_solr-n_0000000003, state=TIMED_WAITING, group=Overseer Hdfs SolrCore Failover Thread.]         at java.lang.Thread.sleep(Native Method)         at org.apache.solr.cloud.OverseerAutoReplicaFailoverThread.run(OverseerAutoReplicaFailoverThread.java:139)         at java.lang.Thread.run(Thread.java:748)    7) Thread[id=11686, name=OverseerStateUpdate-98698396070051854-127.0.0.1:64742_solr-n_0000000003, state=TIMED_WAITING, group=Overseer state updater.]         at sun.misc.Unsafe.park(Native Method)         at java.util.concurrent.locks.LockSupport.parkNanos(LockSupport.java:215)         at java.util.concurrent.locks.AbstractQueuedSynchronizer$ConditionObject.awaitNanos(AbstractQueuedSynchronizer.java:2078)         at org.apache.solr.cloud.ZkDistributedQueue.peek(ZkDistributedQueue.java:169)         at org.apache.solr.cloud.ZkDistributedQueue.peek(ZkDistributedQueue.java:142)         at org.apache.solr.cloud.Overseer$ClusterStateUpdater.run(Overseer.java:184)         at java.lang.Thread.run(Thread.java:748)    8) Thread[id=11666, name=Connection evictor, state=TIMED_WAITING, group=TGRP-BasicAuthIntegrationTest]         at java.lang.Thread.sleep(Native Method)         at org.apache.http.impl.client.IdleConnectionEvictor$1.run(IdleConnectionEvictor.java:66)         at java.lang.Thread.run(Thread.java:748)    9) Thread[id=11671, name=TEST-BasicAuthIntegrationTest.testBasicAuth-seed#[F41D92893DF2B0AB]-SendThread(127.0.0.1:64706), state=TIMED_WAITING, group=TGRP-BasicAuthIntegrationTest]         at java.lang.Thread.sleep(Native Method)         at org.apache.zookeeper.client.StaticHostProvider.next(StaticHostProvider.java:101)         at org.apache.zookeeper.ClientCnxn$SendThread.startConnect(ClientCnxn.java:997)         at org.apache.zookeeper.ClientCnxn$SendThread.run(ClientCnxn.java:1060)   10) Thread[id=11683, name=zkCallback-3039-thread-2, state=TIMED_WAITING, group=TGRP-BasicAuthIntegrationTest]         at sun.misc.Unsafe.park(Native Method)         at java.util.concurrent.locks.LockSupport.parkNanos(LockSupport.java:215)         at java.util.concurrent.SynchronousQueue$TransferStack.awaitFulfill(SynchronousQueue.java:460)         at java.util.concurrent.SynchronousQueue$TransferStack.transfer(SynchronousQueue.java:362)         at java.util.concurrent.SynchronousQueue.poll(SynchronousQueue.java:941)         at java.util.concurrent.ThreadPoolExecutor.getTask(ThreadPoolExecutor.java:1073)         at java.util.concurrent.ThreadPoolExecutor.runWorker(ThreadPoolExecutor.java:1134)         at java.util.concurrent.ThreadPoolExecutor$Worker.run(ThreadPoolExecutor.java:624)         at java.lang.Thread.run(Thread.java:748)   11) Thread[id=11673, name=zkCallback-3039-thread-1, state=TIMED_WAITING, group=TGRP-BasicAuthIntegrationTest]         at sun.misc.Unsafe.park(Native Method)         at java.util.concurrent.locks.LockSupport.parkNanos(LockSupport.java:215)         at java.util.concurrent.SynchronousQueue$TransferStack.awaitFulfill(SynchronousQueue.java:460)         at java.util.concurrent.SynchronousQueue$TransferStack.transfer(SynchronousQueue.java:362)         at java.util.concurrent.SynchronousQueue.poll(SynchronousQueue.java:941)         at java.util.concurrent.ThreadPoolExecutor.getTask(ThreadPoolExecutor.java:1073)         at java.util.concurrent.ThreadPoolExecutor.runWorker(ThreadPoolExecutor.java:1134)         at java.util.concurrent.ThreadPoolExecutor$Worker.run(ThreadPoolExecutor.java:624)         at java.lang.Thread.run(Thread.java:748)   12) Thread[id=11690, name=zkCallback-3039-thread-4, state=TIMED_WAITING, group=TGRP-BasicAuthIntegrationTest]         at sun.misc.Unsafe.park(Native Method)         at java.util.concurrent.locks.LockSupport.parkNanos(LockSupport.java:215)         at java.util.concurrent.SynchronousQueue$TransferStack.awaitFulfill(SynchronousQueue.java:460)         at java.util.concurrent.SynchronousQueue$TransferStack.transfer(SynchronousQueue.java:362)         at java.util.concurrent.SynchronousQueue.poll(SynchronousQueue.java:941)         at java.util.concurrent.ThreadPoolExecutor.getTask(ThreadPoolExecutor.java:1073)         at java.util.concurrent.ThreadPoolExecutor.runWorker(ThreadPoolExecutor.java:1134)         at java.util.concurrent.ThreadPoolExecutor$Worker.run(ThreadPoolExecutor.java:624)         at java.lang.Thread.run(Thread.java:748)

Stack Trace:
com.carrotsearch.randomizedtesting.ThreadLeakError: 12 threads leaked from SUITE scope at org.apache.solr.security.BasicAuthIntegrationTest: 
   1) Thread[id=11691, name=zkCallback-3039-thread-5, state=TIMED_WAITING, group=TGRP-BasicAuthIntegrationTest]
        at sun.misc.Unsafe.park(Native Method)
        at java.util.concurrent.locks.LockSupport.parkNanos(LockSupport.java:215)
        at java.util.concurrent.SynchronousQueue$TransferStack.awaitFulfill(SynchronousQueue.java:460)
        at java.util.concurrent.SynchronousQueue$TransferStack.transfer(SynchronousQueue.java:362)
        at java.util.concurrent.SynchronousQueue.poll(SynchronousQueue.java:941)
        at java.util.concurrent.ThreadPoolExecutor.getTask(ThreadPoolExecutor.java:1073)
        at java.util.concurrent.ThreadPoolExecutor.runWorker(ThreadPoolExecutor.java:1134)
        at java.util.concurrent.ThreadPoolExecutor$Worker.run(ThreadPoolExecutor.java:624)
        at java.lang.Thread.run(Thread.java:748)
   2) Thread[id=11672, name=TEST-BasicAuthIntegrationTest.testBasicAuth-seed#[F41D92893DF2B0AB]-EventThread, state=WAITING, group=TGRP-BasicAuthIntegrationTest]
        at sun.misc.Unsafe.park(Native Method)
        at java.util.concurrent.locks.LockSupport.park(LockSupport.java:175)
        at java.util.concurrent.locks.AbstractQueuedSynchronizer$ConditionObject.await(AbstractQueuedSynchronizer.java:2039)
        at java.util.concurrent.LinkedBlockingQueue.take(LinkedBlockingQueue.java:442)
        at org.apache.zookeeper.ClientCnxn$EventThread.run(ClientCnxn.java:501)
   3) Thread[id=11667, name=Connection evictor, state=TIMED_WAITING, group=TGRP-BasicAuthIntegrationTest]
        at java.lang.Thread.sleep(Native Method)
        at org.apache.http.impl.client.IdleConnectionEvictor$1.run(IdleConnectionEvictor.java:66)
        at java.lang.Thread.run(Thread.java:748)
   4) Thread[id=11689, name=zkCallback-3039-thread-3, state=TIMED_WAITING, group=TGRP-BasicAuthIntegrationTest]
        at sun.misc.Unsafe.park(Native Method)
        at java.util.concurrent.locks.LockSupport.parkNanos(LockSupport.java:215)
        at java.util.concurrent.SynchronousQueue$TransferStack.awaitFulfill(SynchronousQueue.java:460)
        at java.util.concurrent.SynchronousQueue$TransferStack.transfer(SynchronousQueue.java:362)
        at java.util.concurrent.SynchronousQueue.poll(SynchronousQueue.java:941)
        at java.util.concurrent.ThreadPoolExecutor.getTask(ThreadPoolExecutor.java:1073)
        at java.util.concurrent.ThreadPoolExecutor.runWorker(ThreadPoolExecutor.java:1134)
        at java.util.concurrent.ThreadPoolExecutor$Worker.run(ThreadPoolExecutor.java:624)
        at java.lang.Thread.run(Thread.java:748)
   5) Thread[id=11687, name=OverseerCollectionConfigSetProcessor-98698396070051854-127.0.0.1:64742_solr-n_0000000003, state=TIMED_WAITING, group=Overseer collection creation process.]
        at java.lang.Thread.sleep(Native Method)
        at org.apache.solr.common.cloud.ZkCmdExecutor.retryDelay(ZkCmdExecutor.java:111)
        at org.apache.solr.common.cloud.ZkCmdExecutor.retryOperation(ZkCmdExecutor.java:70)
        at org.apache.solr.common.cloud.SolrZkClient.getData(SolrZkClient.java:354)
        at org.apache.solr.cloud.OverseerTaskProcessor.amILeader(OverseerTaskProcessor.java:387)
        at org.apache.solr.cloud.OverseerTaskProcessor.run(OverseerTaskProcessor.java:193)
        at java.lang.Thread.run(Thread.java:748)
   6) Thread[id=11688, name=OverseerHdfsCoreFailoverThread-98698396070051854-127.0.0.1:64742_solr-n_0000000003, state=TIMED_WAITING, group=Overseer Hdfs SolrCore Failover Thread.]
        at java.lang.Thread.sleep(Native Method)
        at org.apache.solr.cloud.OverseerAutoReplicaFailoverThread.run(OverseerAutoReplicaFailoverThread.java:139)
        at java.lang.Thread.run(Thread.java:748)
   7) Thread[id=11686, name=OverseerStateUpdate-98698396070051854-127.0.0.1:64742_solr-n_0000000003, state=TIMED_WAITING, group=Overseer state updater.]
        at sun.misc.Unsafe.park(Native Method)
        at java.util.concurrent.locks.LockSupport.parkNanos(LockSupport.java:215)
        at java.util.concurrent.locks.AbstractQueuedSynchronizer$ConditionObject.awaitNanos(AbstractQueuedSynchronizer.java:2078)
        at org.apache.solr.cloud.ZkDistributedQueue.peek(ZkDistributedQueue.java:169)
        at org.apache.solr.cloud.ZkDistributedQueue.peek(ZkDistributedQueue.java:142)
        at org.apache.solr.cloud.Overseer$ClusterStateUpdater.run(Overseer.java:184)
        at java.lang.Thread.run(Thread.java:748)
   8) Thread[id=11666, name=Connection evictor, state=TIMED_WAITING, group=TGRP-BasicAuthIntegrationTest]
        at java.lang.Thread.sleep(Native Method)
        at org.apache.http.impl.client.IdleConnectionEvictor$1.run(IdleConnectionEvictor.java:66)
        at java.lang.Thread.run(Thread.java:748)
   9) Thread[id=11671, name=TEST-BasicAuthIntegrationTest.testBasicAuth-seed#[F41D92893DF2B0AB]-SendThread(127.0.0.1:64706), state=TIMED_WAITING, group=TGRP-BasicAuthIntegrationTest]
        at java.lang.Thread.sleep(Native Method)
        at org.apache.zookeeper.client.StaticHostProvider.next(StaticHostProvider.java:101)
        at org.apache.zookeeper.ClientCnxn$SendThread.startConnect(ClientCnxn.java:997)
        at org.apache.zookeeper.ClientCnxn$SendThread.run(ClientCnxn.java:1060)
  10) Thread[id=11683, name=zkCallback-3039-thread-2, state=TIMED_WAITING, group=TGRP-BasicAuthIntegrationTest]
        at sun.misc.Unsafe.park(Native Method)
        at java.util.concurrent.locks.LockSupport.parkNanos(LockSupport.java:215)
        at java.util.concurrent.SynchronousQueue$TransferStack.awaitFulfill(SynchronousQueue.java:460)
        at java.util.concurrent.SynchronousQueue$TransferStack.transfer(SynchronousQueue.java:362)
        at java.util.concurrent.SynchronousQueue.poll(SynchronousQueue.java:941)
        at java.util.concurrent.ThreadPoolExecutor.getTask(ThreadPoolExecutor.java:1073)
        at java.util.concurrent.ThreadPoolExecutor.runWorker(ThreadPoolExecutor.java:1134)
        at java.util.concurrent.ThreadPoolExecutor$Worker.run(ThreadPoolExecutor.java:624)
        at java.lang.Thread.run(Thread.java:748)
  11) Thread[id=11673, name=zkCallback-3039-thread-1, state=TIMED_WAITING, group=TGRP-BasicAuthIntegrationTest]
        at sun.misc.Unsafe.park(Native Method)
        at java.util.concurrent.locks.LockSupport.parkNanos(LockSupport.java:215)
        at java.util.concurrent.SynchronousQueue$TransferStack.awaitFulfill(SynchronousQueue.java:460)
        at java.util.concurrent.SynchronousQueue$TransferStack.transfer(SynchronousQueue.java:362)
        at java.util.concurrent.SynchronousQueue.poll(SynchronousQueue.java:941)
        at java.util.concurrent.ThreadPoolExecutor.getTask(ThreadPoolExecutor.java:1073)
        at java.util.concurrent.ThreadPoolExecutor.runWorker(ThreadPoolExecutor.java:1134)
        at java.util.concurrent.ThreadPoolExecutor$Worker.run(ThreadPoolExecutor.java:624)
        at java.lang.Thread.run(Thread.java:748)
  12) Thread[id=11690, name=zkCallback-3039-thread-4, state=TIMED_WAITING, group=TGRP-BasicAuthIntegrationTest]
        at sun.misc.Unsafe.park(Native Method)
        at java.util.concurrent.locks.LockSupport.parkNanos(LockSupport.java:215)
        at java.util.concurrent.SynchronousQueue$TransferStack.awaitFulfill(SynchronousQueue.java:460)
        at java.util.concurrent.SynchronousQueue$TransferStack.transfer(SynchronousQueue.java:362)
        at java.util.concurrent.SynchronousQueue.poll(SynchronousQueue.java:941)
        at java.util.concurrent.ThreadPoolExecutor.getTask(ThreadPoolExecutor.java:1073)
        at java.util.concurrent.ThreadPoolExecutor.runWorker(ThreadPoolExecutor.java:1134)
        at java.util.concurrent.ThreadPoolExecutor$Worker.run(ThreadPoolExecutor.java:624)
        at java.lang.Thread.run(Thread.java:748)
	at __randomizedtesting.SeedInfo.seed([F41D92893DF2B0AB]:0)


FAILED:  junit.framework.TestSuite.org.apache.solr.security.BasicAuthIntegrationTest

Error Message:
There are still zombie threads that couldn't be terminated:    1) Thread[id=11691, name=zkCallback-3039-thread-5, state=TIMED_WAITING, group=TGRP-BasicAuthIntegrationTest]         at sun.misc.Unsafe.park(Native Method)         at java.util.concurrent.locks.LockSupport.parkNanos(LockSupport.java:215)         at java.util.concurrent.SynchronousQueue$TransferStack.awaitFulfill(SynchronousQueue.java:460)         at java.util.concurrent.SynchronousQueue$TransferStack.transfer(SynchronousQueue.java:362)         at java.util.concurrent.SynchronousQueue.poll(SynchronousQueue.java:941)         at java.util.concurrent.ThreadPoolExecutor.getTask(ThreadPoolExecutor.java:1073)         at java.util.concurrent.ThreadPoolExecutor.runWorker(ThreadPoolExecutor.java:1134)         at java.util.concurrent.ThreadPoolExecutor$Worker.run(ThreadPoolExecutor.java:624)         at java.lang.Thread.run(Thread.java:748)    2) Thread[id=11671, name=TEST-BasicAuthIntegrationTest.testBasicAuth-seed#[F41D92893DF2B0AB]-SendThread(127.0.0.1:64706), state=TIMED_WAITING, group=TGRP-BasicAuthIntegrationTest]         at java.lang.Thread.sleep(Native Method)         at org.apache.zookeeper.client.StaticHostProvider.next(StaticHostProvider.java:101)         at org.apache.zookeeper.ClientCnxn$SendThread.startConnect(ClientCnxn.java:997)         at org.apache.zookeeper.ClientCnxn$SendThread.run(ClientCnxn.java:1060)    3) Thread[id=11683, name=zkCallback-3039-thread-2, state=TIMED_WAITING, group=TGRP-BasicAuthIntegrationTest]         at sun.misc.Unsafe.park(Native Method)         at java.util.concurrent.locks.LockSupport.parkNanos(LockSupport.java:215)         at java.util.concurrent.SynchronousQueue$TransferStack.awaitFulfill(SynchronousQueue.java:460)         at java.util.concurrent.SynchronousQueue$TransferStack.transfer(SynchronousQueue.java:362)         at java.util.concurrent.SynchronousQueue.poll(SynchronousQueue.java:941)         at java.util.concurrent.ThreadPoolExecutor.getTask(ThreadPoolExecutor.java:1073)         at java.util.concurrent.ThreadPoolExecutor.runWorker(ThreadPoolExecutor.java:1134)         at java.util.concurrent.ThreadPoolExecutor$Worker.run(ThreadPoolExecutor.java:624)         at java.lang.Thread.run(Thread.java:748)    4) Thread[id=11673, name=zkCallback-3039-thread-1, state=TIMED_WAITING, group=TGRP-BasicAuthIntegrationTest]         at sun.misc.Unsafe.park(Native Method)         at java.util.concurrent.locks.LockSupport.parkNanos(LockSupport.java:215)         at java.util.concurrent.SynchronousQueue$TransferStack.awaitFulfill(SynchronousQueue.java:460)         at java.util.concurrent.SynchronousQueue$TransferStack.transfer(SynchronousQueue.java:362)         at java.util.concurrent.SynchronousQueue.poll(SynchronousQueue.java:941)         at java.util.concurrent.ThreadPoolExecutor.getTask(ThreadPoolExecutor.java:1073)         at java.util.concurrent.ThreadPoolExecutor.runWorker(ThreadPoolExecutor.java:1134)         at java.util.concurrent.ThreadPoolExecutor$Worker.run(ThreadPoolExecutor.java:624)         at java.lang.Thread.run(Thread.java:748)    5) Thread[id=11689, name=zkCallback-3039-thread-3, state=TIMED_WAITING, group=TGRP-BasicAuthIntegrationTest]         at sun.misc.Unsafe.park(Native Method)         at java.util.concurrent.locks.LockSupport.parkNanos(LockSupport.java:215)         at java.util.concurrent.SynchronousQueue$TransferStack.awaitFulfill(SynchronousQueue.java:460)         at java.util.concurrent.SynchronousQueue$TransferStack.transfer(SynchronousQueue.java:362)         at java.util.concurrent.SynchronousQueue.poll(SynchronousQueue.java:941)         at java.util.concurrent.ThreadPoolExecutor.getTask(ThreadPoolExecutor.java:1073)         at java.util.concurrent.ThreadPoolExecutor.runWorker(ThreadPoolExecutor.java:1134)         at java.util.concurrent.ThreadPoolExecutor$Worker.run(ThreadPoolExecutor.java:624)         at java.lang.Thread.run(Thread.java:748)    6) Thread[id=11690, name=zkCallback-3039-thread-4, state=TIMED_WAITING, group=TGRP-BasicAuthIntegrationTest]         at sun.misc.Unsafe.park(Native Method)         at java.util.concurrent.locks.LockSupport.parkNanos(LockSupport.java:215)         at java.util.concurrent.SynchronousQueue$TransferStack.awaitFulfill(SynchronousQueue.java:460)         at java.util.concurrent.SynchronousQueue$TransferStack.transfer(SynchronousQueue.java:362)         at java.util.concurrent.SynchronousQueue.poll(SynchronousQueue.java:941)         at java.util.concurrent.ThreadPoolExecutor.getTask(ThreadPoolExecutor.java:1073)         at java.util.concurrent.ThreadPoolExecutor.runWorker(ThreadPoolExecutor.java:1134)         at java.util.concurrent.ThreadPoolExecutor$Worker.run(ThreadPoolExecutor.java:624)         at java.lang.Thread.run(Thread.java:748)

Stack Trace:
com.carrotsearch.randomizedtesting.ThreadLeakError: There are still zombie threads that couldn't be terminated:
   1) Thread[id=11691, name=zkCallback-3039-thread-5, state=TIMED_WAITING, group=TGRP-BasicAuthIntegrationTest]
        at sun.misc.Unsafe.park(Native Method)
        at java.util.concurrent.locks.LockSupport.parkNanos(LockSupport.java:215)
        at java.util.concurrent.SynchronousQueue$TransferStack.awaitFulfill(SynchronousQueue.java:460)
        at java.util.concurrent.SynchronousQueue$TransferStack.transfer(SynchronousQueue.java:362)
        at java.util.concurrent.SynchronousQueue.poll(SynchronousQueue.java:941)
        at java.util.concurrent.ThreadPoolExecutor.getTask(ThreadPoolExecutor.java:1073)
        at java.util.concurrent.ThreadPoolExecutor.runWorker(ThreadPoolExecutor.java:1134)
        at java.util.concurrent.ThreadPoolExecutor$Worker.run(ThreadPoolExecutor.java:624)
        at java.lang.Thread.run(Thread.java:748)
   2) Thread[id=11671, name=TEST-BasicAuthIntegrationTest.testBasicAuth-seed#[F41D92893DF2B0AB]-SendThread(127.0.0.1:64706), state=TIMED_WAITING, group=TGRP-BasicAuthIntegrationTest]
        at java.lang.Thread.sleep(Native Method)
        at org.apache.zookeeper.client.StaticHostProvider.next(StaticHostProvider.java:101)
        at org.apache.zookeeper.ClientCnxn$SendThread.startConnect(ClientCnxn.java:997)
        at org.apache.zookeeper.ClientCnxn$SendThread.run(ClientCnxn.java:1060)
   3) Thread[id=11683, name=zkCallback-3039-thread-2, state=TIMED_WAITING, group=TGRP-BasicAuthIntegrationTest]
        at sun.misc.Unsafe.park(Native Method)
        at java.util.concurrent.locks.LockSupport.parkNanos(LockSupport.java:215)
        at java.util.concurrent.SynchronousQueue$TransferStack.awaitFulfill(SynchronousQueue.java:460)
        at java.util.concurrent.SynchronousQueue$TransferStack.transfer(SynchronousQueue.java:362)
        at java.util.concurrent.SynchronousQueue.poll(SynchronousQueue.java:941)
        at java.util.concurrent.ThreadPoolExecutor.getTask(ThreadPoolExecutor.java:1073)
        at java.util.concurrent.ThreadPoolExecutor.runWorker(ThreadPoolExecutor.java:1134)
        at java.util.concurrent.ThreadPoolExecutor$Worker.run(ThreadPoolExecutor.java:624)
        at java.lang.Thread.run(Thread.java:748)
   4) Thread[id=11673, name=zkCallback-3039-thread-1, state=TIMED_WAITING, group=TGRP-BasicAuthIntegrationTest]
        at sun.misc.Unsafe.park(Native Method)
        at java.util.concurrent.locks.LockSupport.parkNanos(LockSupport.java:215)
        at java.util.concurrent.SynchronousQueue$TransferStack.awaitFulfill(SynchronousQueue.java:460)
        at java.util.concurrent.SynchronousQueue$TransferStack.transfer(SynchronousQueue.java:362)
        at java.util.concurrent.SynchronousQueue.poll(SynchronousQueue.java:941)
        at java.util.concurrent.ThreadPoolExecutor.getTask(ThreadPoolExecutor.java:1073)
        at java.util.concurrent.ThreadPoolExecutor.runWorker(ThreadPoolExecutor.java:1134)
        at java.util.concurrent.ThreadPoolExecutor$Worker.run(ThreadPoolExecutor.java:624)
        at java.lang.Thread.run(Thread.java:748)
   5) Thread[id=11689, name=zkCallback-3039-thread-3, state=TIMED_WAITING, group=TGRP-BasicAuthIntegrationTest]
        at sun.misc.Unsafe.park(Native Method)
        at java.util.concurrent.locks.LockSupport.parkNanos(LockSupport.java:215)
        at java.util.concurrent.SynchronousQueue$TransferStack.awaitFulfill(SynchronousQueue.java:460)
        at java.util.concurrent.SynchronousQueue$TransferStack.transfer(SynchronousQueue.java:362)
        at java.util.concurrent.SynchronousQueue.poll(SynchronousQueue.java:941)
        at java.util.concurrent.ThreadPoolExecutor.getTask(ThreadPoolExecutor.java:1073)
        at java.util.concurrent.ThreadPoolExecutor.runWorker(ThreadPoolExecutor.java:1134)
        at java.util.concurrent.ThreadPoolExecutor$Worker.run(ThreadPoolExecutor.java:624)
        at java.lang.Thread.run(Thread.java:748)
   6) Thread[id=11690, name=zkCallback-3039-thread-4, state=TIMED_WAITING, group=TGRP-BasicAuthIntegrationTest]
        at sun.misc.Unsafe.park(Native Method)
        at java.util.concurrent.locks.LockSupport.parkNanos(LockSupport.java:215)
        at java.util.concurrent.SynchronousQueue$TransferStack.awaitFulfill(SynchronousQueue.java:460)
        at java.util.concurrent.SynchronousQueue$TransferStack.transfer(SynchronousQueue.java:362)
        at java.util.concurrent.SynchronousQueue.poll(SynchronousQueue.java:941)
        at java.util.concurrent.ThreadPoolExecutor.getTask(ThreadPoolExecutor.java:1073)
        at java.util.concurrent.ThreadPoolExecutor.runWorker(ThreadPoolExecutor.java:1134)
        at java.util.concurrent.ThreadPoolExecutor$Worker.run(ThreadPoolExecutor.java:624)
        at java.lang.Thread.run(Thread.java:748)
	at __randomizedtesting.SeedInfo.seed([F41D92893DF2B0AB]:0)




Build Log:
[...truncated 12265 lines...]
   [junit4] Suite: org.apache.solr.security.BasicAuthIntegrationTest
   [junit4]   2> 963196 INFO  (SUITE-BasicAuthIntegrationTest-seed#[F41D92893DF2B0AB]-worker) [    ] o.a.s.SolrTestCaseJ4 SecureRandom sanity checks: test.solr.allowed.securerandom=null & java.security.egd=file:/dev/./urandom
   [junit4]   2> Creating dataDir: /Users/jenkins/workspace/Lucene-Solr-7.x-MacOSX/solr/build/solr-core/test/J1/temp/solr.security.BasicAuthIntegrationTest_F41D92893DF2B0AB-001/init-core-data-001
   [junit4]   2> 963197 INFO  (SUITE-BasicAuthIntegrationTest-seed#[F41D92893DF2B0AB]-worker) [    ] o.a.s.SolrTestCaseJ4 Using TrieFields (NUMERIC_POINTS_SYSPROP=false) w/NUMERIC_DOCVALUES_SYSPROP=false
   [junit4]   2> 963198 INFO  (SUITE-BasicAuthIntegrationTest-seed#[F41D92893DF2B0AB]-worker) [    ] o.a.s.SolrTestCaseJ4 Randomized ssl (false) and clientAuth (false) via: @org.apache.solr.util.RandomizeSSL(reason=, value=NaN, ssl=NaN, clientAuth=NaN) w/ MAC_OS_X supressed clientAuth
   [junit4]   2> 963199 INFO  (SUITE-BasicAuthIntegrationTest-seed#[F41D92893DF2B0AB]-worker) [    ] o.a.s.c.MiniSolrCloudCluster Starting cluster of 3 servers in /Users/jenkins/workspace/Lucene-Solr-7.x-MacOSX/solr/build/solr-core/test/J1/temp/solr.security.BasicAuthIntegrationTest_F41D92893DF2B0AB-001/tempDir-001
   [junit4]   2> 963199 INFO  (SUITE-BasicAuthIntegrationTest-seed#[F41D92893DF2B0AB]-worker) [    ] o.a.s.c.ZkTestServer STARTING ZK TEST SERVER
   [junit4]   2> 963199 INFO  (Thread-1923) [    ] o.a.s.c.ZkTestServer client port:0.0.0.0/0.0.0.0:0
   [junit4]   2> 963199 INFO  (Thread-1923) [    ] o.a.s.c.ZkTestServer Starting server
   [junit4]   2> 963201 ERROR (Thread-1923) [    ] o.a.z.s.ZooKeeperServer ZKShutdownHandler is not registered, so ZooKeeper server won't take any action on ERROR or SHUTDOWN server state changes
   [junit4]   2> 963305 INFO  (SUITE-BasicAuthIntegrationTest-seed#[F41D92893DF2B0AB]-worker) [    ] o.a.s.c.ZkTestServer start zk server on port:64706
   [junit4]   2> 963320 INFO  (jetty-launcher-3010-thread-1) [    ] o.e.j.s.Server jetty-9.3.20.v20170531
   [junit4]   2> 963321 INFO  (jetty-launcher-3010-thread-2) [    ] o.e.j.s.Server jetty-9.3.20.v20170531
   [junit4]   2> 963322 INFO  (jetty-launcher-3010-thread-3) [    ] o.e.j.s.Server jetty-9.3.20.v20170531
   [junit4]   2> 963323 INFO  (jetty-launcher-3010-thread-1) [    ] o.e.j.s.h.ContextHandler Started o.e.j.s.ServletContextHandler@6fd9d4d{/solr,null,AVAILABLE}
   [junit4]   2> 963323 INFO  (jetty-launcher-3010-thread-1) [    ] o.e.j.s.AbstractConnector Started ServerConnector@59bb80a5{HTTP/1.1,[http/1.1]}{127.0.0.1:64709}
   [junit4]   2> 963323 INFO  (jetty-launcher-3010-thread-1) [    ] o.e.j.s.Server Started @968454ms
   [junit4]   2> 963323 INFO  (jetty-launcher-3010-thread-1) [    ] o.a.s.c.s.e.JettySolrRunner Jetty properties: {hostContext=/solr, hostPort=64709}
   [junit4]   2> 963323 ERROR (jetty-launcher-3010-thread-1) [    ] o.a.s.u.StartupLoggingUtils Missing Java Option solr.log.dir. Logging may be missing or incomplete.
   [junit4]   2> 963324 INFO  (jetty-launcher-3010-thread-1) [    ] o.a.s.s.SolrDispatchFilter  ___      _       Welcome to Apache Solr? version 7.1.0
   [junit4]   2> 963324 INFO  (jetty-launcher-3010-thread-1) [    ] o.a.s.s.SolrDispatchFilter / __| ___| |_ _   Starting in cloud mode on port null
   [junit4]   2> 963324 INFO  (jetty-launcher-3010-thread-1) [    ] o.a.s.s.SolrDispatchFilter \__ \/ _ \ | '_|  Install dir: null, Default config dir: null
   [junit4]   2> 963324 INFO  (jetty-launcher-3010-thread-1) [    ] o.a.s.s.SolrDispatchFilter |___/\___/_|_|    Start time: 2017-09-21T18:20:06.564Z
   [junit4]   2> 963325 INFO  (jetty-launcher-3010-thread-2) [    ] o.e.j.s.h.ContextHandler Started o.e.j.s.ServletContextHandler@1fc4399c{/solr,null,AVAILABLE}
   [junit4]   2> 963326 INFO  (jetty-launcher-3010-thread-2) [    ] o.e.j.s.AbstractConnector Started ServerConnector@671748a1{HTTP/1.1,[http/1.1]}{127.0.0.1:64710}
   [junit4]   2> 963326 INFO  (jetty-launcher-3010-thread-2) [    ] o.e.j.s.Server Started @968457ms
   [junit4]   2> 963326 INFO  (jetty-launcher-3010-thread-2) [    ] o.a.s.c.s.e.JettySolrRunner Jetty properties: {hostContext=/solr, hostPort=64710}
   [junit4]   2> 963326 ERROR (jetty-launcher-3010-thread-2) [    ] o.a.s.u.StartupLoggingUtils Missing Java Option solr.log.dir. Logging may be missing or incomplete.
   [junit4]   2> 963326 INFO  (jetty-launcher-3010-thread-2) [    ] o.a.s.s.SolrDispatchFilter  ___      _       Welcome to Apache Solr? version 7.1.0
   [junit4]   2> 963326 INFO  (jetty-launcher-3010-thread-2) [    ] o.a.s.s.SolrDispatchFilter / __| ___| |_ _   Starting in cloud mode on port null
   [junit4]   2> 963326 INFO  (jetty-launcher-3010-thread-2) [    ] o.a.s.s.SolrDispatchFilter \__ \/ _ \ | '_|  Install dir: null, Default config dir: null
   [junit4]   2> 963326 INFO  (jetty-launcher-3010-thread-2) [    ] o.a.s.s.SolrDispatchFilter |___/\___/_|_|    Start time: 2017-09-21T18:20:06.566Z
   [junit4]   2> 963328 INFO  (jetty-launcher-3010-thread-3) [    ] o.e.j.s.h.ContextHandler Started o.e.j.s.ServletContextHandler@220af4f4{/solr,null,AVAILABLE}
   [junit4]   2> 963328 INFO  (jetty-launcher-3010-thread-3) [    ] o.e.j.s.AbstractConnector Started ServerConnector@45ed84b3{HTTP/1.1,[http/1.1]}{127.0.0.1:64711}
   [junit4]   2> 963328 INFO  (jetty-launcher-3010-thread-3) [    ] o.e.j.s.Server Started @968459ms
   [junit4]   2> 963328 INFO  (jetty-launcher-3010-thread-3) [    ] o.a.s.c.s.e.JettySolrRunner Jetty properties: {hostContext=/solr, hostPort=64711}
   [junit4]   2> 963328 ERROR (jetty-launcher-3010-thread-3) [    ] o.a.s.u.StartupLoggingUtils Missing Java Option solr.log.dir. Logging may be missing or incomplete.
   [junit4]   2> 963329 INFO  (jetty-launcher-3010-thread-3) [    ] o.a.s.s.SolrDispatchFilter  ___      _       Welcome to Apache Solr? version 7.1.0
   [junit4]   2> 963329 INFO  (jetty-launcher-3010-thread-3) [    ] o.a.s.s.SolrDispatchFilter / __| ___| |_ _   Starting in cloud mode on port null
   [junit4]   2> 963329 INFO  (jetty-launcher-3010-thread-3) [    ] o.a.s.s.SolrDispatchFilter \__ \/ _ \ | '_|  Install dir: null, Default config dir: null
   [junit4]   2> 963329 INFO  (jetty-launcher-3010-thread-3) [    ] o.a.s.s.SolrDispatchFilter |___/\___/_|_|    Start time: 2017-09-21T18:20:06.569Z
   [junit4]   2> 963334 INFO  (jetty-launcher-3010-thread-3) [    ] o.a.s.s.SolrDispatchFilter solr.xml found in ZooKeeper. Loading...
   [junit4]   2> 963335 INFO  (jetty-launcher-3010-thread-1) [    ] o.a.s.s.SolrDispatchFilter solr.xml found in ZooKeeper. Loading...
   [junit4]   2> 963336 INFO  (jetty-launcher-3010-thread-2) [    ] o.a.s.s.SolrDispatchFilter solr.xml found in ZooKeeper. Loading...
   [junit4]   2> 963345 INFO  (jetty-launcher-3010-thread-2) [    ] o.a.s.c.ZkContainer Zookeeper client=127.0.0.1:64706/solr
   [junit4]   2> 963347 INFO  (jetty-launcher-3010-thread-1) [    ] o.a.s.c.ZkContainer Zookeeper client=127.0.0.1:64706/solr
   [junit4]   2> 963351 INFO  (jetty-launcher-3010-thread-3) [    ] o.a.s.c.ZkContainer Zookeeper client=127.0.0.1:64706/solr
   [junit4]   2> 963487 INFO  (jetty-launcher-3010-thread-2) [n:127.0.0.1:64710_solr    ] o.a.s.c.Overseer Overseer (id=null) closing
   [junit4]   2> 963487 INFO  (jetty-launcher-3010-thread-3) [n:127.0.0.1:64711_solr    ] o.a.s.c.Overseer Overseer (id=null) closing
   [junit4]   2> 963488 INFO  (jetty-launcher-3010-thread-2) [n:127.0.0.1:64710_solr    ] o.a.s.c.OverseerElectionContext I am going to be the leader 127.0.0.1:64710_solr
   [junit4]   2> 963488 INFO  (jetty-launcher-3010-thread-1) [n:127.0.0.1:64709_solr    ] o.a.s.c.Overseer Overseer (id=null) closing
   [junit4]   2> 963489 INFO  (jetty-launcher-3010-thread-3) [n:127.0.0.1:64711_solr    ] o.a.s.c.ZkController Register node as live in ZooKeeper:/live_nodes/127.0.0.1:64711_solr
   [junit4]   2> 963490 INFO  (jetty-launcher-3010-thread-2) [n:127.0.0.1:64710_solr    ] o.a.s.c.Overseer Overseer (id=98698396070051847-127.0.0.1:64710_solr-n_0000000000) starting
   [junit4]   2> 963490 INFO  (jetty-launcher-3010-thread-1) [n:127.0.0.1:64709_solr    ] o.a.s.c.ZkController Register node as live in ZooKeeper:/live_nodes/127.0.0.1:64709_solr
   [junit4]   2> 963491 INFO  (zkCallback-3027-thread-1-processing-n:127.0.0.1:64711_solr) [n:127.0.0.1:64711_solr    ] o.a.s.c.c.ZkStateReader Updated live nodes from ZooKeeper... (0) -> (1)
   [junit4]   2> 963491 INFO  (zkCallback-3025-thread-1-processing-n:127.0.0.1:64710_solr) [n:127.0.0.1:64710_solr    ] o.a.s.c.c.ZkStateReader Updated live nodes from ZooKeeper... (0) -> (1)
   [junit4]   2> 963491 INFO  (zkCallback-3026-thread-1-processing-n:127.0.0.1:64709_solr) [n:127.0.0.1:64709_solr    ] o.a.s.c.c.ZkStateReader Updated live nodes from ZooKeeper... (0) -> (1)
   [junit4]   2> 963492 INFO  (zkCallback-3026-thread-1-processing-n:127.0.0.1:64709_solr) [n:127.0.0.1:64709_solr    ] o.a.s.c.c.ZkStateReader Updated live nodes from ZooKeeper... (1) -> (2)
   [junit4]   2> 963493 INFO  (zkCallback-3027-thread-1-processing-n:127.0.0.1:64711_solr) [n:127.0.0.1:64711_solr    ] o.a.s.c.c.ZkStateReader Updated live nodes from ZooKeeper... (1) -> (2)
   [junit4]   2> 963493 INFO  (zkCallback-3025-thread-1-processing-n:127.0.0.1:64710_solr) [n:127.0.0.1:64710_solr    ] o.a.s.c.c.ZkStateReader Updated live nodes from ZooKeeper... (1) -> (2)
   [junit4]   2> 963500 INFO  (jetty-launcher-3010-thread-2) [n:127.0.0.1:64710_solr    ] o.a.s.c.ZkController Register node as live in ZooKeeper:/live_nodes/127.0.0.1:64710_solr
   [junit4]   2> 963503 INFO  (zkCallback-3026-thread-1-processing-n:127.0.0.1:64709_solr) [n:127.0.0.1:64709_solr    ] o.a.s.c.c.ZkStateReader Updated live nodes from ZooKeeper... (2) -> (3)
   [junit4]   2> 963503 INFO  (zkCallback-3027-thread-1-processing-n:127.0.0.1:64711_solr) [n:127.0.0.1:64711_solr    ] o.a.s.c.c.ZkStateReader Updated live nodes from ZooKeeper... (2) -> (3)
   [junit4]   2> 963504 INFO  (zkCallback-3025-thread-1-processing-n:127.0.0.1:64710_solr) [n:127.0.0.1:64710_solr    ] o.a.s.c.c.ZkStateReader Updated live nodes from ZooKeeper... (2) -> (3)
   [junit4]   2> 963639 INFO  (jetty-launcher-3010-thread-2) [n:127.0.0.1:64710_solr    ] o.a.s.m.r.SolrJmxReporter JMX monitoring for 'solr_64710.solr.node' (registry 'solr.node') enabled at server: com.sun.jmx.mbeanserver.JmxMBeanServer@5e60a6f4
   [junit4]   2> 963646 INFO  (jetty-launcher-3010-thread-1) [n:127.0.0.1:64709_solr    ] o.a.s.m.r.SolrJmxReporter JMX monitoring for 'solr_64709.solr.node' (registry 'solr.node') enabled at server: com.sun.jmx.mbeanserver.JmxMBeanServer@5e60a6f4
   [junit4]   2> 963646 INFO  (jetty-launcher-3010-thread-3) [n:127.0.0.1:64711_solr    ] o.a.s.m.r.SolrJmxReporter JMX monitoring for 'solr_64711.solr.node' (registry 'solr.node') enabled at server: com.sun.jmx.mbeanserver.JmxMBeanServer@5e60a6f4
   [junit4]   2> 963677 INFO  (jetty-launcher-3010-thread-3) [n:127.0.0.1:64711_solr    ] o.a.s.m.r.SolrJmxReporter JMX monitoring for 'solr_64711.solr.jvm' (registry 'solr.jvm') enabled at server: com.sun.jmx.mbeanserver.JmxMBeanServer@5e60a6f4
   [junit4]   2> 963678 INFO  (jetty-launcher-3010-thread-3) [n:127.0.0.1:64711_solr    ] o.a.s.m.r.SolrJmxReporter JMX monitoring for 'solr_64711.solr.jetty' (registry 'solr.jetty') enabled at server: com.sun.jmx.mbeanserver.JmxMBeanServer@5e60a6f4
   [junit4]   2> 963679 INFO  (jetty-launcher-3010-thread-2) [n:127.0.0.1:64710_solr    ] o.a.s.m.r.SolrJmxReporter JMX monitoring for 'solr_64710.solr.jvm' (registry 'solr.jvm') enabled at server: com.sun.jmx.mbeanserver.JmxMBeanServer@5e60a6f4
   [junit4]   2> 963679 INFO  (jetty-launcher-3010-thread-2) [n:127.0.0.1:64710_solr    ] o.a.s.m.r.SolrJmxReporter JMX monitoring for 'solr_64710.solr.jetty' (registry 'solr.jetty') enabled at server: com.sun.jmx.mbeanserver.JmxMBeanServer@5e60a6f4
   [junit4]   2> 963679 INFO  (jetty-launcher-3010-thread-3) [n:127.0.0.1:64711_solr    ] o.a.s.c.CorePropertiesLocator Found 0 core definitions underneath /Users/jenkins/workspace/Lucene-Solr-7.x-MacOSX/solr/build/solr-core/test/J1/temp/solr.security.BasicAuthIntegrationTest_F41D92893DF2B0AB-001/tempDir-001/node3/.
   [junit4]   2> 963680 INFO  (jetty-launcher-3010-thread-2) [n:127.0.0.1:64710_solr    ] o.a.s.c.CorePropertiesLocator Found 0 core definitions underneath /Users/jenkins/workspace/Lucene-Solr-7.x-MacOSX/solr/build/solr-core/test/J1/temp/solr.security.BasicAuthIntegrationTest_F41D92893DF2B0AB-001/tempDir-001/node2/.
   [junit4]   2> 963681 INFO  (jetty-launcher-3010-thread-1) [n:127.0.0.1:64709_solr    ] o.a.s.m.r.SolrJmxReporter JMX monitoring for 'solr_64709.solr.jvm' (registry 'solr.jvm') enabled at server: com.sun.jmx.mbeanserver.JmxMBeanServer@5e60a6f4
   [junit4]   2> 963681 INFO  (jetty-launcher-3010-thread-1) [n:127.0.0.1:64709_solr    ] o.a.s.m.r.SolrJmxReporter JMX monitoring for 'solr_64709.solr.jetty' (registry 'solr.jetty') enabled at server: com.sun.jmx.mbeanserver.JmxMBeanServer@5e60a6f4
   [junit4]   2> 963682 INFO  (jetty-launcher-3010-thread-1) [n:127.0.0.1:64709_solr    ] o.a.s.c.CorePropertiesLocator Found 0 core definitions underneath /Users/jenkins/workspace/Lucene-Solr-7.x-MacOSX/solr/build/solr-core/test/J1/temp/solr.security.BasicAuthIntegrationTest_F41D92893DF2B0AB-001/tempDir-001/node1/.
   [junit4]   2> 963754 INFO  (SUITE-BasicAuthIntegrationTest-seed#[F41D92893DF2B0AB]-worker) [    ] o.a.s.c.c.ZkStateReader Updated live nodes from ZooKeeper... (0) -> (3)
   [junit4]   2> 963755 INFO  (SUITE-BasicAuthIntegrationTest-seed#[F41D92893DF2B0AB]-worker) [    ] o.a.s.c.s.i.ZkClientClusterStateProvider Cluster at 127.0.0.1:64706/solr ready
   [junit4]   2> 963762 INFO  (qtp1741919419-11550) [n:127.0.0.1:64709_solr    ] o.a.s.h.a.CollectionsHandler Invoked Collection Action :create with params replicationFactor=1&collection.configName=conf&name=authCollection&nrtReplicas=1&action=CREATE&numShards=3&wt=javabin&version=2 and sendToOCPQueue=true
   [junit4]   2> 963765 INFO  (OverseerThreadFactory-4534-thread-1-processing-n:127.0.0.1:64710_solr) [n:127.0.0.1:64710_solr    ] o.a.s.c.CreateCollectionCmd Create collection authCollection
   [junit4]   2> 963882 INFO  (OverseerStateUpdate-98698396070051847-127.0.0.1:64710_solr-n_0000000000) [n:127.0.0.1:64710_solr    ] o.a.s.c.o.SliceMutator createReplica() {
   [junit4]   2>   "operation":"ADDREPLICA",
   [junit4]   2>   "collection":"authCollection",
   [junit4]   2>   "shard":"shard1",
   [junit4]   2>   "core":"authCollection_shard1_replica_n1",
   [junit4]   2>   "state":"down",
   [junit4]   2>   "base_url":"http://127.0.0.1:64711/solr",
   [junit4]   2>   "type":"NRT"} 
   [junit4]   2> 963891 INFO  (OverseerStateUpdate-98698396070051847-127.0.0.1:64710_solr-n_0000000000) [n:127.0.0.1:64710_solr    ] o.a.s.c.o.SliceMutator createReplica() {
   [junit4]   2>   "operation":"ADDREPLICA",
   [junit4]   2>   "collection":"authCollection",
   [junit4]   2>   "shard":"shard2",
   [junit4]   2>   "core":"authCollection_shard2_replica_n2",
   [junit4]   2>   "state":"down",
   [junit4]   2>   "base_url":"http://127.0.0.1:64710/solr",
   [junit4]   2>   "type":"NRT"} 
   [junit4]   2> 963900 INFO  (OverseerStateUpdate-98698396070051847-127.0.0.1:64710_solr-n_0000000000) [n:127.0.0.1:64710_solr    ] o.a.s.c.o.SliceMutator createReplica() {
   [junit4]   2>   "operation":"ADDREPLICA",
   [junit4]   2>   "collection":"authCollection",
   [junit4]   2>   "shard":"shard3",
   [junit4]   2>   "core":"authCollection_shard3_replica_n4",
   [junit4]   2>   "state":"down",
   [junit4]   2>   "base_url":"http://127.0.0.1:64709/solr",
   [junit4]   2>   "type":"NRT"} 
   [junit4]   2> 964131 INFO  (qtp1741919419-11551) [n:127.0.0.1:64709_solr    ] o.a.s.h.a.CoreAdminOperation core create command qt=/admin/cores&coreNodeName=core_node6&collection.configName=conf&newCollection=true&name=authCollection_shard3_replica_n4&action=CREATE&numShards=3&collection=authCollection&shard=shard3&wt=javabin&version=2&replicaType=NRT
   [junit4]   2> 964132 INFO  (qtp2055968187-11568) [n:127.0.0.1:64711_solr    ] o.a.s.h.a.CoreAdminOperation core create command qt=/admin/cores&coreNodeName=core_node3&collection.configName=conf&newCollection=true&name=authCollection_shard1_replica_n1&action=CREATE&numShards=3&collection=authCollection&shard=shard1&wt=javabin&version=2&replicaType=NRT
   [junit4]   2> 964132 INFO  (qtp1529708741-11559) [n:127.0.0.1:64710_solr    ] o.a.s.h.a.CoreAdminOperation core create command qt=/admin/cores&coreNodeName=core_node5&collection.configName=conf&newCollection=true&name=authCollection_shard2_replica_n2&action=CREATE&numShards=3&collection=authCollection&shard=shard2&wt=javabin&version=2&replicaType=NRT
   [junit4]   2> 964132 INFO  (qtp1741919419-11551) [n:127.0.0.1:64709_solr    ] o.a.s.c.TransientSolrCoreCacheDefault Allocating transient cache for 2147483647 transient cores
   [junit4]   2> 964132 INFO  (qtp2055968187-11568) [n:127.0.0.1:64711_solr    ] o.a.s.c.TransientSolrCoreCacheDefault Allocating transient cache for 2147483647 transient cores
   [junit4]   2> 964133 INFO  (qtp1529708741-11559) [n:127.0.0.1:64710_solr    ] o.a.s.c.TransientSolrCoreCacheDefault Allocating transient cache for 2147483647 transient cores
   [junit4]   2> 964254 INFO  (zkCallback-3026-thread-1-processing-n:127.0.0.1:64709_solr) [n:127.0.0.1:64709_solr    ] o.a.s.c.c.ZkStateReader A cluster state change: [WatchedEvent state:SyncConnected type:NodeDataChanged path:/collections/authCollection/state.json] for collection [authCollection] has occurred - updating... (live nodes size: [3])
   [junit4]   2> 964254 INFO  (zkCallback-3025-thread-1-processing-n:127.0.0.1:64710_solr) [n:127.0.0.1:64710_solr    ] o.a.s.c.c.ZkStateReader A cluster state change: [WatchedEvent state:SyncConnected type:NodeDataChanged path:/collections/authCollection/state.json] for collection [authCollection] has occurred - updating... (live nodes size: [3])
   [junit4]   2> 964254 INFO  (zkCallback-3027-thread-1-processing-n:127.0.0.1:64711_solr) [n:127.0.0.1:64711_solr    ] o.a.s.c.c.ZkStateReader A cluster state change: [WatchedEvent state:SyncConnected type:NodeDataChanged path:/collections/authCollection/state.json] for collection [authCollection] has occurred - updating... (live nodes size: [3])
   [junit4]   2> 964255 INFO  (zkCallback-3027-thread-2-processing-n:127.0.0.1:64711_solr) [n:127.0.0.1:64711_solr    ] o.a.s.c.c.ZkStateReader A cluster state change: [WatchedEvent state:SyncConnected type:NodeDataChanged path:/collections/authCollection/state.json] for collection [authCollection] has occurred - updating... (live nodes size: [3])
   [junit4]   2> 964255 INFO  (zkCallback-3025-thread-2-processing-n:127.0.0.1:64710_solr) [n:127.0.0.1:64710_solr    ] o.a.s.c.c.ZkStateReader A cluster state change: [WatchedEvent state:SyncConnected type:NodeDataChanged path:/collections/authCollection/state.json] for collection [authCollection] has occurred - updating... (live nodes size: [3])
   [junit4]   2> 964256 INFO  (zkCallback-3026-thread-2-processing-n:127.0.0.1:64709_solr) [n:127.0.0.1:64709_solr    ] o.a.s.c.c.ZkStateReader A cluster state change: [WatchedEvent state:SyncConnected type:NodeDataChanged path:/collections/authCollection/state.json] for collection [authCollection] has occurred - updating... (live nodes size: [3])
   [junit4]   2> 965155 INFO  (qtp2055968187-11568) [n:127.0.0.1:64711_solr c:authCollection s:shard1 r:core_node3 x:authCollection_shard1_replica_n1] o.a.s.c.SolrConfig Using Lucene MatchVersion: 7.1.0
   [junit4]   2> 965156 INFO  (qtp1529708741-11559) [n:127.0.0.1:64710_solr c:authCollection s:shard2 r:core_node5 x:authCollection_shard2_replica_n2] o.a.s.c.SolrConfig Using Lucene MatchVersion: 7.1.0
   [junit4]   2> 965161 INFO  (qtp1741919419-11551) [n:127.0.0.1:64709_solr c:authCollection s:shard3 r:core_node6 x:authCollection_shard3_replica_n4] o.a.s.c.SolrConfig Using Lucene MatchVersion: 7.1.0
   [junit4]   2> 965162 INFO  (qtp2055968187-11568) [n:127.0.0.1:64711_solr c:authCollection s:shard1 r:core_node3 x:authCollection_shard1_replica_n1] o.a.s.s.IndexSchema [authCollection_shard1_replica_n1] Schema name=minimal
   [junit4]   2> 965174 INFO  (qtp2055968187-11568) [n:127.0.0.1:64711_solr c:authCollection s:shard1 r:core_node3 x:authCollection_shard1_replica_n1] o.a.s.s.IndexSchema Loaded schema minimal/1.1 with uniqueid field id
   [junit4]   2> 965175 INFO  (qtp2055968187-11568) [n:127.0.0.1:64711_solr c:authCollection s:shard1 r:core_node3 x:authCollection_shard1_replica_n1] o.a.s.c.CoreContainer Creating SolrCore 'authCollection_shard1_replica_n1' using configuration from collection authCollection, trusted=true
   [junit4]   2> 965175 INFO  (qtp2055968187-11568) [n:127.0.0.1:64711_solr c:authCollection s:shard1 r:core_node3 x:authCollection_shard1_replica_n1] o.a.s.m.r.SolrJmxReporter JMX monitoring for 'solr_64711.solr.core.authCollection.shard1.replica_n1' (registry 'solr.core.authCollection.shard1.replica_n1') enabled at server: com.sun.jmx.mbeanserver.JmxMBeanServer@5e60a6f4
   [junit4]   2> 965175 INFO  (qtp2055968187-11568) [n:127.0.0.1:64711_solr c:authCollection s:shard1 r:core_node3 x:authCollection_shard1_replica_n1] o.a.s.c.SolrCore solr.RecoveryStrategy.Builder
   [junit4]   2> 965175 INFO  (qtp2055968187-11568) [n:127.0.0.1:64711_solr c:authCollection s:shard1 r:core_node3 x:authCollection_shard1_replica_n1] o.a.s.c.SolrCore [[authCollection_shard1_replica_n1] ] Opening new SolrCore at [/Users/jenkins/workspace/Lucene-Solr-7.x-MacOSX/solr/build/solr-core/test/J1/temp/solr.security.BasicAuthIntegrationTest_F41D92893DF2B0AB-001/tempDir-001/node3/authCollection_shard1_replica_n1], dataDir=[/Users/jenkins/workspace/Lucene-Solr-7.x-MacOSX/solr/build/solr-core/test/J1/temp/solr.security.BasicAuthIntegrationTest_F41D92893DF2B0AB-001/tempDir-001/node3/./authCollection_shard1_replica_n1/data/]
   [junit4]   2> 965175 INFO  (qtp1529708741-11559) [n:127.0.0.1:64710_solr c:authCollection s:shard2 r:core_node5 x:authCollection_shard2_replica_n2] o.a.s.s.IndexSchema [authCollection_shard2_replica_n2] Schema name=minimal
   [junit4]   2> 965177 INFO  (qtp1529708741-11559) [n:127.0.0.1:64710_solr c:authCollection s:shard2 r:core_node5 x:authCollection_shard2_replica_n2] o.a.s.s.IndexSchema Loaded schema minimal/1.1 with uniqueid field id
   [junit4]   2> 965177 INFO  (qtp1529708741-11559) [n:127.0.0.1:64710_solr c:authCollection s:shard2 r:core_node5 x:authCollection_shard2_replica_n2] o.a.s.c.CoreContainer Creating SolrCore 'authCollection_shard2_replica_n2' using configuration from collection authCollection, trusted=true
   [junit4]   2> 965177 INFO  (qtp1529708741-11559) [n:127.0.0.1:64710_solr c:authCollection s:shard2 r:core_node5 x:authCollection_shard2_replica_n2] o.a.s.m.r.SolrJmxReporter JMX monitoring for 'solr_64710.solr.core.authCollection.shard2.replica_n2' (registry 'solr.core.authCollection.shard2.replica_n2') enabled at server: com.sun.jmx.mbeanserver.JmxMBeanServer@5e60a6f4
   [junit4]   2> 965177 INFO  (qtp1529708741-11559) [n:127.0.0.1:64710_solr c:authCollection s:shard2 r:core_node5 x:authCollection_shard2_replica_n2] o.a.s.c.SolrCore solr.RecoveryStrategy.Builder
   [junit4]   2> 965177 INFO  (qtp1529708741-11559) [n:127.0.0.1:64710_solr c:authCollection s:shard2 r:core_node5 x:authCollection_shard2_replica_n2] o.a.s.c.SolrCore [[authCollection_shard2_replica_n2] ] Opening new SolrCore at [/Users/jenkins/workspace/Lucene-Solr-7.x-MacOSX/solr/build/solr-core/test/J1/temp/solr.security.BasicAuthIntegrationTest_F41D92893DF2B0AB-001/tempDir-001/node2/authCollection_shard2_replica_n2], dataDir=[/Users/jenkins/workspace/Lucene-Solr-7.x-MacOSX/solr/build/solr-core/test/J1/temp/solr.security.BasicAuthIntegrationTest_F41D92893DF2B0AB-001/tempDir-001/node2/./authCollection_shard2_replica_n2/data/]
   [junit4]   2> 965181 INFO  (qtp1741919419-11551) [n:127.0.0.1:64709_solr c:authCollection s:shard3 r:core_node6 x:authCollection_shard3_replica_n4] o.a.s.s.IndexSchema [authCollection_shard3_replica_n4] Schema name=minimal
   [junit4]   2> 965183 INFO  (qtp1741919419-11551) [n:127.0.0.1:64709_solr c:authCollection s:shard3 r:core_node6 x:authCollection_shard3_replica_n4] o.a.s.s.IndexSchema Loaded schema minimal/1.1 with uniqueid field id
   [junit4]   2> 965183 INFO  (qtp1741919419-11551) [n:127.0.0.1:64709_solr c:authCollection s:shard3 r:core_node6 x:authCollection_shard3_replica_n4] o.a.s.c.CoreContainer Creating SolrCore 'authCollection_shard3_replica_n4' using configuration from collection authCollection, trusted=true
   [junit4]   2> 965183 INFO  (qtp1741919419-11551) [n:127.0.0.1:64709_solr c:authCollection s:shard3 r:core_node6 x:authCollection_shard3_replica_n4] o.a.s.m.r.SolrJmxReporter JMX monitoring for 'solr_64709.solr.core.authCollection.shard3.replica_n4' (registry 'solr.core.authCollection.shard3.replica_n4') enabled at server: com.sun.jmx.mbeanserver.JmxMBeanServer@5e60a6f4
   [junit4]   2> 965183 INFO  (qtp1741919419-11551) [n:127.0.0.1:64709_solr c:authCollection s:shard3 r:core_node6 x:authCollection_shard3_replica_n4] o.a.s.c.SolrCore solr.RecoveryStrategy.Builder
   [junit4]   2> 965183 INFO  (qtp1741919419-11551) [n:127.0.0.1:64709_solr c:authCollection s:shard3 r:core_node6 x:authCollection_shard3_replica_n4] o.a.s.c.SolrCore [[authCollection_shard3_replica_n4] ] Opening new SolrCore at [/Users/jenkins/workspace/Lucene-Solr-7.x-MacOSX/solr/build/solr-core/test/J1/temp/solr.security.BasicAuthIntegrationTest_F41D92893DF2B0AB-001/tempDir-001/node1/authCollection_shard3_replica_n4], dataDir=[/Users/jenkins/workspace/Lucene-Solr-7.x-MacOSX/solr/build/solr-core/test/J1/temp/solr.security.BasicAuthIntegrationTest_F41D92893DF2B0AB-001/tempDir-001/node1/./authCollection_shard3_replica_n4/data/]
   [junit4]   2> 965253 INFO  (qtp2055968187-11568) [n:127.0.0.1:64711_solr c:authCollection s:shard1 r:core_node3 x:authCollection_shard1_replica_n1] o.a.s.u.UpdateHandler Using UpdateLog implementation: org.apache.solr.update.UpdateLog
   [junit4]   2> 965253 INFO  (qtp1741919419-11551) [n:127.0.0.1:64709_solr c:authCollection s:shard3 r:core_node6 x:authCollection_shard3_replica_n4] o.a.s.u.UpdateHandler Using UpdateLog implementation: org.apache.solr.update.UpdateLog
   [junit4]   2> 965254 INFO  (qtp1741919419-11551) [n:127.0.0.1:64709_solr c:authCollection s:shard3 r:core_node6 x:authCollection_shard3_replica_n4] o.a.s.u.UpdateLog Initializing UpdateLog: dataDir=null defaultSyncLevel=FLUSH numRecordsToKeep=100 maxNumLogsToKeep=10 numVersionBuckets=65536
   [junit4]   2> 965254 INFO  (qtp2055968187-11568) [n:127.0.0.1:64711_solr c:authCollection s:shard1 r:core_node3 x:authCollection_shard1_replica_n1] o.a.s.u.UpdateLog Initializing UpdateLog: dataDir=null defaultSyncLevel=FLUSH numRecordsToKeep=100 maxNumLogsToKeep=10 numVersionBuckets=65536
   [junit4]   2> 965255 INFO  (qtp1741919419-11551) [n:127.0.0.1:64709_solr c:authCollection s:shard3 r:core_node6 x:authCollection_shard3_replica_n4] o.a.s.u.CommitTracker Hard AutoCommit: disabled
   [junit4]   2> 965255 INFO  (qtp1741919419-11551) [n:127.0.0.1:64709_solr c:authCollection s:shard3 r:core_node6 x:authCollection_shard3_replica_n4] o.a.s.u.CommitTracker Soft AutoCommit: disabled
   [junit4]   2> 965255 INFO  (qtp2055968187-11568) [n:127.0.0.1:64711_solr c:authCollection s:shard1 r:core_node3 x:authCollection_shard1_replica_n1] o.a.s.u.CommitTracker Hard AutoCommit: disabled
   [junit4]   2> 965255 INFO  (qtp2055968187-11568) [n:127.0.0.1:64711_solr c:authCollection s:shard1 r:core_node3 x:authCollection_shard1_replica_n1] o.a.s.u.CommitTracker Soft AutoCommit: disabled
   [junit4]   2> 965256 INFO  (qtp1741919419-11551) [n:127.0.0.1:64709_solr c:authCollection s:shard3 r:core_node6 x:authCollection_shard3_replica_n4] o.a.s.s.SolrIndexSearcher Opening [Searcher@36ff6749[authCollection_shard3_replica_n4] main]
   [junit4]   2> 965256 INFO  (qtp1529708741-11559) [n:127.0.0.1:64710_solr c:authCollection s:shard2 r:core_node5 x:authCollection_shard2_replica_n2] o.a.s.u.UpdateHandler Using UpdateLog implementation: org.apache.solr.update.UpdateLog
   [junit4]   2> 965256 INFO  (qtp1529708741-11559) [n:127.0.0.1:64710_solr c:authCollection s:shard2 r:core_node5 x:authCollection_shard2_replica_n2] o.a.s.u.UpdateLog Initializing UpdateLog: dataDir=null defaultSyncLevel=FLUSH numRecordsToKeep=100 maxNumLogsToKeep=10 numVersionBuckets=65536
   [junit4]   2> 965257 INFO  (qtp1741919419-11551) [n:127.0.0.1:64709_solr c:authCollection s:shard3 r:core_node6 x:authCollection_shard3_replica_n4] o.a.s.r.ManagedResourceStorage Configured ZooKeeperStorageIO with znodeBase: /configs/conf
   [junit4]   2> 965258 INFO  (qtp1741919419-11551) [n:127.0.0.1:64709_solr c:authCollection s:shard3 r:core_node6 x:authCollection_shard3_replica_n4] o.a.s.r.ManagedResourceStorage Loaded null at path _rest_managed.json using ZooKeeperStorageIO:path=/configs/conf
   [junit4]   2> 965258 INFO  (qtp2055968187-11568) [n:127.0.0.1:64711_solr c:authCollection s:shard1 r:core_node3 x:authCollection_shard1_replica_n1] o.a.s.s.SolrIndexSearcher Opening [Searcher@36e7943c[authCollection_shard1_replica_n1] main]
   [junit4]   2> 965258 INFO  (qtp1529708741-11559) [n:127.0.0.1:64710_solr c:authCollection s:shard2 r:core_node5 x:authCollection_shard2_replica_n2] o.a.s.u.CommitTracker Hard AutoCommit: disabled
   [junit4]   2> 965258 INFO  (qtp1529708741-11559) [n:127.0.0.1:64710_solr c:authCollection s:shard2 r:core_node5 x:authCollection_shard2_replica_n2] o.a.s.u.CommitTracker Soft AutoCommit: disabled
   [junit4]   2> 965258 INFO  (qtp1741919419-11551) [n:127.0.0.1:64709_solr c:authCollection s:shard3 r:core_node6 x:authCollection_shard3_replica_n4] o.a.s.h.ReplicationHandler Commits will be reserved for  10000
   [junit4]   2> 965258 INFO  (qtp1741919419-11551) [n:127.0.0.1:64709_solr c:authCollection s:shard3 r:core_node6 x:authCollection_shard3_replica_n4] o.a.s.u.UpdateLog Could not find max version in index or recent updates, using new clock 1579174339278798848
   [junit4]   2> 965259 INFO  (searcherExecutor-4543-thread-1-processing-n:127.0.0.1:64709_solr x:authCollection_shard3_replica_n4 s:shard3 c:authCollection r:core_node6) [n:127.0.0.1:64709_solr c:authCollection s:shard3 r:core_node6 x:authCollection_shard3_replica_n4] o.a.s.c.SolrCore [authCollection_shard3_replica_n4] Registered new searcher Searcher@36ff6749[authCollection_shard3_replica_n4] main{ExitableDirectoryReader(UninvertingDirectoryReader())}
   [junit4]   2> 965260 INFO  (qtp2055968187-11568) [n:127.0.0.1:64711_solr c:authCollection s:shard1 r:core_node3 x:authCollection_shard1_replica_n1] o.a.s.r.ManagedResourceStorage Configured ZooKeeperStorageIO with znodeBase: /configs/conf
   [junit4]   2> 965261 INFO  (qtp2055968187-11568) [n:127.0.0.1:64711_solr c:authCollection s:shard1 r:core_node3 x:authCollection_shard1_replica_n1] o.a.s.r.ManagedResourceStorage Loaded null at path _rest_managed.json using ZooKeeperStorageIO:path=/configs/conf
   [junit4]   2> 965262 INFO  (qtp2055968187-11568) [n:127.0.0.1:64711_solr c:authCollection s:shard1 r:core_node3 x:authCollection_shard1_replica_n1] o.a.s.h.ReplicationHandler Commits will be reserved for  10000
   [junit4]   2> 965262 INFO  (searcherExecutor-4541-thread-1-processing-n:127.0.0.1:64711_solr x:authCollection_shard1_replica_n1 s:shard1 c:authCollection r:core_node3) [n:127.0.0.1:64711_solr c:authCollection s:shard1 r:core_node3 x:authCollection_shard1_replica_n1] o.a.s.c.SolrCore [authCollection_shard1_replica_n1] Registered new searcher Searcher@36e7943c[authCollection_shard1_replica_n1] main{ExitableDirectoryReader(UninvertingDirectoryReader())}
   [junit4]   2> 965262 INFO  (qtp2055968187-11568) [n:127.0.0.1:64711_solr c:authCollection s:shard1 r:core_node3 x:authCollection_shard1_replica_n1] o.a.s.u.UpdateLog Could not find max version in index or recent updates, using new clock 1579174339282993152
   [junit4]   2> 965267 INFO  (qtp1741919419-11551) [n:127.0.0.1:64709_solr c:authCollection s:shard3 r:core_node6 x:authCollection_shard3_replica_n4] o.a.s.c.ShardLeaderElectionContext Enough replicas found to continue.
   [junit4]   2> 965267 INFO  (qtp1741919419-11551) [n:127.0.0.1:64709_solr c:authCollection s:shard3 r:core_node6 x:authCollection_shard3_replica_n4] o.a.s.c.ShardLeaderElectionContext I may be the new leader - try and sync
   [junit4]   2> 965267 INFO  (qtp1741919419-11551) [n:127.0.0.1:64709_solr c:authCollection s:shard3 r:core_node6 x:authCollection_shard3_replica_n4] o.a.s.c.SyncStrategy Sync replicas to http://127.0.0.1:64709/solr/authCollection_shard3_replica_n4/
   [junit4]   2> 965267 INFO  (qtp1741919419-11551) [n:127.0.0.1:64709_solr c:authCollection s:shard3 r:core_node6 x:authCollection_shard3_replica_n4] o.a.s.c.SyncStrategy Sync Success - now sync replicas to me
   [junit4]   2> 965267 INFO  (qtp1741919419-11551) [n:127.0.0.1:64709_solr c:authCollection s:shard3 r:core_node6 x:authCollection_shard3_replica_n4] o.a.s.c.SyncStrategy http://127.0.0.1:64709/solr/authCollection_shard3_replica_n4/ has no replicas
   [junit4]   2> 965267 INFO  (qtp1741919419-11551) [n:127.0.0.1:64709_solr c:authCollection s:shard3 r:core_node6 x:authCollection_shard3_replica_n4] o.a.s.c.ShardLeaderElectionContext Found all replicas participating in election, clear LIR
   [junit4]   2> 965270 INFO  (qtp1529708741-11559) [n:127.0.0.1:64710_solr c:authCollection s:shard2 r:core_node5 x:authCollection_shard2_replica_n2] o.a.s.s.SolrIndexSearcher Opening [Searcher@7b483a97[authCollection_shard2_replica_n2] main]
   [junit4]   2> 965273 INFO  (qtp2055968187-11568) [n:127.0.0.1:64711_solr c:authCollection s:shard1 r:core_node3 x:authCollection_shard1_replica_n1] o.a.s.c.ShardLeaderElectionContext Enough replicas found to continue.
   [junit4]   2> 965273 INFO  (qtp2055968187-11568) [n:127.0.0.1:64711_solr c:authCollection s:shard1 r:core_node3 x:authCollection_shard1_replica_n1] o.a.s.c.ShardLeaderElectionContext I may be the new leader - try and sync
   [junit4]   2> 965273 INFO  (qtp2055968187-11568) [n:127.0.0.1:64711_solr c:authCollection s:shard1 r:core_node3 x:authCollection_shard1_replica_n1] o.a.s.c.SyncStrategy Sync replicas to http://127.0.0.1:64711/solr/authCollection_shard1_replica_n1/
   [junit4]   2> 965273 INFO  (qtp2055968187-11568) [n:127.0.0.1:64711_solr c:authCollection s:shard1 r:core_node3 x:authCollection_shard1_replica_n1] o.a.s.c.SyncStrategy Sync Success - now sync replicas to me
   [junit4]   2> 965273 INFO  (qtp2055968187-11568) [n:127.0.0.1:64711_solr c:authCollection s:shard1 r:core_node3 x:authCollection_shard1_replica_n1] o.a.s.c.SyncStrategy http://127.0.0.1:64711/solr/authCollection_shard1_replica_n1/ has no replicas
   [junit4]   2> 965273 INFO  (qtp2055968187-11568) [n:127.0.0.1:64711_solr c:authCollection s:shard1 r:core_node3 x:authCollection_shard1_replica_n1] o.a.s.c.ShardLeaderElectionContext Found all replicas participating in election, clear LIR
   [junit4]   2> 965274 INFO  (qtp1529708741-11559) [n:127.0.0.1:64710_solr c:authCollection s:shard2 r:core_node5 x:authCollection_shard2_replica_n2] o.a.s.r.ManagedResourceStorage Configured ZooKeeperStorageIO with znodeBase: /configs/conf
   [junit4]   2> 965274 INFO  (qtp1741919419-11551) [n:127.0.0.1:64709_solr c:authCollection s:shard3 r:core_node6 x:authCollection_shard3_replica_n4] o.a.s.c.ShardLeaderElectionContext I am the new leader: http://127.0.0.1:64709/solr/authCollection_shard3_replica_n4/ shard3
   [junit4]   2> 965276 INFO  (qtp1529708741-11559) [n:127.0.0.1:64710_solr c:authCollection s:shard2 r:core_node5 x:authCollection_shard2_replica_n2] o.a.s.r.ManagedResourceStorage Loaded null at path _rest_managed.json using ZooKeeperStorageIO:path=/configs/conf
   [junit4]   2> 965277 INFO  (qtp1529708741-11559) [n:127.0.0.1:64710_solr c:authCollection s:shard2 r:core_node5 x:authCollection_shard2_replica_n2] o.a.s.h.ReplicationHandler Commits will be reserved for  10000
   [junit4]   2> 965278 INFO  (searcherExecutor-4542-thread-1-processing-n:127.0.0.1:64710_solr x:authCollection_shard2_replica_n2 s:shard2 c:authCollection r:core_node5) [n:127.0.0.1:64710_solr c:authCollection s:shard2 r:core_node5 x:authCollection_shard2_replica_n2] o.a.s.c.SolrCore [authCollection_shard2_replica_n2] Registered new searcher Searcher@7b483a97[authCollection_shard2_replica_n2] main{ExitableDirectoryReader(UninvertingDirectoryReader())}
   [junit4]   2> 965278 INFO  (qtp1529708741-11559) [n:127.0.0.1:64710_solr c:authCollection s:shard2 r:core_node5 x:authCollection_shard2_replica_n2] o.a.s.u.UpdateLog Could not find max version in index or recent updates, using new clock 1579174339299770368
   [junit4]   2> 965278 INFO  (qtp2055968187-11568) [n:127.0.0.1:64711_solr c:authCollection s:shard1 r:core_node3 x:authCollection_shard1_replica_n1] o.a.s.c.ShardLeaderElectionContext I am the new leader: http://127.0.0.1:64711/solr/authCollection_shard1_replica_n1/ shard1
   [junit4]   2> 965286 INFO  (qtp1529708741-11559) [n:127.0.0.1:64710_solr c:authCollection s:shard2 r:core_node5 x:authCollection_shard2_replica_n2] o.a.s.c.ShardLeaderElectionContext Enough replicas found to continue.
   [junit4]   2> 965286 INFO  (qtp1529708741-11559) [n:127.0.0.1:64710_solr c:authCollection s:shard2 r:core_node5 x:authCollection_shard2_replica_n2] o.a.s.c.ShardLeaderElectionContext I may be the new leader - try and sync
   [junit4]   2> 965286 INFO  (qtp1529708741-11559) [n:127.0.0.1:64710_solr c:authCollection s:shard2 r:core_node5 x:authCollection_shard2_replica_n2] o.a.s.c.SyncStrategy Sync replicas to http://127.0.0.1:64710/solr/authCollection_shard2_replica_n2/
   [junit4]   2> 965286 INFO  (qtp1529708741-11559) [n:127.0.0.1:64710_solr c:authCollection s:shard2 r:core_node5 x:authCollection_shard2_replica_n2] o.a.s.c.SyncStrategy Sync Success - now sync replicas to me
   [junit4]   2> 965286 INFO  (qtp1529708741-11559) [n:127.0.0.1:64710_solr c:authCollection s:shard2 r:core_node5 x:authCollection_shard2_replica_n2] o.a.s.c.SyncStrategy http://127.0.0.1:64710/solr/authCollection_shard2_replica_n2/ has no replicas
   [junit4]   2> 965286 INFO  (qtp1529708741-11559) [n:127.0.0.1:64710_solr c:authCollection s:shard2 r:core_node5 x:authCollection_shard2_replica_n2] o.a.s.c.ShardLeaderElectionContext Found all replicas participating in election, clear LIR
   [junit4]   2> 965291 INFO  (qtp1529708741-11559) [n:127.0.0.1:64710_solr c:authCollection s:shard2 r:core_node5 x:authCollection_shard2_replica_n2] o.a.s.c.ShardLeaderElectionContext I am the new leader: http://127.0.0.1:64710/solr/authCollection_shard2_replica_n2/ shard2
   [junit4]   2> 965395 INFO  (zkCallback-3026-thread-2-processing-n:127.0.0.1:64709_solr) [n:127.0.0.1:64709_solr    ] o.a.s.c.c.ZkStateReader A cluster state change: [WatchedEvent state:SyncConnected type:NodeDataChanged path:/collections/authCollection/state.json] for collection [authCollection] has occurred - updating... (live nodes size: [3])
   [junit4]   2> 965395 INFO  (zkCallback-3026-thread-1-processing-n:127.0.0.1:64709_solr) [n:127.0.0.1:64709_solr    ] o.a.s.c.c.ZkStateReader A cluster state change: [WatchedEvent state:SyncConnected type:NodeDataChanged path:/collections/authCollection/state.json] for collection [authCollection] has occurred - updating... (live nodes size: [3])
   [junit4]   2> 965395 INFO  (zkCallback-3025-thread-1-processing-n:127.0.0.1:64710_solr) [n:127.0.0.1:64710_solr    ] o.a.s.c.c.ZkStateReader A cluster state change: [WatchedEvent state:SyncConnected type:NodeDataChanged path:/collections/authCollection/state.json] for collection [authCollection] has occurred - updating... (live nodes size: [3])
   [junit4]   2> 965395 INFO  (zkCallback-3027-thread-2-processing-n:127.0.0.1:64711_solr) [n:127.0.0.1:64711_solr    ] o.a.s.c.c.ZkStateReader A cluster state change: [WatchedEvent state:SyncConnected type:NodeDataChanged path:/collections/authCollection/state.json] for collection [authCollection] has occurred - updating... (live nodes size: [3])
   [junit4]   2> 965395 INFO  (zkCallback-3025-thread-2-processing-n:127.0.0.1:64710_solr) [n:127.0.0.1:64710_solr    ] o.a.s.c.c.ZkStateReader A cluster state change: [WatchedEvent state:SyncConnected type:NodeDataChanged path:/collections/authCollection/state.json] for collection [authCollection] has occurred - updating... (live nodes size: [3])
   [junit4]   2> 965395 INFO  (zkCallback-3027-thread-1-processing-n:127.0.0.1:64711_solr) [n:127.0.0.1:64711_solr    ] o.a.s.c.c.ZkStateReader A cluster state change: [WatchedEvent state:SyncConnected type:NodeDataChanged path:/collections/authCollection/state.json] for collection [authCollection] has occurred - updating... (live nodes size: [3])
   [junit4]   2> 965429 INFO  (qtp1529708741-11559) [n:127.0.0.1:64710_solr c:authCollection s:shard2 r:core_node5 x:authCollection_shard2_replica_n2] o.a.s.c.ZkController I am the leader, no recovery necessary
   [junit4]   2> 965432 INFO  (qtp1529708741-11559) [n:127.0.0.1:64710_solr c:authCollection s:shard2 r:core_node5 x:authCollection_shard2_replica_n2] o.a.s.s.HttpSolrCall [admin] webapp=null path=/admin/cores params={qt=/admin/cores&coreNodeName=core_node5&collection.configName=conf&newCollection=true&name=authCollection_shard2_replica_n2&action=CREATE&numShards=3&collection=authCollection&shard=shard2&wt=javabin&version=2&replicaType=NRT} status=0 QTime=1299
   [junit4]   2> 965433 INFO  (qtp2055968187-11568) [n:127.0.0.1:64711_solr c:authCollection s:shard1 r:core_node3 x:authCollection_shard1_replica_n1] o.a.s.c.ZkController I am the leader, no recovery necessary
   [junit4]   2> 965434 INFO  (qtp1741919419-11551) [n:127.0.0.1:64709_solr c:authCollection s:shard3 r:core_node6 x:authCollection_shard3_replica_n4] o.a.s.c.ZkController I am the leader, no recovery necessary
   [junit4]   2> 965435 INFO  (qtp2055968187-11568) [n:127.0.0.1:64711_solr c:authCollection s:shard1 r:core_node3 x:authCollection_shard1_replica_n1] o.a.s.s.HttpSolrCall [admin] webapp=null path=/admin/cores params={qt=/admin/cores&coreNodeName=core_node3&collection.configName=conf&newCollection=true&name=authCollection_shard1_replica_n1&action=CREATE&numShards=3&collection=authCollection&shard=shard1&wt=javabin&version=2&replicaType=NRT} status=0 QTime=1303
   [junit4]   2> 965437 INFO  (qtp1741919419-11551) [n:127.0.0.1:64709_solr c:authCollection s:shard3 r:core_node6 x:authCollection_shard3_replica_n4] o.a.s.s.HttpSolrCall [admin] webapp=null path=/admin/cores params={qt=/admin/cores&coreNodeName=core_node6&collection.configName=conf&newCollection=true&name=authCollection_shard3_replica_n4&action=CREATE&numShards=3&collection=authCollection&shard=shard3&wt=javabin&version=2&replicaType=NRT} status=0 QTime=1306
   [junit4]   2> 965451 INFO  (qtp1741919419-11550) [n:127.0.0.1:64709_solr    ] o.a.s.h.a.CollectionsHandler Wait for new collection to be active for at most 30 seconds. Check all shard replicas
   [junit4]   2> 965559 INFO  (zkCallback-3026-thread-1-processing-n:127.0.0.1:64709_solr) [n:127.0.0.1:64709_solr    ] o.a.s.c.c.ZkStateReader A cluster state change: [WatchedEvent state:SyncConnected type:NodeDataChanged path:/collections/authCollection/state.json] for collection [authCollection] has occurred - updating... (live nodes size: [3])
   [junit4]   2> 965559 INFO  (zkCallback-3025-thread-2-processing-n:127.0.0.1:64710_solr) [n:127.0.0.1:64710_solr    ] o.a.s.c.c.ZkStateReader A cluster state change: [WatchedEvent state:SyncConnected type:NodeDataChanged path:/collections/authCollection/state.json] for collection [authCollection] has occurred - updating... (live nodes size: [3])
   [junit4]   2> 965559 INFO  (zkCallback-3025-thread-1-processing-n:127.0.0.1:64710_solr) [n:127.0.0.1:64710_solr    ] o.a.s.c.c.ZkStateReader A cluster state change: [WatchedEvent state:SyncConnected type:NodeDataChanged path:/collections/authCollection/state.json] for collection [authCollection] has occurred - updating... (live nodes size: [3])
   [junit4]   2> 965559 INFO  (zkCallback-3026-thread-2-processing-n:127.0.0.1:64709_solr) [n:127.0.0.1:64709_solr    ] o.a.s.c.c.ZkStateReader A cluster state change: [WatchedEvent state:SyncConnected type:NodeDataChanged path:/collections/authCollection/state.json] for collection [authCollection] has occurred - updating... (live nodes size: [3])
   [junit4]   2> 965559 INFO  (zkCallback-3027-thread-2-processing-n:127.0.0.1:64711_solr) [n:127.0.0.1:64711_solr    ] o.a.s.c.c.ZkStateReader A cluster state change: [WatchedEvent state:SyncConnected type:NodeDataChanged path:/collections/authCollection/state.json] for collection [authCollection] has occurred - updating... (live nodes size: [3])
   [junit4]   2> 965559 INFO  (zkCallback-3027-thread-1-processing-n:127.0.0.1:64711_solr) [n:127.0.0.1:64711_solr    ] o.a.s.c.c.ZkStateReader A cluster state change: [WatchedEvent state:SyncConnected type:NodeDataChanged path:/collections/authCollection/state.json] for collection [authCollection] has occurred - updating... (live nodes size: [3])
   [junit4]   2> 965771 INFO  (OverseerCollectionConfigSetProcessor-98698396070051847-127.0.0.1:64710_solr-n_0000000000) [n:127.0.0.1:64710_solr    ] o.a.s.c.OverseerTaskQueue Response ZK path: /overseer/collection-queue-work/qnr-0000000000 doesn't exist.  Requestor may have disconnected from ZooKeeper
   [junit4]   2> 966453 INFO  (qtp1741919419-11550) [n:127.0.0.1:64709_solr    ] o.a.s.s.HttpSolrCall [admin] webapp=null path=/admin/collections params={replicationFactor=1&collection.configName=conf&name=authCollection&nrtReplicas=1&action=CREATE&numShards=3&wt=javabin&version=2} status=0 QTime=2690
   [junit4]   2> 966473 INFO  (TEST-BasicAuthIntegrationTest.testBasicAuth-seed#[F41D92893DF2B0AB]) [    ] o.a.s.SolrTestCaseJ4 ###Starting testBasicAuth
   [junit4]   2> 966477 INFO  (qtp1529708741-11561) [n:127.0.0.1:64710_solr    ] o.a.s.s.HttpSolrCall [admin] webapp=null path=/admin/authentication params={} status=0 QTime=0
   [junit4]   2> 966479 INFO  (qtp1529708741-11562) [n:127.0.0.1:64710_solr    ] o.a.s.s.HttpSolrCall [admin] webapp=null path=/admin/authentication params={} status=0 QTime=0
   [junit4]   2> 966479 INFO  (zkCallback-3026-thread-2-processing-n:127.0.0.1:64709_solr) [n:127.0.0.1:64709_solr    ] o.a.s.c.CoreContainer Security node changed, reloading security.json
   [junit4]   2> 966479 INFO  (zkCallback-3025-thread-1-processing-n:127.0.0.1:64710_solr) [n:127.0.0.1:64710_solr    ] o.a.s.c.CoreContainer Security node changed, reloading security.json
   [junit4]   2> 966479 INFO  (zkCallback-3026-thread-2-processing-n:127.0.0.1:64709_solr) [n:127.0.0.1:64709_solr    ] o.a.s.c.CoreContainer Initializing authorization plugin: solr.RuleBasedAuthorizationPlugin
   [junit4]   2> 966479 INFO  (zkCallback-3027-thread-1-processing-n:127.0.0.1:64711_solr) [n:127.0.0.1:64711_solr    ] o.a.s.c.CoreContainer Security node changed, reloading security.json
   [junit4]   2> 966480 INFO  (zkCallback-3027-thread-1-processing-n:127.0.0.1:64711_solr) [n:127.0.0.1:64711_solr    ] o.a.s.c.CoreContainer Initializing authorization plugin: solr.RuleBasedAuthorizationPlugin
   [junit4]   2> 966483 INFO  (zkCallback-3025-thread-1-processing-n:127.0.0.1:64710_solr) [n:127.0.0.1:64710_solr    ] o.a.s.c.CoreContainer Initializing authorization plugin: solr.RuleBasedAuthorizationPlugin
   [junit4]   2> 966532 INFO  (qtp1529708741-11563) [n:127.0.0.1:64710_solr    ] o.a.s.s.HttpSolrCall [admin] webapp=null path=/admin/authentication params={} status=0 QTime=0
   [junit4]   2> 966540 INFO  (TEST-BasicAuthIntegrationTest.testBasicAuth-seed#[F41D92893DF2B0AB]) [    ] o.e.j.s.AbstractConnector Stopped ServerConnector@671748a1{HTTP/1.1,[http/1.1]}{127.0.0.1:0}
   [junit4]   2> 966540 INFO  (TEST-BasicAuthIntegrationTest.testBasicAuth-seed#[F41D92893DF2B0AB]) [    ] o.a.s.c.CoreContainer Shutting down CoreContainer instance=418297979
   [junit4]   2> 966541 INFO  (TEST-BasicAuthIntegrationTest.testBasicAuth-seed#[F41D92893DF2B0AB]) [    ] o.a.s.m.SolrMetricManager Closing metric reporters for registry=solr.node, tag=null
   [junit4]   2> 966541 INFO  (TEST-BasicAuthIntegrationTest.testBasicAuth-seed#[F41D92893DF2B0AB]) [    ] o.a.s.m.r.SolrJmxReporter Closing reporter [org.apache.solr.metrics.reporters.SolrJmxReporter@10a873c8: rootName = solr_64710, domain = solr.node, service url = null, agent id = null] for registry solr.node / com.codahale.metrics.MetricRegistry@20b1772a
   [junit4]   2> 966546 INFO  (TEST-BasicAuthIntegrationTest.testBasicAuth-seed#[F41D92893DF2B0AB]) [    ] o.a.s.m.SolrMetricManager Closing metric reporters for registry=solr.jvm, tag=null
   [junit4]   2> 966546 INFO  (TEST-BasicAuthIntegrationTest.testBasicAuth-seed#[F41D92893DF2B0AB]) [    ] o.a.s.m.r.SolrJmxReporter Closing reporter [org.apache.solr.metrics.reporters.SolrJmxReporter@74f265b2: rootName = solr_64710, domain = solr.jvm, service url = null, agent id = null] for registry solr.jvm / com.codahale.metrics.MetricRegistry@5db04b35
   [junit4]   2> 966550 INFO  (TEST-BasicAuthIntegrationTest.testBasicAuth-seed#[F41D92893DF2B0AB]) [    ] o.a.s.m.SolrMetricManager Closing metric reporters for registry=solr.jetty, tag=null
   [junit4]   2> 966550 INFO  (TEST-BasicAuthIntegrationTest.testBasicAuth-seed#[F41D92893DF2B0AB]) [    ] o.a.s.m.r.SolrJmxReporter Closing reporter [org.apache.solr.metrics.reporters.SolrJmxReporter@1f5ec73b: rootName = solr_64710, domain = solr.jetty, service url = null, agent id = null] for registry solr.jetty / com.codahale.metrics.MetricRegistry@598fd45b
   [junit4]   2> 966551 INFO  (TEST-BasicAuthIntegrationTest.testBasicAuth-seed#[F41D92893DF2B0AB]) [    ] o.a.s.m.SolrMetricManager Closing metric reporters for registry=solr.cluster, tag=null
   [junit4]   2> 966553 INFO  (coreCloseExecutor-4556-thread-1) [n:127.0.0.1:64710_solr c:authCollection s:shard2 r:core_node5 x:authCollection_shard2_replica_n2] o.a.s.c.SolrCore [authCollection_shard2_replica_n2]  CLOSING SolrCore org.apache.solr.core.SolrCore@38417651
   [junit4]   2> 966553 INFO  (coreCloseExecutor-4556-thread-1) [n:127.0.0.1:64710_solr c:authCollection s:shard2 r:core_node5 x:authCollection_shard2_replica_n2] o.a.s.m.SolrMetricManager Closing metric reporters for registry=solr.core.authCollection.shard2.replica_n2, tag=943814225
   [junit4]   2> 966553 INFO  (coreCloseExecutor-4556-thread-1) [n:127.0.0.1:64710_solr c:authCollection s:shard2 r:core_node5 x:authCollection_shard2_replica_n2] o.a.s.m.r.SolrJmxReporter Closing reporter [org.apache.solr.metrics.reporters.SolrJmxReporter@70607d91: rootName = solr_64710, domain = solr.core.authCollection.shard2.replica_n2, service url = null, agent id = null] for registry solr.core.authCollection.shard2.replica_n2 / com.codahale.metrics.MetricRegistry@884c2dd
   [junit4]   2> 966559 INFO  (coreCloseExecutor-4556-thread-1) [n:127.0.0.1:64710_solr c:authCollection s:shard2 r:core_node5 x:authCollection_shard2_replica_n2] o.a.s.m.SolrMetricManager Closing metric reporters for registry=solr.collection.authCollection.shard2.leader, tag=943814225
   [junit4]   2> 966561 INFO  (zkCallback-3027-thread-1-processing-n:127.0.0.1:64711_solr) [n:127.0.0.1:64711_solr    ] o.a.s.c.CoreContainer Initializing authentication plugin: solr.BasicAuthPlugin
   [junit4]   2> 966561 INFO  (zkCallback-3026-thread-2-processing-n:127.0.0.1:64709_solr) [n:127.0.0.1:64709_solr    ] o.a.s.c.CoreContainer Initializing authentication plugin: solr.BasicAuthPlugin
   [junit4]   2> 966562 INFO  (zkCallback-3025-thread-1-processing-n:127.0.0.1:64710_solr) [n:127.0.0.1:64710_solr    ] o.a.s.c.CoreContainer Initializing authentication plugin: solr.BasicAuthPlugin
   [junit4]   2> 966569 INFO  (TEST-BasicAuthIntegrationTest.testBasicAuth-seed#[F41D92893DF2B0AB]) [    ] o.a.s.c.Overseer Overseer (id=98698396070051847-127.0.0.1:64710_solr-n_0000000000) closing
   [junit4]   2> 966570 INFO  (OverseerStateUpdate-98698396070051847-127.0.0.1:64710_solr-n_0000000000) [n:127.0.0.1:64710_solr    ] o.a.s.c.Overseer Overseer Loop exiting : 127.0.0.1:64710_solr
   [junit4]   2> 966573 WARN  (zkCallback-3025-thread-2-processing-n:127.0.0.1:64710_solr) [n:127.0.0.1:64710_solr    ] o.a.s.c.c.ZkStateReader ZooKeeper watch triggered, but Solr cannot talk to ZK: [KeeperErrorCode = Session expired for /live_nodes]
   [junit4]   2> 966575 INFO  (zkCallback-3034-thread-1) [    ] o.a.s.c.c.ZkStateReader Updated live nodes from ZooKeeper... (3) -> (2)
   [junit4]   2> 966576 INFO  (zkCallback-3027-thread-3-processing-n:127.0.0.1:64711_solr) [n:127.0.0.1:64711_solr    ] o.a.s.c.OverseerElectionContext I am going to be the leader 127.0.0.1:64711_solr
   [junit4]   2> 966578 INFO  (zkCallback-3027-thread-3-processing-n:127.0.0.1:64711_solr) [n:127.0.0.1:64711_solr    ] o.a.s.c.Overseer Overseer (id=98698396070051849-127.0.0.1:64711_solr-n_0000000001) starting
   [junit4]   2> 966614 INFO  (zkCallback-3027-thread-1-processing-n:127.0.0.1:64711_solr) [n:127.0.0.1:64711_solr    ] o.a.s.c.CoreContainer PKIAuthenticationPlugin is managing internode requests
   [junit4]   2> 966614 INFO  (zkCallback-3025-thread-1-processing-n:127.0.0.1:64710_solr) [n:127.0.0.1:64710_solr    ] o.a.s.c.CoreContainer PKIAuthenticationPlugin is managing internode requests
   [junit4]   2> 966614 INFO  (zkCallback-3026-thread-2-processing-n:127.0.0.1:64709_solr) [n:127.0.0.1:64709_solr    ] o.a.s.c.CoreContainer PKIAuthenticationPlugin is managing internode requests
   [junit4]   2> 966615 INFO  (TEST-BasicAuthIntegrationTest.testBasicAuth-seed#[F41D92893DF2B0AB]) [    ] o.e.j.s.h.ContextHandler Stopped o.e.j.s.ServletContextHandler@1fc4399c{/solr,null,UNAVAILABLE}
   [junit4]   2> 966615 INFO  (zkCallback-3026-thread-1-processing-n:127.0.0.1:64709_solr) [n:127.0.0.1:64709_solr    ] o.a.s.c.c.ZkStateReader Updated live nodes from ZooKeeper... (3) -> (2)
   [junit4]   2> 966616 INFO  (OverseerStateUpdate-98698396070051849-127.0.0.1:64711_solr-n_0000000001) [n:127.0.0.1:64711_solr    ] o.a.s.c.c.ZkStateReader Updated live nodes from ZooKeeper... (3) -> (2)
   [junit4]   2> 966616 INFO  (TEST-BasicAuthIntegrationTest.testBasicAuth-seed#[F41D92893DF2B0AB]) [    ] o.e.j.s.Server jetty-9.3.20.v20170531
   [junit4]   2> 966618 INFO  (TEST-BasicAuthIntegrationTest.testBasicAuth-seed#[F41D92893DF2B0AB]) [    ] o.e.j.s.h.ContextHandler Started o.e.j.s.ServletContextHandler@2c2b0238{/solr,null,AVAILABLE}
   [junit4]   2> 966618 INFO  (TEST-BasicAuthIntegrationTest.testBasicAuth-seed#[F41D92893DF2B0AB]) [    ] o.e.j.s.AbstractConnector Started ServerConnector@1dec89bf{HTTP/1.1,[http/1.1]}{127.0.0.1:64742}
   [junit4]   2> 966618 INFO  (TEST-BasicAuthIntegrationTest.testBasicAuth-seed#[F41D92893DF2B0AB]) [    ] o.e.j.s.Server Started @971749ms
   [junit4]   2> 966618 INFO  (TEST-BasicAuthIntegrationTest.testBasicAuth-seed#[F41D92893DF2B0AB]) [    ] o.a.s.c.s.e.JettySolrRunner Jetty properties: {hostContext=/solr, hostPort=64742}
   [junit4]   2> 966618 ERROR (TEST-BasicAuthIntegrationTest.testBasicAuth-seed#[F41D92893DF2B0AB]) [    ] o.a.s.u.StartupLoggingUtils Missing Java Option solr.log.dir. Logging may be missing or incomplete.
   [junit4]   2> 966620 INFO  (TEST-BasicAuthIntegrationTest.testBasicAuth-seed#[F41D92893DF2B0AB]) [    ] o.a.s.s.SolrDispatchFilter  ___      _       Welcome to Apache Solr? version 7.1.0
   [junit4]   2> 966620 INFO  (TEST-BasicAuthIntegrationTest.testBasicAuth-seed#[F41D92893DF2B0AB]) [    ] o.a.s.s.SolrDispatchFilter / __| ___| |_ _   Starting in cloud mode on port null
   [junit4]   2> 966620 INFO  (TEST-BasicAuthIntegrationTest.testBasicAuth-seed#[F41D92893DF2B0AB]) [    ] o.a.s.s.SolrDispatchFilter \__ \/ _ \ | '_|  Install dir: null, Default config dir: null
   [junit4]   2> 966620 INFO  (TEST-BasicAuthIntegrationTest.testBasicAuth-seed#[F41D92893DF2B0AB]) [    ] o.a.s.s.SolrDispatchFilter |___/\___/_|_|    Start time: 2017-09-21T18:20:09.860Z
   [junit4]   2> 966622 INFO  (zkCallback-3026-thread-1-processing-n:127.0.0.1:64709_solr) [n:127.0.0.1:64709_solr    ] o.a.s.c.c.ZkStateReader A cluster state change: [WatchedEvent state:SyncConnected type:NodeDataChanged path:/collections/authCollection/state.json] for collection [authCollection] has occurred - updating... (live nodes size: [2])
   [junit4]   2> 966622 INFO  (zkCallback-3026-thread-2-processing-n:127.0.0.1:64709_solr) [n:127.0.0.1:64709_solr    ] o.a.s.c.c.ZkStateReader A cluster state change: [WatchedEvent state:SyncConnected type:NodeDataChanged path:/collections/authCollection/state.json] for collection [authCollection] has occurred - updating... (live nodes size: [2])
   [junit4]   2> 966622 INFO  (zkCallback-3027-thread-2-processing-n:127.0.0.1:64711_solr) [n:127.0.0.1:64711_solr    ] o.a.s.c.c.ZkStateReader A cluster state change: [WatchedEvent state:SyncConnected type:NodeDataChanged path:/collections/authCollection/state.json] for collection [authCollection] has occurred - updating... (live nodes size: [2])
   [junit4]   2> 966624 INFO  (zkCallback-3027-thread-1-processing-n:127.0.0.1:64711_solr) [n:127.0.0.1:64711_solr    ] o.a.s.c.c.ZkStateReader A cluster state change: [WatchedEvent state:SyncConnected type:NodeDataChanged path:/collections/authCollection/state.json] for collection [authCollection] has occurred - updating... (live nodes size: [2])
   [junit4]   2> 966624 INFO  (TEST-BasicAuthIntegrationTest.testBasicAuth-seed#[F41D92893DF2B0AB]) [    ] o.a.s.s.SolrDispatchFilter solr.xml found in ZooKeeper. Loading...
   [junit4]   2> 966633 INFO  (TEST-BasicAuthIntegrationTest.testBasicAuth-seed#[F41D92893DF2B0AB]) [    ] o.a.s.c.ZkContainer Zookeeper client=127.0.0.1:64706/solr
   [junit4]   2> 966647 INFO  (TEST-BasicAuthIntegrationTest.testBasicAuth-seed#[F41D92893DF2B0AB]) [n:127.0.0.1:64742_solr    ] o.a.s.c.c.ZkStateReader Updated live nodes from ZooKeeper... (0) -> (2)
   [junit4]   2> 966650 INFO  (TEST-BasicAuthIntegrationTest.testBasicAuth-seed#[F41D92893DF2B0AB]) [n:127.0.0.1:64742_solr    ] o.a.s.c.Overseer Overseer (id=null) closing
   [junit4]   2> 966653 INFO  (TEST-BasicAuthIntegrationTest.testBasicAuth-seed#[F41D92893DF2B0AB]) [n:127.0.0.1:64742_solr    ] o.a.s.c.ZkController Register node as live in ZooKeeper:/live_nodes/127.0.0.1:64742_solr
   [junit4]   2> 966655 INFO  (zkCallback-3034-thread-1) [    ] o.a.s.c.c.ZkStateReader Updated live nodes from ZooKeeper... (2) -> (3)
   [junit4]   2> 966655 INFO  (zkCallback-3039-thread-1-processing-n:127.0.0.1:64742_solr) [n:127.0.0.1:64742_solr    ] o.a.s.c.c.ZkStateReader Updated live nodes from ZooKeeper... (2) -> (3)
  

[...truncated too long message...]

id=11666, name=Connection evictor, state=TIMED_WAITING, group=TGRP-BasicAuthIntegrationTest]
   [junit4]    >         at java.lang.Thread.sleep(Native Method)
   [junit4]    >         at org.apache.http.impl.client.IdleConnectionEvictor$1.run(IdleConnectionEvictor.java:66)
   [junit4]    >         at java.lang.Thread.run(Thread.java:748)
   [junit4]    >    9) Thread[id=11671, name=TEST-BasicAuthIntegrationTest.testBasicAuth-seed#[F41D92893DF2B0AB]-SendThread(127.0.0.1:64706), state=TIMED_WAITING, group=TGRP-BasicAuthIntegrationTest]
   [junit4]    >         at java.lang.Thread.sleep(Native Method)
   [junit4]    >         at org.apache.zookeeper.client.StaticHostProvider.next(StaticHostProvider.java:101)
   [junit4]    >         at org.apache.zookeeper.ClientCnxn$SendThread.startConnect(ClientCnxn.java:997)
   [junit4]    >         at org.apache.zookeeper.ClientCnxn$SendThread.run(ClientCnxn.java:1060)
   [junit4]    >   10) Thread[id=11683, name=zkCallback-3039-thread-2, state=TIMED_WAITING, group=TGRP-BasicAuthIntegrationTest]
   [junit4]    >         at sun.misc.Unsafe.park(Native Method)
   [junit4]    >         at java.util.concurrent.locks.LockSupport.parkNanos(LockSupport.java:215)
   [junit4]    >         at java.util.concurrent.SynchronousQueue$TransferStack.awaitFulfill(SynchronousQueue.java:460)
   [junit4]    >         at java.util.concurrent.SynchronousQueue$TransferStack.transfer(SynchronousQueue.java:362)
   [junit4]    >         at java.util.concurrent.SynchronousQueue.poll(SynchronousQueue.java:941)
   [junit4]    >         at java.util.concurrent.ThreadPoolExecutor.getTask(ThreadPoolExecutor.java:1073)
   [junit4]    >         at java.util.concurrent.ThreadPoolExecutor.runWorker(ThreadPoolExecutor.java:1134)
   [junit4]    >         at java.util.concurrent.ThreadPoolExecutor$Worker.run(ThreadPoolExecutor.java:624)
   [junit4]    >         at java.lang.Thread.run(Thread.java:748)
   [junit4]    >   11) Thread[id=11673, name=zkCallback-3039-thread-1, state=TIMED_WAITING, group=TGRP-BasicAuthIntegrationTest]
   [junit4]    >         at sun.misc.Unsafe.park(Native Method)
   [junit4]    >         at java.util.concurrent.locks.LockSupport.parkNanos(LockSupport.java:215)
   [junit4]    >         at java.util.concurrent.SynchronousQueue$TransferStack.awaitFulfill(SynchronousQueue.java:460)
   [junit4]    >         at java.util.concurrent.SynchronousQueue$TransferStack.transfer(SynchronousQueue.java:362)
   [junit4]    >         at java.util.concurrent.SynchronousQueue.poll(SynchronousQueue.java:941)
   [junit4]    >         at java.util.concurrent.ThreadPoolExecutor.getTask(ThreadPoolExecutor.java:1073)
   [junit4]    >         at java.util.concurrent.ThreadPoolExecutor.runWorker(ThreadPoolExecutor.java:1134)
   [junit4]    >         at java.util.concurrent.ThreadPoolExecutor$Worker.run(ThreadPoolExecutor.java:624)
   [junit4]    >         at java.lang.Thread.run(Thread.java:748)
   [junit4]    >   12) Thread[id=11690, name=zkCallback-3039-thread-4, state=TIMED_WAITING, group=TGRP-BasicAuthIntegrationTest]
   [junit4]    >         at sun.misc.Unsafe.park(Native Method)
   [junit4]    >         at java.util.concurrent.locks.LockSupport.parkNanos(LockSupport.java:215)
   [junit4]    >         at java.util.concurrent.SynchronousQueue$TransferStack.awaitFulfill(SynchronousQueue.java:460)
   [junit4]    >         at java.util.concurrent.SynchronousQueue$TransferStack.transfer(SynchronousQueue.java:362)
   [junit4]    >         at java.util.concurrent.SynchronousQueue.poll(SynchronousQueue.java:941)
   [junit4]    >         at java.util.concurrent.ThreadPoolExecutor.getTask(ThreadPoolExecutor.java:1073)
   [junit4]    >         at java.util.concurrent.ThreadPoolExecutor.runWorker(ThreadPoolExecutor.java:1134)
   [junit4]    >         at java.util.concurrent.ThreadPoolExecutor$Worker.run(ThreadPoolExecutor.java:624)
   [junit4]    >         at java.lang.Thread.run(Thread.java:748)
   [junit4]    > 	at __randomizedtesting.SeedInfo.seed([F41D92893DF2B0AB]:0)Throwable #2: com.carrotsearch.randomizedtesting.ThreadLeakError: There are still zombie threads that couldn't be terminated:
   [junit4]    >    1) Thread[id=11691, name=zkCallback-3039-thread-5, state=TIMED_WAITING, group=TGRP-BasicAuthIntegrationTest]
   [junit4]    >         at sun.misc.Unsafe.park(Native Method)
   [junit4]    >         at java.util.concurrent.locks.LockSupport.parkNanos(LockSupport.java:215)
   [junit4]    >         at java.util.concurrent.SynchronousQueue$TransferStack.awaitFulfill(SynchronousQueue.java:460)
   [junit4]    >         at java.util.concurrent.SynchronousQueue$TransferStack.transfer(SynchronousQueue.java:362)
   [junit4]    >         at java.util.concurrent.SynchronousQueue.poll(SynchronousQueue.java:941)
   [junit4]    >         at java.util.concurrent.ThreadPoolExecutor.getTask(ThreadPoolExecutor.java:1073)
   [junit4]    >         at java.util.concurrent.ThreadPoolExecutor.runWorker(ThreadPoolExecutor.java:1134)
   [junit4]    >         at java.util.concurrent.ThreadPoolExecutor$Worker.run(ThreadPoolExecutor.java:624)
   [junit4]    >         at java.lang.Thread.run(Thread.java:748)
   [junit4]    >    2) Thread[id=11671, name=TEST-BasicAuthIntegrationTest.testBasicAuth-seed#[F41D92893DF2B0AB]-SendThread(127.0.0.1:64706), state=TIMED_WAITING, group=TGRP-BasicAuthIntegrationTest]
   [junit4]    >         at java.lang.Thread.sleep(Native Method)
   [junit4]    >         at org.apache.zookeeper.client.StaticHostProvider.next(StaticHostProvider.java:101)
   [junit4]    >         at org.apache.zookeeper.ClientCnxn$SendThread.startConnect(ClientCnxn.java:997)
   [junit4]    >         at org.apache.zookeeper.ClientCnxn$SendThread.run(ClientCnxn.java:1060)
   [junit4]    >    3) Thread[id=11683, name=zkCallback-3039-thread-2, state=TIMED_WAITING, group=TGRP-BasicAuthIntegrationTest]
   [junit4]    >         at sun.misc.Unsafe.park(Native Method)
   [junit4]    >         at java.util.concurrent.locks.LockSupport.parkNanos(LockSupport.java:215)
   [junit4]    >         at java.util.concurrent.SynchronousQueue$TransferStack.awaitFulfill(SynchronousQueue.java:460)
   [junit4]    >         at java.util.concurrent.SynchronousQueue$TransferStack.transfer(SynchronousQueue.java:362)
   [junit4]    >         at java.util.concurrent.SynchronousQueue.poll(SynchronousQueue.java:941)
   [junit4]    >         at java.util.concurrent.ThreadPoolExecutor.getTask(ThreadPoolExecutor.java:1073)
   [junit4]    >         at java.util.concurrent.ThreadPoolExecutor.runWorker(ThreadPoolExecutor.java:1134)
   [junit4]    >         at java.util.concurrent.ThreadPoolExecutor$Worker.run(ThreadPoolExecutor.java:624)
   [junit4]    >         at java.lang.Thread.run(Thread.java:748)
   [junit4]    >    4) Thread[id=11673, name=zkCallback-3039-thread-1, state=TIMED_WAITING, group=TGRP-BasicAuthIntegrationTest]
   [junit4]    >         at sun.misc.Unsafe.park(Native Method)
   [junit4]    >         at java.util.concurrent.locks.LockSupport.parkNanos(LockSupport.java:215)
   [junit4]    >         at java.util.concurrent.SynchronousQueue$TransferStack.awaitFulfill(SynchronousQueue.java:460)
   [junit4]    >         at java.util.concurrent.SynchronousQueue$TransferStack.transfer(SynchronousQueue.java:362)
   [junit4]    >         at java.util.concurrent.SynchronousQueue.poll(SynchronousQueue.java:941)
   [junit4]    >         at java.util.concurrent.ThreadPoolExecutor.getTask(ThreadPoolExecutor.java:1073)
   [junit4]    >         at java.util.concurrent.ThreadPoolExecutor.runWorker(ThreadPoolExecutor.java:1134)
   [junit4]    >         at java.util.concurrent.ThreadPoolExecutor$Worker.run(ThreadPoolExecutor.java:624)
   [junit4]    >         at java.lang.Thread.run(Thread.java:748)
   [junit4]    >    5) Thread[id=11689, name=zkCallback-3039-thread-3, state=TIMED_WAITING, group=TGRP-BasicAuthIntegrationTest]
   [junit4]    >         at sun.misc.Unsafe.park(Native Method)
   [junit4]    >         at java.util.concurrent.locks.LockSupport.parkNanos(LockSupport.java:215)
   [junit4]    >         at java.util.concurrent.SynchronousQueue$TransferStack.awaitFulfill(SynchronousQueue.java:460)
   [junit4]    >         at java.util.concurrent.SynchronousQueue$TransferStack.transfer(SynchronousQueue.java:362)
   [junit4]    >         at java.util.concurrent.SynchronousQueue.poll(SynchronousQueue.java:941)
   [junit4]    >         at java.util.concurrent.ThreadPoolExecutor.getTask(ThreadPoolExecutor.java:1073)
   [junit4]    >         at java.util.concurrent.ThreadPoolExecutor.runWorker(ThreadPoolExecutor.java:1134)
   [junit4]    >         at java.util.concurrent.ThreadPoolExecutor$Worker.run(ThreadPoolExecutor.java:624)
   [junit4]    >         at java.lang.Thread.run(Thread.java:748)
   [junit4]    >    6) Thread[id=11690, name=zkCallback-3039-thread-4, state=TIMED_WAITING, group=TGRP-BasicAuthIntegrationTest]
   [junit4]    >         at sun.misc.Unsafe.park(Native Method)
   [junit4]    >         at java.util.concurrent.locks.LockSupport.parkNanos(LockSupport.java:215)
   [junit4]    >         at java.util.concurrent.SynchronousQueue$TransferStack.awaitFulfill(SynchronousQueue.java:460)
   [junit4]    >         at java.util.concurrent.SynchronousQueue$TransferStack.transfer(SynchronousQueue.java:362)
   [junit4]    >         at java.util.concurrent.SynchronousQueue.poll(SynchronousQueue.java:941)
   [junit4]    >         at java.util.concurrent.ThreadPoolExecutor.getTask(ThreadPoolExecutor.java:1073)
   [junit4]    >         at java.util.concurrent.ThreadPoolExecutor.runWorker(ThreadPoolExecutor.java:1134)
   [junit4]    >         at java.util.concurrent.ThreadPoolExecutor$Worker.run(ThreadPoolExecutor.java:624)
   [junit4]    >         at java.lang.Thread.run(Thread.java:748)
   [junit4]    > 	at __randomizedtesting.SeedInfo.seed([F41D92893DF2B0AB]:0)
   [junit4] Completed [255/732 (1!)] on J1 in 28.59s, 1 test, 3 errors <<< FAILURES!

[...truncated 47866 lines...]