You are viewing a plain text version of this content. The canonical link for it is here.
Posted to commits@sling.apache.org by Apache Jenkins Server <je...@builds.apache.org> on 2018/10/01 12:28:26 UTC

Build failed in Jenkins: sling-org-apache-sling-feature-applicationbuilder-1.8 #93

See <https://builds.apache.org/job/sling-org-apache-sling-feature-applicationbuilder-1.8/93/display/redirect?page=changes>

Changes:

[cziegeler] Move file based artifact management into separate package

------------------------------------------
Started by an SCM change
[EnvInject] - Loading node environment variables.
Building remotely on ubuntu-4 (ubuntu trusty) in workspace <https://builds.apache.org/job/sling-org-apache-sling-feature-applicationbuilder-1.8/ws/>
 > git rev-parse --is-inside-work-tree # timeout=10
Fetching changes from the remote Git repository
 > git config remote.origin.url https://github.com/apache/sling-org-apache-sling-feature-applicationbuilder.git # timeout=10
Fetching upstream changes from https://github.com/apache/sling-org-apache-sling-feature-applicationbuilder.git
 > git --version # timeout=10
 > git fetch --tags --progress https://github.com/apache/sling-org-apache-sling-feature-applicationbuilder.git +refs/heads/*:refs/remotes/origin/*
 > git rev-parse origin/master^{commit} # timeout=10
Checking out Revision 7282d7304885d90459f02f65155cef175c50619e (origin/master)
 > git config core.sparsecheckout # timeout=10
 > git checkout -f 7282d7304885d90459f02f65155cef175c50619e
Commit message: "Move file based artifact management into separate package"
 > git rev-list --no-walk b53f44bc3d41655c68fe70f0905917c8bb092214 # timeout=10
Parsing POMs
Established TCP socket on 39768
maven33-agent.jar already up to date
maven33-interceptor.jar already up to date
maven3-interceptor-commons.jar already up to date
[sling-org-apache-sling-feature-applicationbuilder-1.8] $ /home/jenkins/tools/java/latest1.8/bin/java -Xmx4g -Xms4g -cp /home/jenkins/jenkins-slave/maven33-agent.jar:/home/jenkins/tools/maven/apache-maven-3.3.9/boot/plexus-classworlds-2.5.2.jar:/home/jenkins/tools/maven/apache-maven-3.3.9/conf/logging jenkins.maven3.agent.Maven33Main /home/jenkins/tools/maven/apache-maven-3.3.9 /home/jenkins/jenkins-slave/slave.jar /home/jenkins/jenkins-slave/maven33-interceptor.jar /home/jenkins/jenkins-slave/maven3-interceptor-commons.jar 39768
<===[JENKINS REMOTING CAPACITY]===>   channel started
Executing Maven:  -B -f <https://builds.apache.org/job/sling-org-apache-sling-feature-applicationbuilder-1.8/ws/pom.xml> -Dmaven.repo.local=/home/jenkins/jenkins-slave/maven-repositories/0 -U clean deploy
[INFO] Scanning for projects...
[INFO]                                                                         
[INFO] ------------------------------------------------------------------------
[INFO] Building Apache Sling Feature Application Builder 0.1.0-SNAPSHOT
[INFO] ------------------------------------------------------------------------
[INFO] Downloading: http://repository.apache.org/snapshots/org/apache/sling/org.apache.sling.feature/0.1.3-SNAPSHOT/maven-metadata.xml
[INFO] Downloaded: http://repository.apache.org/snapshots/org/apache/sling/org.apache.sling.feature/0.1.3-SNAPSHOT/maven-metadata.xml (1008 B at 2.5 KB/sec)
[INFO] Downloading: http://repository.apache.org/snapshots/org/apache/sling/org.apache.sling.feature.io/0.1.3-SNAPSHOT/maven-metadata.xml
[INFO] Downloaded: http://repository.apache.org/snapshots/org/apache/sling/org.apache.sling.feature.io/0.1.3-SNAPSHOT/maven-metadata.xml (1011 B at 3.3 KB/sec)
[INFO] 
[INFO] --- maven-clean-plugin:3.0.0:clean (default-clean) @ org.apache.sling.feature.applicationbuilder ---
[INFO] Deleting <https://builds.apache.org/job/sling-org-apache-sling-feature-applicationbuilder-1.8/ws/target>
[INFO] 
[INFO] --- maven-enforcer-plugin:3.0.0-M1:enforce (enforce-property-values) @ org.apache.sling.feature.applicationbuilder ---
[INFO] 
[INFO] --- maven-enforcer-plugin:3.0.0-M1:enforce (enforce-java) @ org.apache.sling.feature.applicationbuilder ---
[INFO] 
[INFO] --- maven-enforcer-plugin:3.0.0-M1:enforce (ban-maven-scr-plugin) @ org.apache.sling.feature.applicationbuilder ---
[INFO] 
[INFO] --- maven-remote-resources-plugin:1.5:process (process-resource-bundles) @ org.apache.sling.feature.applicationbuilder ---
[INFO] 
[INFO] --- maven-remote-resources-plugin:1.5:process (default) @ org.apache.sling.feature.applicationbuilder ---
[INFO] 
[INFO] --- maven-resources-plugin:2.7:resources (default-resources) @ org.apache.sling.feature.applicationbuilder ---
[INFO] Using 'UTF-8' encoding to copy filtered resources.
[INFO] skip non existing resourceDirectory <https://builds.apache.org/job/sling-org-apache-sling-feature-applicationbuilder-1.8/ws/src/main/resources>
[INFO] Copying 3 resources
[INFO] Copying 3 resources
[INFO] 
[INFO] --- maven-compiler-plugin:3.7.0:compile (default-compile) @ org.apache.sling.feature.applicationbuilder ---
[INFO] Changes detected - recompiling the module!
[INFO] Compiling 1 source file to <https://builds.apache.org/job/sling-org-apache-sling-feature-applicationbuilder-1.8/ws/target/classes>
[INFO] 
[INFO] --- animal-sniffer-maven-plugin:1.16:check (default) @ org.apache.sling.feature.applicationbuilder ---
[INFO] Checking unresolved references to org.codehaus.mojo.signature:java18:1.0
[INFO] 
[INFO] --- maven-resources-plugin:2.7:testResources (default-testResources) @ org.apache.sling.feature.applicationbuilder ---
[INFO] Using 'UTF-8' encoding to copy filtered resources.
[INFO] Copying 4 resources
[INFO] Copying 3 resources
[INFO] Copying 3 resources
[INFO] 
[INFO] --- maven-compiler-plugin:3.7.0:testCompile (default-testCompile) @ org.apache.sling.feature.applicationbuilder ---
[INFO] No sources to compile
[INFO] 
[INFO] --- maven-surefire-plugin:2.20.1:test (default-test) @ org.apache.sling.feature.applicationbuilder ---
[JENKINS] Recording test results
[INFO] 
[INFO] --- maven-dependency-plugin:3.0.2:unpack-dependencies (unpack-dependencies) @ org.apache.sling.feature.applicationbuilder ---
[INFO] Unpacking /home/jenkins/jenkins-slave/maven-repositories/0/org/apache/felix/org.apache.felix.utils/1.11.0/org.apache.felix.utils-1.11.0.jar to <https://builds.apache.org/job/sling-org-apache-sling-feature-applicationbuilder-1.8/ws/target/classes> with includes "" and excludes "META-INF/MANIFEST.MF"
[INFO] Unpacking /home/jenkins/jenkins-slave/maven-repositories/0/commons-cli/commons-cli/1.3.1/commons-cli-1.3.1.jar to <https://builds.apache.org/job/sling-org-apache-sling-feature-applicationbuilder-1.8/ws/target/classes> with includes "" and excludes "META-INF/MANIFEST.MF"
[INFO] Unpacking /home/jenkins/jenkins-slave/maven-repositories/0/org/apache/sling/org.apache.sling.feature/0.1.3-SNAPSHOT/org.apache.sling.feature-0.1.3-SNAPSHOT.jar to <https://builds.apache.org/job/sling-org-apache-sling-feature-applicationbuilder-1.8/ws/target/classes> with includes "" and excludes "META-INF/MANIFEST.MF"
[INFO] Unpacking /home/jenkins/jenkins-slave/maven-repositories/0/org/apache/sling/org.apache.sling.feature.io/0.1.3-SNAPSHOT/org.apache.sling.feature.io-0.1.3-SNAPSHOT.jar to <https://builds.apache.org/job/sling-org-apache-sling-feature-applicationbuilder-1.8/ws/target/classes> with includes "" and excludes "META-INF/MANIFEST.MF"
[INFO] Unpacking /home/jenkins/jenkins-slave/maven-repositories/0/org/apache/sling/org.apache.sling.commons.johnzon/1.0.0/org.apache.sling.commons.johnzon-1.0.0.jar to <https://builds.apache.org/job/sling-org-apache-sling-feature-applicationbuilder-1.8/ws/target/classes> with includes "" and excludes "META-INF/MANIFEST.MF"
[INFO] Unpacking /home/jenkins/jenkins-slave/maven-repositories/0/org/slf4j/slf4j-api/1.7.25/slf4j-api-1.7.25.jar to <https://builds.apache.org/job/sling-org-apache-sling-feature-applicationbuilder-1.8/ws/target/classes> with includes "" and excludes "META-INF/MANIFEST.MF"
[INFO] Unpacking /home/jenkins/jenkins-slave/maven-repositories/0/org/slf4j/slf4j-simple/1.7.25/slf4j-simple-1.7.25.jar to <https://builds.apache.org/job/sling-org-apache-sling-feature-applicationbuilder-1.8/ws/target/classes> with includes "" and excludes "META-INF/MANIFEST.MF"
[INFO] Unpacking /home/jenkins/jenkins-slave/maven-repositories/0/org/apache/felix/org.apache.felix.converter/1.0.0/org.apache.felix.converter-1.0.0.jar to <https://builds.apache.org/job/sling-org-apache-sling-feature-applicationbuilder-1.8/ws/target/classes> with includes "" and excludes "META-INF/MANIFEST.MF"
[INFO] Unpacking /home/jenkins/jenkins-slave/maven-repositories/0/org/apache/felix/org.apache.felix.configurator/1.0.4/org.apache.felix.configurator-1.0.4.jar to <https://builds.apache.org/job/sling-org-apache-sling-feature-applicationbuilder-1.8/ws/target/classes> with includes "" and excludes "META-INF/MANIFEST.MF"
[INFO] Unpacking /home/jenkins/jenkins-slave/maven-repositories/0/org/osgi/osgi.core/6.0.0/osgi.core-6.0.0.jar to <https://builds.apache.org/job/sling-org-apache-sling-feature-applicationbuilder-1.8/ws/target/classes> with includes "" and excludes "META-INF/MANIFEST.MF"
[WARNING] Attempt to (de-)serialize anonymous class hudson.maven.reporters.BuildInfoRecorder$1; see: https://jenkins.io/redirect/serialization-of-anonymous-classes/
[INFO] 
[INFO] --- maven-jar-plugin:3.0.2:jar (default-jar) @ org.apache.sling.feature.applicationbuilder ---
[INFO] Building jar: <https://builds.apache.org/job/sling-org-apache-sling-feature-applicationbuilder-1.8/ws/target/org.apache.sling.feature.applicationbuilder-0.1.0-SNAPSHOT.jar>
[INFO] 
[INFO] >>> maven-source-plugin:3.0.1:jar (attach-sources) > generate-sources @ org.apache.sling.feature.applicationbuilder >>>
[INFO] 
[INFO] --- maven-enforcer-plugin:3.0.0-M1:enforce (enforce-property-values) @ org.apache.sling.feature.applicationbuilder ---
[INFO] 
[INFO] --- maven-enforcer-plugin:3.0.0-M1:enforce (enforce-java) @ org.apache.sling.feature.applicationbuilder ---
[INFO] 
[INFO] --- maven-enforcer-plugin:3.0.0-M1:enforce (ban-maven-scr-plugin) @ org.apache.sling.feature.applicationbuilder ---
[WARNING] Failed to getClass for org.apache.maven.plugins.source.SourceJarMojo
[INFO] 
[INFO] <<< maven-source-plugin:3.0.1:jar (attach-sources) < generate-sources @ org.apache.sling.feature.applicationbuilder <<<
[INFO] 
[INFO] --- maven-source-plugin:3.0.1:jar (attach-sources) @ org.apache.sling.feature.applicationbuilder ---
[INFO] Building jar: <https://builds.apache.org/job/sling-org-apache-sling-feature-applicationbuilder-1.8/ws/target/org.apache.sling.feature.applicationbuilder-0.1.0-SNAPSHOT-sources.jar>
[INFO] 
[INFO] --- maven-site-plugin:3.5.1:attach-descriptor (attach-descriptor) @ org.apache.sling.feature.applicationbuilder ---
[INFO] 
[INFO] --- ianal-maven-plugin:1.0-alpha-1:verify-legal-files (default) @ org.apache.sling.feature.applicationbuilder ---
[INFO] Checking legal files in: org.apache.sling.feature.applicationbuilder-0.1.0-SNAPSHOT.jar
[INFO] Checking legal files in: org.apache.sling.feature.applicationbuilder-0.1.0-SNAPSHOT-sources.jar
[INFO] 
[INFO] --- apache-rat-plugin:0.11:check (default) @ org.apache.sling.feature.applicationbuilder ---
[INFO] 51 implicit excludes (use -debug for more details).
[INFO] Exclude: DEPENDENCIES
[INFO] Exclude: src/main/appended-resources/META-INF/*
[INFO] Exclude: velocity.log
[INFO] Exclude: target/*
[INFO] Exclude: README.md
[INFO] Exclude: maven-eclipse.xml
[INFO] Exclude: .*
[INFO] Exclude: .*/**
[INFO] Exclude: **/*.json
[INFO] Exclude: DEPENDENCIES
[INFO] Exclude: **/*.rej
[INFO] Exclude: hs_err_*.log
[INFO] Exclude: **/repository/index/*/index-details.txt
[INFO] Exclude: bnd.bnd
[INFO] Exclude: readme.md
[INFO] 5 resources included (use -debug for more details)
[INFO] Rat check: Summary of files. Unapproved: 0 unknown: 0 generated: 0 approved: 4 licence.
[INFO] 
[INFO] --- maven-install-plugin:2.5.2:install (default-install) @ org.apache.sling.feature.applicationbuilder ---
[INFO] Installing <https://builds.apache.org/job/sling-org-apache-sling-feature-applicationbuilder-1.8/ws/target/org.apache.sling.feature.applicationbuilder-0.1.0-SNAPSHOT.jar> to /home/jenkins/jenkins-slave/maven-repositories/0/org/apache/sling/org.apache.sling.feature.applicationbuilder/0.1.0-SNAPSHOT/org.apache.sling.feature.applicationbuilder-0.1.0-SNAPSHOT.jar
[INFO] Installing <https://builds.apache.org/job/sling-org-apache-sling-feature-applicationbuilder-1.8/ws/pom.xml> to /home/jenkins/jenkins-slave/maven-repositories/0/org/apache/sling/org.apache.sling.feature.applicationbuilder/0.1.0-SNAPSHOT/org.apache.sling.feature.applicationbuilder-0.1.0-SNAPSHOT.pom
[INFO] Installing <https://builds.apache.org/job/sling-org-apache-sling-feature-applicationbuilder-1.8/ws/target/org.apache.sling.feature.applicationbuilder-0.1.0-SNAPSHOT-sources.jar> to /home/jenkins/jenkins-slave/maven-repositories/0/org/apache/sling/org.apache.sling.feature.applicationbuilder/0.1.0-SNAPSHOT/org.apache.sling.feature.applicationbuilder-0.1.0-SNAPSHOT-sources.jar
[INFO] 
[INFO] --- maven-deploy-plugin:2.8.2:deploy (default-deploy) @ org.apache.sling.feature.applicationbuilder ---
[INFO] Downloading: https://repository.apache.org/content/repositories/snapshots/org/apache/sling/org.apache.sling.feature.applicationbuilder/0.1.0-SNAPSHOT/maven-metadata.xml
[INFO] Downloaded: https://repository.apache.org/content/repositories/snapshots/org/apache/sling/org.apache.sling.feature.applicationbuilder/0.1.0-SNAPSHOT/maven-metadata.xml (2 KB at 1.3 KB/sec)
[INFO] Uploading: https://repository.apache.org/content/repositories/snapshots/org/apache/sling/org.apache.sling.feature.applicationbuilder/0.1.0-SNAPSHOT/org.apache.sling.feature.applicationbuilder-0.1.0-20181001.122802-80.jar
[INFO] Uploading: https://repository.apache.org/content/repositories/snapshots/org/apache/sling/org.apache.sling.feature.applicationbuilder/0.1.0-SNAPSHOT/org.apache.sling.feature.applicationbuilder-0.1.0-20181001.122802-80.pom
[WARNING] Encountered issue during deployment: Failed to deploy artifacts: Could not transfer artifact org.apache.sling:org.apache.sling.feature.applicationbuilder:jar:0.1.0-20181001.122802-80 from/to apache.snapshots.https (https://repository.apache.org/content/repositories/snapshots): Failed to transfer file: https://repository.apache.org/content/repositories/snapshots/org/apache/sling/org.apache.sling.feature.applicationbuilder/0.1.0-SNAPSHOT/org.apache.sling.feature.applicationbuilder-0.1.0-20181001.122802-80.jar. Return code is: 401, ReasonPhrase: Unauthorized.
[INFO] Retrying deployment attempt 2 of 10
[INFO] Downloading: https://repository.apache.org/content/repositories/snapshots/org/apache/sling/org.apache.sling.feature.applicationbuilder/0.1.0-SNAPSHOT/maven-metadata.xml
[INFO] Downloaded: https://repository.apache.org/content/repositories/snapshots/org/apache/sling/org.apache.sling.feature.applicationbuilder/0.1.0-SNAPSHOT/maven-metadata.xml (2 KB at 1.7 KB/sec)
[INFO] Uploading: https://repository.apache.org/content/repositories/snapshots/org/apache/sling/org.apache.sling.feature.applicationbuilder/0.1.0-SNAPSHOT/org.apache.sling.feature.applicationbuilder-0.1.0-20181001.122804-80.jar
[INFO] Uploading: https://repository.apache.org/content/repositories/snapshots/org/apache/sling/org.apache.sling.feature.applicationbuilder/0.1.0-SNAPSHOT/org.apache.sling.feature.applicationbuilder-0.1.0-20181001.122804-80.pom
[WARNING] Encountered issue during deployment: Failed to deploy artifacts: Could not transfer artifact org.apache.sling:org.apache.sling.feature.applicationbuilder:jar:0.1.0-20181001.122804-80 from/to apache.snapshots.https (https://repository.apache.org/content/repositories/snapshots): Failed to transfer file: https://repository.apache.org/content/repositories/snapshots/org/apache/sling/org.apache.sling.feature.applicationbuilder/0.1.0-SNAPSHOT/org.apache.sling.feature.applicationbuilder-0.1.0-20181001.122804-80.jar. Return code is: 401, ReasonPhrase: Unauthorized.
[INFO] Retrying deployment attempt 3 of 10
[INFO] Downloading: https://repository.apache.org/content/repositories/snapshots/org/apache/sling/org.apache.sling.feature.applicationbuilder/0.1.0-SNAPSHOT/maven-metadata.xml
[INFO] Downloaded: https://repository.apache.org/content/repositories/snapshots/org/apache/sling/org.apache.sling.feature.applicationbuilder/0.1.0-SNAPSHOT/maven-metadata.xml (2 KB at 1.7 KB/sec)
[INFO] Uploading: https://repository.apache.org/content/repositories/snapshots/org/apache/sling/org.apache.sling.feature.applicationbuilder/0.1.0-SNAPSHOT/org.apache.sling.feature.applicationbuilder-0.1.0-20181001.122805-80.jar
[INFO] Uploading: https://repository.apache.org/content/repositories/snapshots/org/apache/sling/org.apache.sling.feature.applicationbuilder/0.1.0-SNAPSHOT/org.apache.sling.feature.applicationbuilder-0.1.0-20181001.122805-80.pom
[WARNING] Encountered issue during deployment: Failed to deploy artifacts: Could not transfer artifact org.apache.sling:org.apache.sling.feature.applicationbuilder:jar:0.1.0-20181001.122805-80 from/to apache.snapshots.https (https://repository.apache.org/content/repositories/snapshots): Failed to transfer file: https://repository.apache.org/content/repositories/snapshots/org/apache/sling/org.apache.sling.feature.applicationbuilder/0.1.0-SNAPSHOT/org.apache.sling.feature.applicationbuilder-0.1.0-20181001.122805-80.jar. Return code is: 401, ReasonPhrase: Unauthorized.
[INFO] Retrying deployment attempt 4 of 10
[INFO] Downloading: https://repository.apache.org/content/repositories/snapshots/org/apache/sling/org.apache.sling.feature.applicationbuilder/0.1.0-SNAPSHOT/maven-metadata.xml
[INFO] Downloaded: https://repository.apache.org/content/repositories/snapshots/org/apache/sling/org.apache.sling.feature.applicationbuilder/0.1.0-SNAPSHOT/maven-metadata.xml (2 KB at 1.6 KB/sec)
[INFO] Uploading: https://repository.apache.org/content/repositories/snapshots/org/apache/sling/org.apache.sling.feature.applicationbuilder/0.1.0-SNAPSHOT/org.apache.sling.feature.applicationbuilder-0.1.0-20181001.122807-80.jar
[INFO] Uploading: https://repository.apache.org/content/repositories/snapshots/org/apache/sling/org.apache.sling.feature.applicationbuilder/0.1.0-SNAPSHOT/org.apache.sling.feature.applicationbuilder-0.1.0-20181001.122807-80.pom
[WARNING] Encountered issue during deployment: Failed to deploy artifacts: Could not transfer artifact org.apache.sling:org.apache.sling.feature.applicationbuilder:jar:0.1.0-20181001.122807-80 from/to apache.snapshots.https (https://repository.apache.org/content/repositories/snapshots): Failed to transfer file: https://repository.apache.org/content/repositories/snapshots/org/apache/sling/org.apache.sling.feature.applicationbuilder/0.1.0-SNAPSHOT/org.apache.sling.feature.applicationbuilder-0.1.0-20181001.122807-80.jar. Return code is: 401, ReasonPhrase: Unauthorized.
[INFO] Retrying deployment attempt 5 of 10
[INFO] Downloading: https://repository.apache.org/content/repositories/snapshots/org/apache/sling/org.apache.sling.feature.applicationbuilder/0.1.0-SNAPSHOT/maven-metadata.xml
[INFO] Downloaded: https://repository.apache.org/content/repositories/snapshots/org/apache/sling/org.apache.sling.feature.applicationbuilder/0.1.0-SNAPSHOT/maven-metadata.xml (2 KB at 1.6 KB/sec)
[INFO] Uploading: https://repository.apache.org/content/repositories/snapshots/org/apache/sling/org.apache.sling.feature.applicationbuilder/0.1.0-SNAPSHOT/org.apache.sling.feature.applicationbuilder-0.1.0-20181001.122809-80.jar
[INFO] Uploading: https://repository.apache.org/content/repositories/snapshots/org/apache/sling/org.apache.sling.feature.applicationbuilder/0.1.0-SNAPSHOT/org.apache.sling.feature.applicationbuilder-0.1.0-20181001.122809-80.pom
[WARNING] Encountered issue during deployment: Failed to deploy artifacts: Could not transfer artifact org.apache.sling:org.apache.sling.feature.applicationbuilder:jar:0.1.0-20181001.122809-80 from/to apache.snapshots.https (https://repository.apache.org/content/repositories/snapshots): Failed to transfer file: https://repository.apache.org/content/repositories/snapshots/org/apache/sling/org.apache.sling.feature.applicationbuilder/0.1.0-SNAPSHOT/org.apache.sling.feature.applicationbuilder-0.1.0-20181001.122809-80.jar. Return code is: 401, ReasonPhrase: Unauthorized.
[INFO] Retrying deployment attempt 6 of 10
[INFO] Downloading: https://repository.apache.org/content/repositories/snapshots/org/apache/sling/org.apache.sling.feature.applicationbuilder/0.1.0-SNAPSHOT/maven-metadata.xml
[INFO] Downloaded: https://repository.apache.org/content/repositories/snapshots/org/apache/sling/org.apache.sling.feature.applicationbuilder/0.1.0-SNAPSHOT/maven-metadata.xml (2 KB at 1.6 KB/sec)
[INFO] Uploading: https://repository.apache.org/content/repositories/snapshots/org/apache/sling/org.apache.sling.feature.applicationbuilder/0.1.0-SNAPSHOT/org.apache.sling.feature.applicationbuilder-0.1.0-20181001.122811-80.jar
[INFO] Uploading: https://repository.apache.org/content/repositories/snapshots/org/apache/sling/org.apache.sling.feature.applicationbuilder/0.1.0-SNAPSHOT/org.apache.sling.feature.applicationbuilder-0.1.0-20181001.122811-80.pom
[WARNING] Encountered issue during deployment: Failed to deploy artifacts: Could not transfer artifact org.apache.sling:org.apache.sling.feature.applicationbuilder:jar:0.1.0-20181001.122811-80 from/to apache.snapshots.https (https://repository.apache.org/content/repositories/snapshots): Failed to transfer file: https://repository.apache.org/content/repositories/snapshots/org/apache/sling/org.apache.sling.feature.applicationbuilder/0.1.0-SNAPSHOT/org.apache.sling.feature.applicationbuilder-0.1.0-20181001.122811-80.jar. Return code is: 401, ReasonPhrase: Unauthorized.
[INFO] Retrying deployment attempt 7 of 10
[INFO] Downloading: https://repository.apache.org/content/repositories/snapshots/org/apache/sling/org.apache.sling.feature.applicationbuilder/0.1.0-SNAPSHOT/maven-metadata.xml
[INFO] Downloaded: https://repository.apache.org/content/repositories/snapshots/org/apache/sling/org.apache.sling.feature.applicationbuilder/0.1.0-SNAPSHOT/maven-metadata.xml (2 KB at 1.6 KB/sec)
[INFO] Uploading: https://repository.apache.org/content/repositories/snapshots/org/apache/sling/org.apache.sling.feature.applicationbuilder/0.1.0-SNAPSHOT/org.apache.sling.feature.applicationbuilder-0.1.0-20181001.122812-80.jar
[INFO] Uploading: https://repository.apache.org/content/repositories/snapshots/org/apache/sling/org.apache.sling.feature.applicationbuilder/0.1.0-SNAPSHOT/org.apache.sling.feature.applicationbuilder-0.1.0-20181001.122812-80.pom
[WARNING] Encountered issue during deployment: Failed to deploy artifacts: Could not transfer artifact org.apache.sling:org.apache.sling.feature.applicationbuilder:jar:0.1.0-20181001.122812-80 from/to apache.snapshots.https (https://repository.apache.org/content/repositories/snapshots): Failed to transfer file: https://repository.apache.org/content/repositories/snapshots/org/apache/sling/org.apache.sling.feature.applicationbuilder/0.1.0-SNAPSHOT/org.apache.sling.feature.applicationbuilder-0.1.0-20181001.122812-80.jar. Return code is: 401, ReasonPhrase: Unauthorized.
[INFO] Retrying deployment attempt 8 of 10
[INFO] Downloading: https://repository.apache.org/content/repositories/snapshots/org/apache/sling/org.apache.sling.feature.applicationbuilder/0.1.0-SNAPSHOT/maven-metadata.xml
[INFO] Downloaded: https://repository.apache.org/content/repositories/snapshots/org/apache/sling/org.apache.sling.feature.applicationbuilder/0.1.0-SNAPSHOT/maven-metadata.xml (2 KB at 1.6 KB/sec)
[INFO] Uploading: https://repository.apache.org/content/repositories/snapshots/org/apache/sling/org.apache.sling.feature.applicationbuilder/0.1.0-SNAPSHOT/org.apache.sling.feature.applicationbuilder-0.1.0-20181001.122814-80.jar
[INFO] Uploading: https://repository.apache.org/content/repositories/snapshots/org/apache/sling/org.apache.sling.feature.applicationbuilder/0.1.0-SNAPSHOT/org.apache.sling.feature.applicationbuilder-0.1.0-20181001.122814-80.pom
[WARNING] Encountered issue during deployment: Failed to deploy artifacts: Could not transfer artifact org.apache.sling:org.apache.sling.feature.applicationbuilder:jar:0.1.0-20181001.122814-80 from/to apache.snapshots.https (https://repository.apache.org/content/repositories/snapshots): Failed to transfer file: https://repository.apache.org/content/repositories/snapshots/org/apache/sling/org.apache.sling.feature.applicationbuilder/0.1.0-SNAPSHOT/org.apache.sling.feature.applicationbuilder-0.1.0-20181001.122814-80.jar. Return code is: 401, ReasonPhrase: Unauthorized.
[INFO] Retrying deployment attempt 9 of 10
[INFO] Downloading: https://repository.apache.org/content/repositories/snapshots/org/apache/sling/org.apache.sling.feature.applicationbuilder/0.1.0-SNAPSHOT/maven-metadata.xml
[INFO] Downloaded: https://repository.apache.org/content/repositories/snapshots/org/apache/sling/org.apache.sling.feature.applicationbuilder/0.1.0-SNAPSHOT/maven-metadata.xml (2 KB at 1.6 KB/sec)
[INFO] Uploading: https://repository.apache.org/content/repositories/snapshots/org/apache/sling/org.apache.sling.feature.applicationbuilder/0.1.0-SNAPSHOT/org.apache.sling.feature.applicationbuilder-0.1.0-20181001.122816-80.jar
[INFO] Uploading: https://repository.apache.org/content/repositories/snapshots/org/apache/sling/org.apache.sling.feature.applicationbuilder/0.1.0-SNAPSHOT/org.apache.sling.feature.applicationbuilder-0.1.0-20181001.122816-80.pom
[WARNING] Encountered issue during deployment: Failed to deploy artifacts: Could not transfer artifact org.apache.sling:org.apache.sling.feature.applicationbuilder:jar:0.1.0-20181001.122816-80 from/to apache.snapshots.https (https://repository.apache.org/content/repositories/snapshots): Failed to transfer file: https://repository.apache.org/content/repositories/snapshots/org/apache/sling/org.apache.sling.feature.applicationbuilder/0.1.0-SNAPSHOT/org.apache.sling.feature.applicationbuilder-0.1.0-20181001.122816-80.jar. Return code is: 401, ReasonPhrase: Unauthorized.
[INFO] Retrying deployment attempt 10 of 10
[INFO] Downloading: https://repository.apache.org/content/repositories/snapshots/org/apache/sling/org.apache.sling.feature.applicationbuilder/0.1.0-SNAPSHOT/maven-metadata.xml
[INFO] Downloaded: https://repository.apache.org/content/repositories/snapshots/org/apache/sling/org.apache.sling.feature.applicationbuilder/0.1.0-SNAPSHOT/maven-metadata.xml (2 KB at 1.6 KB/sec)
[INFO] Uploading: https://repository.apache.org/content/repositories/snapshots/org/apache/sling/org.apache.sling.feature.applicationbuilder/0.1.0-SNAPSHOT/org.apache.sling.feature.applicationbuilder-0.1.0-20181001.122818-80.jar
[INFO] Uploading: https://repository.apache.org/content/repositories/snapshots/org/apache/sling/org.apache.sling.feature.applicationbuilder/0.1.0-SNAPSHOT/org.apache.sling.feature.applicationbuilder-0.1.0-20181001.122818-80.pom
[WARNING] Attempt to (de-)serialize anonymous class hudson.maven.reporters.MavenArtifactArchiver$2; see: https://jenkins.io/redirect/serialization-of-anonymous-classes/
[JENKINS] Archiving disabled
[WARNING] Attempt to (de-)serialize anonymous class hudson.maven.reporters.MavenFingerprinter$1; see: https://jenkins.io/redirect/serialization-of-anonymous-classes/
[JENKINS] Archiving disabled
[INFO] ------------------------------------------------------------------------
[INFO] BUILD FAILURE
[INFO] ------------------------------------------------------------------------
[INFO] Total time: 42.396 s
[INFO] Finished at: 2018-10-01T12:28:24+00:00
[INFO] Final Memory: 76M/3925M
[INFO] ------------------------------------------------------------------------
Waiting for Jenkins to finish collecting data[ERROR] Failed to execute goal org.apache.maven.plugins:maven-deploy-plugin:2.8.2:deploy (default-deploy) on project org.apache.sling.feature.applicationbuilder: Failed to deploy artifacts: Could not transfer artifact org.apache.sling:org.apache.sling.feature.applicationbuilder:jar:0.1.0-20181001.122802-80 from/to apache.snapshots.https (https://repository.apache.org/content/repositories/snapshots): Failed to transfer file: https://repository.apache.org/content/repositories/snapshots/org/apache/sling/org.apache.sling.feature.applicationbuilder/0.1.0-SNAPSHOT/org.apache.sling.feature.applicationbuilder-0.1.0-20181001.122802-80.jar. Return code is: 401, ReasonPhrase: Unauthorized. -> [Help 1]
[ERROR] 
[ERROR] To see the full stack trace of the errors, re-run Maven with the -e switch.
[ERROR] Re-run Maven using the -X switch to enable full debug logging.
[ERROR] 
[ERROR] For more information about the errors and possible solutions, please read the following articles:
[ERROR] [Help 1] http://cwiki.apache.org/confluence/display/MAVEN/MojoExecutionException

channel stopped
Recording test results

Jenkins build is back to normal : sling-org-apache-sling-feature-applicationbuilder-1.8 #94

Posted by Apache Jenkins Server <je...@builds.apache.org>.
See <https://builds.apache.org/job/sling-org-apache-sling-feature-applicationbuilder-1.8/94/display/redirect>