You are viewing a plain text version of this content. The canonical link for it is here.
Posted to builds@beam.apache.org by Apache Jenkins Server <je...@builds.apache.org> on 2023/10/31 08:08:51 UTC

Build failed in Jenkins: beam_LoadTests_Go_GBK_Flink_Batch #1062

See <https://ci-beam.apache.org/job/beam_LoadTests_Go_GBK_Flink_Batch/1062/display/redirect>

Changes:


------------------------------------------
[...truncated 63.66 KB...]
github.com/apache/beam/sdks/v2/go/pkg/beam/core/runtime/exec.(*invoker).initCall.func4({0x0, 0x0, 0x0, 0x0, 0x0}, {0x2c6c700?, 0x1?, 0x1?}, 0xffdf3b645a1cac09?)
	<https://ci-beam.apache.org/job/beam_LoadTests_Go_GBK_Flink_Batch/ws/src/sdks/go/pkg/beam/core/runtime/exec/fn_arity.go>:55 +0x6f
github.com/apache/beam/sdks/v2/go/pkg/beam/core/runtime/exec.(*invoker).invokeWithOpts(0xc0004fac80, {0x1a85c30?, 0xc0002772c0}, {0x0, 0x0, 0x0, 0x0, 0x0}, {0x2c6c700, 0x1, ...}, ...)
	<https://ci-beam.apache.org/job/beam_LoadTests_Go_GBK_Flink_Batch/ws/src/sdks/go/pkg/beam/core/runtime/exec/fn.go>:297 +0xf90
github.com/apache/beam/sdks/v2/go/pkg/beam/core/runtime/exec.(*ParDo).invokeProcessFn(0xc0004e5440, {0x1a85c30, 0xc0002772c0}, {0x0, 0x0, 0x0, 0x0, 0x0}, {0x2c6c700, 0x1, ...}, ...)
	<https://ci-beam.apache.org/job/beam_LoadTests_Go_GBK_Flink_Batch/ws/src/sdks/go/pkg/beam/core/runtime/exec/pardo.go>:508 +0x29f
github.com/apache/beam/sdks/v2/go/pkg/beam/core/runtime/exec.(*ParDo).processSingleWindow(0xc0004e5440, 0xc0009ef050)
	<https://ci-beam.apache.org/job/beam_LoadTests_Go_GBK_Flink_Batch/ws/src/sdks/go/pkg/beam/core/runtime/exec/pardo.go>:194 +0x8f
github.com/apache/beam/sdks/v2/go/pkg/beam/core/runtime/exec.(*ParDo).processMainInput(0x155?, 0x1a85c30?)
	<https://ci-beam.apache.org/job/beam_LoadTests_Go_GBK_Flink_Batch/ws/src/sdks/go/pkg/beam/core/runtime/exec/pardo.go>:172 +0x7f
github.com/apache/beam/sdks/v2/go/pkg/beam/core/runtime/exec.(*ParDo).ProcessElement(0xc0004e5440, {0x18?, 0xc000074400?}, 0xc0004cd008, {0x0, 0x0, 0x0})
	<https://ci-beam.apache.org/job/beam_LoadTests_Go_GBK_Flink_Batch/ws/src/sdks/go/pkg/beam/core/runtime/exec/pardo.go>:156 +0x129
github.com/apache/beam/sdks/v2/go/pkg/beam/core/runtime/exec.(*PCollection).ProcessElement(0xc0009e8a20?, {0x1a85c30?, 0xc000277280?}, 0x424bc5?, {0x0?, 0x200?, 0x80?})
	<https://ci-beam.apache.org/job/beam_LoadTests_Go_GBK_Flink_Batch/ws/src/sdks/go/pkg/beam/core/runtime/exec/pcollection.go>:100 +0x151
github.com/apache/beam/sdks/v2/go/pkg/beam/register.(*emit2[...]).invoke(0x1a87360, {0xc0009e8a18, 0xc0004bc6d0?, 0x1a6f720?}, {0xc0009e8a20?, 0x9, 0x9})
	<https://ci-beam.apache.org/job/beam_LoadTests_Go_GBK_Flink_Batch/ws/src/sdks/go/pkg/beam/register/emitter.go>:80 +0x1fa
github.com/apache/beam/sdks/v2/go/pkg/beam/io/synthetic.(*sourceFn).ProcessElement(0xc0004ebca0, 0x0?, {0xbebc200, 0x1, 0x1, 0x9, 0x0, 0x0}, 0xc00011ce40)
	<https://ci-beam.apache.org/job/beam_LoadTests_Go_GBK_Flink_Batch/ws/src/sdks/go/pkg/beam/io/synthetic/source.go>:151 +0x116
github.com/apache/beam/sdks/v2/go/pkg/beam/register.registerDoFn3x1StructWrappersAndFuncs[...].func2.1({0xbebc200?, 0x1, 0x1, 0x9, 0x0, 0x0}, 0xc000013090)
	<https://ci-beam.apache.org/job/beam_LoadTests_Go_GBK_Flink_Batch/ws/src/sdks/go/pkg/beam/register/register.go>:3382 +0xaa
github.com/apache/beam/sdks/v2/go/pkg/beam/register.(*caller3x1[...]).Call3x1(0x10000?, {0x16d95a0?, 0xc00011ce10?}, {0x1736aa0?, 0xc0001105d0?}, {0x13f2f80?, 0xc00011ce40?})
	<https://ci-beam.apache.org/job/beam_LoadTests_Go_GBK_Flink_Batch/ws/src/sdks/go/pkg/beam/register/register.go>:3371 +0xaf
github.com/apache/beam/sdks/v2/go/pkg/beam/core/runtime/exec.(*invoker).initCall.func13({0x0, 0x0, 0x0, 0x0, 0x0}, {0x2c6c700, 0x1, 0x1}, 0x0?)
	<https://ci-beam.apache.org/job/beam_LoadTests_Go_GBK_Flink_Batch/ws/src/sdks/go/pkg/beam/core/runtime/exec/fn_arity.go>:109 +0xa9
github.com/apache/beam/sdks/v2/go/pkg/beam/core/runtime/exec.(*invoker).invokeWithOpts(0xc0004fadc0, {0x1a85c30?, 0xc000277280}, {0x0, 0x0, 0x0, 0x0, 0x0}, {0x2c6c700, 0x1, ...}, ...)
	<https://ci-beam.apache.org/job/beam_LoadTests_Go_GBK_Flink_Batch/ws/src/sdks/go/pkg/beam/core/runtime/exec/fn.go>:297 +0xf90
github.com/apache/beam/sdks/v2/go/pkg/beam/core/runtime/exec.(*ParDo).invokeProcessFn(0xc0004e5680, {0x1a85c30, 0xc000277280}, {0x0, 0x0, 0x0, 0x0, 0x0}, {0x2c6c700, 0x1, ...}, ...)
	<https://ci-beam.apache.org/job/beam_LoadTests_Go_GBK_Flink_Batch/ws/src/sdks/go/pkg/beam/core/runtime/exec/pardo.go>:508 +0x29f
github.com/apache/beam/sdks/v2/go/pkg/beam/core/runtime/exec.(*ParDo).processSingleWindow(0xc0004e5680, 0xc00052c090)
	<https://ci-beam.apache.org/job/beam_LoadTests_Go_GBK_Flink_Batch/ws/src/sdks/go/pkg/beam/core/runtime/exec/pardo.go>:194 +0x8f
github.com/apache/beam/sdks/v2/go/pkg/beam/core/runtime/exec.(*ProcessSizedElementsAndRestrictions).ProcessElement(0xc000324d20, {0x1a85c30, 0xc00051a180}, 0xc000274a80, {0x0, 0x0, 0x0})
	<https://ci-beam.apache.org/job/beam_LoadTests_Go_GBK_Flink_Batch/ws/src/sdks/go/pkg/beam/core/runtime/exec/sdf.go>:556 +0x62f
github.com/apache/beam/sdks/v2/go/pkg/beam/core/runtime/exec.(*DataSource).Process.func1(0xc00011c9c0, {0xc0004bd328?, 0xc0002e6020?})
	<https://ci-beam.apache.org/job/beam_LoadTests_Go_GBK_Flink_Batch/ws/src/sdks/go/pkg/beam/core/runtime/exec/datasource.go>:240 +0x223
github.com/apache/beam/sdks/v2/go/pkg/beam/core/runtime/exec.(*DataSource).process(0xc0004c29a0, {0x1a85c30, 0xc00051a180}, 0xc0004bd618, 0xc0004bd5f8)
	<https://ci-beam.apache.org/job/beam_LoadTests_Go_GBK_Flink_Batch/ws/src/sdks/go/pkg/beam/core/runtime/exec/datasource.go>:146 +0x4d3
github.com/apache/beam/sdks/v2/go/pkg/beam/core/runtime/exec.(*DataSource).Process(0xc0004c29a0, {0x1a85c30, 0xc00051a180})
	<https://ci-beam.apache.org/job/beam_LoadTests_Go_GBK_Flink_Batch/ws/src/sdks/go/pkg/beam/core/runtime/exec/datasource.go>:214 +0x20a
github.com/apache/beam/sdks/v2/go/pkg/beam/core/runtime/exec.(*Plan).Execute.func2({0x1a85c30?, 0xc00051a180?})
	<https://ci-beam.apache.org/job/beam_LoadTests_Go_GBK_Flink_Batch/ws/src/sdks/go/pkg/beam/core/runtime/exec/plan.go>:151 +0x3b
github.com/apache/beam/sdks/v2/go/pkg/beam/core/runtime/exec.callNoPanic({0x1a85c30?, 0xc00051a180?}, 0x418488?)
	<https://ci-beam.apache.org/job/beam_LoadTests_Go_GBK_Flink_Batch/ws/src/sdks/go/pkg/beam/core/runtime/exec/util.go>:62 +0x62
github.com/apache/beam/sdks/v2/go/pkg/beam/core/runtime/exec.(*Plan).Execute(0xc000031e60, {0x1a85c30, 0xc00051a180}, {0x2c0ef38, 0x1}, {{0x1a84b60?, 0xc000276980?}, {0x1abe418?, 0xc0001cea80?}})
	<https://ci-beam.apache.org/job/beam_LoadTests_Go_GBK_Flink_Batch/ws/src/sdks/go/pkg/beam/core/runtime/exec/plan.go>:150 +0x3b8
github.com/apache/beam/sdks/v2/go/pkg/beam/core/runtime/harness.(*control).handleInstruction(0xc0004aa000, {0x1a85820?, 0xc000297e30?}, 0xc000126d70)
	<https://ci-beam.apache.org/job/beam_LoadTests_Go_GBK_Flink_Batch/ws/src/sdks/go/pkg/beam/core/runtime/harness/harness.go>:409 +0x9f8
github.com/apache/beam/sdks/v2/go/pkg/beam/core/runtime/harness.MainWithOptions.func4({0x1a85820?, 0xc000297e30?}, 0x0?)
	<https://ci-beam.apache.org/job/beam_LoadTests_Go_GBK_Flink_Batch/ws/src/sdks/go/pkg/beam/core/runtime/harness/harness.go>:195 +0x74
created by github.com/apache/beam/sdks/v2/go/pkg/beam/core/runtime/harness.MainWithOptions in goroutine 1
	<https://ci-beam.apache.org/job/beam_LoadTests_Go_GBK_Flink_Batch/ws/src/sdks/go/pkg/beam/core/runtime/harness/harness.go>:213 +0xede
2023/10/31 08:08:49 Job[load0tests0go0flink0batch0gbk0101031065336-root-1031080636-a135792a_b637ee86-9b64-48ec-b5df-d9eb6d064f2a] state: FAILED
2023/10/31 08:08:50 Failed to execute job: job load0tests0go0flink0batch0gbk0101031065336-root-1031080636-a135792a_b637ee86-9b64-48ec-b5df-d9eb6d064f2a failed:
java.lang.RuntimeException: Error received from SDK harness for instruction 3: process bundle failed for instruction 3 using plan 1-3 : panic: datamgr.go [{3 fn/write/n4:0}]: error flushing buffer of length 4000000
	caused by:
rpc error: code = Unknown desc = 
Full error:
while executing Process for Plan[1-3]:
1: DataSource[S[fn/read/n2/SplitAndSize0:0@localhost:41949], local_output] Out:6 Coder:W;fn/wire/n2/SplitAndSize0:0<KV;c5/SplitAndSize0<KV;c5/PairWithRestriction0<R;c5[synthetic.SourceConfig],KV;c9<offsetrange.Restriction[offsetrange.Restriction;c6];c7,bool;c8>>,double;DoubleCoder0>>!GWC 
6: SDF.ProcessSizedElementsAndRestrictions[synthetic.sourceFn] UID:6 Out:[5]
5: PCollection[n3] Out:[4]
4: ParDo[load.RuntimeMonitor] Out:[2] Sig: func([]uint8, []uint8, func([]uint8, []uint8)), SideInputs: []
3: PCollection[n4] Out:[2]
2: DataSink[S[fn/write/n4:0@localhost:41949]] Coder:W;fn/wire/n4:0<KV;c1<bytes;c0,bytes;c0>>!GWC
	caused by:
panic: datamgr.go [{3 fn/write/n4:0}]: error flushing buffer of length 4000000
	caused by:
rpc error: code = Unknown desc =  goroutine 25 [running]:
runtime/debug.Stack()
	/home/jenkins/sdk/go1.21.3/src/runtime/debug/stack.go:24 +0x5e
github.com/apache/beam/sdks/v2/go/pkg/beam/core/runtime/exec.callNoPanic.func1()
	<https://ci-beam.apache.org/job/beam_LoadTests_Go_GBK_Flink_Batch/ws/src/sdks/go/pkg/beam/core/runtime/exec/util.go>:58 +0x94
panic({0x15d5e80?, 0xc00051a1c0?})
	/home/jenkins/sdk/go1.21.3/src/runtime/panic.go:914 +0x21f
github.com/apache/beam/sdks/v2/go/pkg/beam/register.(*emit2[...]).invoke(0x1a87360, {0xc0009e8a18, 0x40d39a?, 0x43c199?}, {0xc0009e8a20?, 0x9, 0x9})
	<https://ci-beam.apache.org/job/beam_LoadTests_Go_GBK_Flink_Batch/ws/src/sdks/go/pkg/beam/register/emitter.go>:81 +0x213
github.com/apache/beam/sdks/v2/go/test/load.(*RuntimeMonitor).ProcessElement(0x2cc1820?, {0xc0009e8a18?, 0x1?, 0x1?}, {0xc0009e8a20?, 0x9?, 0x9?}, 0xc00011c960?)
	<https://ci-beam.apache.org/job/beam_LoadTests_Go_GBK_Flink_Batch/ws/src/sdks/go/test/load/util.go>:87 +0x33
github.com/apache/beam/sdks/v2/go/pkg/beam/register.registerDoFn3x0StructWrappersAndFuncs[...].func2.1({0xc0009e8a20, 0x9, 0x9}, 0x46e472)
	<https://ci-beam.apache.org/job/beam_LoadTests_Go_GBK_Flink_Batch/ws/src/sdks/go/pkg/beam/register/register.go>:2469 +0x92
github.com/apache/beam/sdks/v2/go/pkg/beam/register.(*caller3x0[...]).Call3x0(0xc0004bbe40?, {0x13a2240?, 0xc0009ecd20?}, {0x13a2240?, 0xc0009ecd38?}, {0x13f2f80?, 0xc00011c960?})
	<https://ci-beam.apache.org/job/beam_LoadTests_Go_GBK_Flink_Batch/ws/src/sdks/go/pkg/beam/register/register.go>:2458 +0x70
github.com/apache/beam/sdks/v2/go/pkg/beam/core/runtime/exec.(*invoker).initCall.func4({0x0, 0x0, 0x0, 0x0, 0x0}, {0x2c6c700?, 0x1?, 0x1?}, 0xffdf3b645a1cac09?)
	<https://ci-beam.apache.org/job/beam_LoadTests_Go_GBK_Flink_Batch/ws/src/sdks/go/pkg/beam/core/runtime/exec/fn_arity.go>:55 +0x6f
github.com/apache/beam/sdks/v2/go/pkg/beam/core/runtime/exec.(*invoker).invokeWithOpts(0xc0004fac80, {0x1a85c30?, 0xc0002772c0}, {0x0, 0x0, 0x0, 0x0, 0x0}, {0x2c6c700, 0x1, ...}, ...)
	<https://ci-beam.apache.org/job/beam_LoadTests_Go_GBK_Flink_Batch/ws/src/sdks/go/pkg/beam/core/runtime/exec/fn.go>:297 +0xf90
github.com/apache/beam/sdks/v2/go/pkg/beam/core/runtime/exec.(*ParDo).invokeProcessFn(0xc0004e5440, {0x1a85c30, 0xc0002772c0}, {0x0, 0x0, 0x0, 0x0, 0x0}, {0x2c6c700, 0x1, ...}, ...)
	<https://ci-beam.apache.org/job/beam_LoadTests_Go_GBK_Flink_Batch/ws/src/sdks/go/pkg/beam/core/runtime/exec/pardo.go>:508 +0x29f
github.com/apache/beam/sdks/v2/go/pkg/beam/core/runtime/exec.(*ParDo).processSingleWindow(0xc0004e5440, 0xc0009ef050)
	<https://ci-beam.apache.org/job/beam_LoadTests_Go_GBK_Flink_Batch/ws/src/sdks/go/pkg/beam/core/runtime/exec/pardo.go>:194 +0x8f
github.com/apache/beam/sdks/v2/go/pkg/beam/core/runtime/exec.(*ParDo).processMainInput(0x155?, 0x1a85c30?)
	<https://ci-beam.apache.org/job/beam_LoadTests_Go_GBK_Flink_Batch/ws/src/sdks/go/pkg/beam/core/runtime/exec/pardo.go>:172 +0x7f
github.com/apache/beam/sdks/v2/go/pkg/beam/core/runtime/exec.(*ParDo).ProcessElement(0xc0004e5440, {0x18?, 0xc000074400?}, 0xc0004cd008, {0x0, 0x0, 0x0})
	<https://ci-beam.apache.org/job/beam_LoadTests_Go_GBK_Flink_Batch/ws/src/sdks/go/pkg/beam/core/runtime/exec/pardo.go>:156 +0x129
github.com/apache/beam/sdks/v2/go/pkg/beam/core/runtime/exec.(*PCollection).ProcessElement(0xc0009e8a20?, {0x1a85c30?, 0xc000277280?}, 0x424bc5?, {0x0?, 0x200?, 0x80?})
	<https://ci-beam.apache.org/job/beam_LoadTests_Go_GBK_Flink_Batch/ws/src/sdks/go/pkg/beam/core/runtime/exec/pcollection.go>:100 +0x151
github.com/apache/beam/sdks/v2/go/pkg/beam/register.(*emit2[...]).invoke(0x1a87360, {0xc0009e8a18, 0xc0004bc6d0?, 0x1a6f720?}, {0xc0009e8a20?, 0x9, 0x9})
	<https://ci-beam.apache.org/job/beam_LoadTests_Go_GBK_Flink_Batch/ws/src/sdks/go/pkg/beam/register/emitter.go>:80 +0x1fa
github.com/apache/beam/sdks/v2/go/pkg/beam/io/synthetic.(*sourceFn).ProcessElement(0xc0004ebca0, 0x0?, {0xbebc200, 0x1, 0x1, 0x9, 0x0, 0x0}, 0xc00011ce40)
	<https://ci-beam.apache.org/job/beam_LoadTests_Go_GBK_Flink_Batch/ws/src/sdks/go/pkg/beam/io/synthetic/source.go>:151 +0x116
github.com/apache/beam/sdks/v2/go/pkg/beam/register.registerDoFn3x1StructWrappersAndFuncs[...].func2.1({0xbebc200?, 0x1, 0x1, 0x9, 0x0, 0x0}, 0xc000013090)
	<https://ci-beam.apache.org/job/beam_LoadTests_Go_GBK_Flink_Batch/ws/src/sdks/go/pkg/beam/register/register.go>:3382 +0xaa
github.com/apache/beam/sdks/v2/go/pkg/beam/register.(*caller3x1[...]).Call3x1(0x10000?, {0x16d95a0?, 0xc00011ce10?}, {0x1736aa0?, 0xc0001105d0?}, {0x13f2f80?, 0xc00011ce40?})
	<https://ci-beam.apache.org/job/beam_LoadTests_Go_GBK_Flink_Batch/ws/src/sdks/go/pkg/beam/register/register.go>:3371 +0xaf
github.com/apache/beam/sdks/v2/go/pkg/beam/core/runtime/exec.(*invoker).initCall.func13({0x0, 0x0, 0x0, 0x0, 0x0}, {0x2c6c700, 0x1, 0x1}, 0x0?)
	<https://ci-beam.apache.org/job/beam_LoadTests_Go_GBK_Flink_Batch/ws/src/sdks/go/pkg/beam/core/runtime/exec/fn_arity.go>:109 +0xa9
github.com/apache/beam/sdks/v2/go/pkg/beam/core/runtime/exec.(*invoker).invokeWithOpts(0xc0004fadc0, {0x1a85c30?, 0xc000277280}, {0x0, 0x0, 0x0, 0x0, 0x0}, {0x2c6c700, 0x1, ...}, ...)
	<https://ci-beam.apache.org/job/beam_LoadTests_Go_GBK_Flink_Batch/ws/src/sdks/go/pkg/beam/core/runtime/exec/fn.go>:297 +0xf90
github.com/apache/beam/sdks/v2/go/pkg/beam/core/runtime/exec.(*ParDo).invokeProcessFn(0xc0004e5680, {0x1a85c30, 0xc000277280}, {0x0, 0x0, 0x0, 0x0, 0x0}, {0x2c6c700, 0x1, ...}, ...)
	<https://ci-beam.apache.org/job/beam_LoadTests_Go_GBK_Flink_Batch/ws/src/sdks/go/pkg/beam/core/runtime/exec/pardo.go>:508 +0x29f
github.com/apache/beam/sdks/v2/go/pkg/beam/core/runtime/exec.(*ParDo).processSingleWindow(0xc0004e5680, 0xc00052c090)
	<https://ci-beam.apache.org/job/beam_LoadTests_Go_GBK_Flink_Batch/ws/src/sdks/go/pkg/beam/core/runtime/exec/pardo.go>:194 +0x8f
github.com/apache/beam/sdks/v2/go/pkg/beam/core/runtime/exec.(*ProcessSizedElementsAndRestrictions).ProcessElement(0xc000324d20, {0x1a85c30, 0xc00051a180}, 0xc000274a80, {0x0, 0x0, 0x0})
	<https://ci-beam.apache.org/job/beam_LoadTests_Go_GBK_Flink_Batch/ws/src/sdks/go/pkg/beam/core/runtime/exec/sdf.go>:556 +0x62f
github.com/apache/beam/sdks/v2/go/pkg/beam/core/runtime/exec.(*DataSource).Process.func1(0xc00011c9c0, {0xc0004bd328?, 0xc0002e6020?})
	<https://ci-beam.apache.org/job/beam_LoadTests_Go_GBK_Flink_Batch/ws/src/sdks/go/pkg/beam/core/runtime/exec/datasource.go>:240 +0x223
github.com/apache/beam/sdks/v2/go/pkg/beam/core/runtime/exec.(*DataSource).process(0xc0004c29a0, {0x1a85c30, 0xc00051a180}, 0xc0004bd618, 0xc0004bd5f8)
	<https://ci-beam.apache.org/job/beam_LoadTests_Go_GBK_Flink_Batch/ws/src/sdks/go/pkg/beam/core/runtime/exec/datasource.go>:146 +0x4d3
github.com/apache/beam/sdks/v2/go/pkg/beam/core/runtime/exec.(*DataSource).Process(0xc0004c29a0, {0x1a85c30, 0xc00051a180})
	<https://ci-beam.apache.org/job/beam_LoadTests_Go_GBK_Flink_Batch/ws/src/sdks/go/pkg/beam/core/runtime/exec/datasource.go>:214 +0x20a
github.com/apache/beam/sdks/v2/go/pkg/beam/core/runtime/exec.(*Plan).Execute.func2({0x1a85c30?, 0xc00051a180?})
	<https://ci-beam.apache.org/job/beam_LoadTests_Go_GBK_Flink_Batch/ws/src/sdks/go/pkg/beam/core/runtime/exec/plan.go>:151 +0x3b
github.com/apache/beam/sdks/v2/go/pkg/beam/core/runtime/exec.callNoPanic({0x1a85c30?, 0xc00051a180?}, 0x418488?)
	<https://ci-beam.apache.org/job/beam_LoadTests_Go_GBK_Flink_Batch/ws/src/sdks/go/pkg/beam/core/runtime/exec/util.go>:62 +0x62
github.com/apache/beam/sdks/v2/go/pkg/beam/core/runtime/exec.(*Plan).Execute(0xc000031e60, {0x1a85c30, 0xc00051a180}, {0x2c0ef38, 0x1}, {{0x1a84b60?, 0xc000276980?}, {0x1abe418?, 0xc0001cea80?}})
	<https://ci-beam.apache.org/job/beam_LoadTests_Go_GBK_Flink_Batch/ws/src/sdks/go/pkg/beam/core/runtime/exec/plan.go>:150 +0x3b8
github.com/apache/beam/sdks/v2/go/pkg/beam/core/runtime/harness.(*control).handleInstruction(0xc0004aa000, {0x1a85820?, 0xc000297e30?}, 0xc000126d70)
	<https://ci-beam.apache.org/job/beam_LoadTests_Go_GBK_Flink_Batch/ws/src/sdks/go/pkg/beam/core/runtime/harness/harness.go>:409 +0x9f8
github.com/apache/beam/sdks/v2/go/pkg/beam/core/runtime/harness.MainWithOptions.func4({0x1a85820?, 0xc000297e30?}, 0x0?)
	<https://ci-beam.apache.org/job/beam_LoadTests_Go_GBK_Flink_Batch/ws/src/sdks/go/pkg/beam/core/runtime/harness/harness.go>:195 +0x74
created by github.com/apache/beam/sdks/v2/go/pkg/beam/core/runtime/harness.MainWithOptions in goroutine 1
	<https://ci-beam.apache.org/job/beam_LoadTests_Go_GBK_Flink_Batch/ws/src/sdks/go/pkg/beam/core/runtime/harness/harness.go>:213 +0xede
panic: Failed to execute job: job load0tests0go0flink0batch0gbk0101031065336-root-1031080636-a135792a_b637ee86-9b64-48ec-b5df-d9eb6d064f2a failed:
java.lang.RuntimeException: Error received from SDK harness for instruction 3: process bundle failed for instruction 3 using plan 1-3 : panic: datamgr.go [{3 fn/write/n4:0}]: error flushing buffer of length 4000000
	caused by:
rpc error: code = Unknown desc = 
Full error:
while executing Process for Plan[1-3]:
1: DataSource[S[fn/read/n2/SplitAndSize0:0@localhost:41949], local_output] Out:6 Coder:W;fn/wire/n2/SplitAndSize0:0<KV;c5/SplitAndSize0<KV;c5/PairWithRestriction0<R;c5[synthetic.SourceConfig],KV;c9<offsetrange.Restriction[offsetrange.Restriction;c6];c7,bool;c8>>,double;DoubleCoder0>>!GWC 
6: SDF.ProcessSizedElementsAndRestrictions[synthetic.sourceFn] UID:6 Out:[5]
5: PCollection[n3] Out:[4]
4: ParDo[load.RuntimeMonitor] Out:[2] Sig: func([]uint8, []uint8, func([]uint8, []uint8)), SideInputs: []
3: PCollection[n4] Out:[2]
2: DataSink[S[fn/write/n4:0@localhost:41949]] Coder:W;fn/wire/n4:0<KV;c1<bytes;c0,bytes;c0>>!GWC
	caused by:
panic: datamgr.go [{3 fn/write/n4:0}]: error flushing buffer of length 4000000
	caused by:
rpc error: code = Unknown desc =  goroutine 25 [running]:
runtime/debug.Stack()
	/home/jenkins/sdk/go1.21.3/src/runtime/debug/stack.go:24 +0x5e
github.com/apache/beam/sdks/v2/go/pkg/beam/core/runtime/exec.callNoPanic.func1()
	<https://ci-beam.apache.org/job/beam_LoadTests_Go_GBK_Flink_Batch/ws/src/sdks/go/pkg/beam/core/runtime/exec/util.go>:58 +0x94
panic({0x15d5e80?, 0xc00051a1c0?})
	/home/jenkins/sdk/go1.21.3/src/runtime/panic.go:914 +0x21f
github.com/apache/beam/sdks/v2/go/pkg/beam/register.(*emit2[...]).invoke(0x1a87360, {0xc0009e8a18, 0x40d39a?, 0x43c199?}, {0xc0009e8a20?, 0x9, 0x9})
	<https://ci-beam.apache.org/job/beam_LoadTests_Go_GBK_Flink_Batch/ws/src/sdks/go/pkg/beam/register/emitter.go>:81 +0x213
github.com/apache/beam/sdks/v2/go/test/load.(*RuntimeMonitor).ProcessElement(0x2cc1820?, {0xc0009e8a18?, 0x1?, 0x1?}, {0xc0009e8a20?, 0x9?, 0x9?}, 0xc00011c960?)
	<https://ci-beam.apache.org/job/beam_LoadTests_Go_GBK_Flink_Batch/ws/src/sdks/go/test/load/util.go>:87 +0x33
github.com/apache/beam/sdks/v2/go/pkg/beam/register.registerDoFn3x0StructWrappersAndFuncs[...].func2.1({0xc0009e8a20, 0x9, 0x9}, 0x46e472)
	<https://ci-beam.apache.org/job/beam_LoadTests_Go_GBK_Flink_Batch/ws/src/sdks/go/pkg/beam/register/register.go>:2469 +0x92
github.com/apache/beam/sdks/v2/go/pkg/beam/register.(*caller3x0[...]).Call3x0(0xc0004bbe40?, {0x13a2240?, 0xc0009ecd20?}, {0x13a2240?, 0xc0009ecd38?}, {0x13f2f80?, 0xc00011c960?})
	<https://ci-beam.apache.org/job/beam_LoadTests_Go_GBK_Flink_Batch/ws/src/sdks/go/pkg/beam/register/register.go>:2458 +0x70
github.com/apache/beam/sdks/v2/go/pkg/beam/core/runtime/exec.(*invoker).initCall.func4({0x0, 0x0, 0x0, 0x0, 0x0}, {0x2c6c700?, 0x1?, 0x1?}, 0xffdf3b645a1cac09?)
	<https://ci-beam.apache.org/job/beam_LoadTests_Go_GBK_Flink_Batch/ws/src/sdks/go/pkg/beam/core/runtime/exec/fn_arity.go>:55 +0x6f
github.com/apache/beam/sdks/v2/go/pkg/beam/core/runtime/exec.(*invoker).invokeWithOpts(0xc0004fac80, {0x1a85c30?, 0xc0002772c0}, {0x0, 0x0, 0x0, 0x0, 0x0}, {0x2c6c700, 0x1, ...}, ...)
	<https://ci-beam.apache.org/job/beam_LoadTests_Go_GBK_Flink_Batch/ws/src/sdks/go/pkg/beam/core/runtime/exec/fn.go>:297 +0xf90
github.com/apache/beam/sdks/v2/go/pkg/beam/core/runtime/exec.(*ParDo).invokeProcessFn(0xc0004e5440, {0x1a85c30, 0xc0002772c0}, {0x0, 0x0, 0x0, 0x0, 0x0}, {0x2c6c700, 0x1, ...}, ...)
	<https://ci-beam.apache.org/job/beam_LoadTests_Go_GBK_Flink_Batch/ws/src/sdks/go/pkg/beam/core/runtime/exec/pardo.go>:508 +0x29f
github.com/apache/beam/sdks/v2/go/pkg/beam/core/runtime/exec.(*ParDo).processSingleWindow(0xc0004e5440, 0xc0009ef050)
	<https://ci-beam.apache.org/job/beam_LoadTests_Go_GBK_Flink_Batch/ws/src/sdks/go/pkg/beam/core/runtime/exec/pardo.go>:194 +0x8f
github.com/apache/beam/sdks/v2/go/pkg/beam/core/runtime/exec.(*ParDo).processMainInput(0x155?, 0x1a85c30?)
	<https://ci-beam.apache.org/job/beam_LoadTests_Go_GBK_Flink_Batch/ws/src/sdks/go/pkg/beam/core/runtime/exec/pardo.go>:172 +0x7f
github.com/apache/beam/sdks/v2/go/pkg/beam/core/runtime/exec.(*ParDo).ProcessElement(0xc0004e5440, {0x18?, 0xc000074400?}, 0xc0004cd008, {0x0, 0x0, 0x0})
	<https://ci-beam.apache.org/job/beam_LoadTests_Go_GBK_Flink_Batch/ws/src/sdks/go/pkg/beam/core/runtime/exec/pardo.go>:156 +0x129
github.com/apache/beam/sdks/v2/go/pkg/beam/core/runtime/exec.(*PCollection).ProcessElement(0xc0009e8a20?, {0x1a85c30?, 0xc000277280?}, 0x424bc5?, {0x0?, 0x200?, 0x80?})
	<https://ci-beam.apache.org/job/beam_LoadTests_Go_GBK_Flink_Batch/ws/src/sdks/go/pkg/beam/core/runtime/exec/pcollection.go>:100 +0x151
github.com/apache/beam/sdks/v2/go/pkg/beam/register.(*emit2[...]).invoke(0x1a87360, {0xc0009e8a18, 0xc0004bc6d0?, 0x1a6f720?}, {0xc0009e8a20?, 0x9, 0x9})
	<https://ci-beam.apache.org/job/beam_LoadTests_Go_GBK_Flink_Batch/ws/src/sdks/go/pkg/beam/register/emitter.go>:80 +0x1fa
github.com/apache/beam/sdks/v2/go/pkg/beam/io/synthetic.(*sourceFn).ProcessElement(0xc0004ebca0, 0x0?, {0xbebc200, 0x1, 0x1, 0x9, 0x0, 0x0}, 0xc00011ce40)
	<https://ci-beam.apache.org/job/beam_LoadTests_Go_GBK_Flink_Batch/ws/src/sdks/go/pkg/beam/io/synthetic/source.go>:151 +0x116
github.com/apache/beam/sdks/v2/go/pkg/beam/register.registerDoFn3x1StructWrappersAndFuncs[...].func2.1({0xbebc200?, 0x1, 0x1, 0x9, 0x0, 0x0}, 0xc000013090)
	<https://ci-beam.apache.org/job/beam_LoadTests_Go_GBK_Flink_Batch/ws/src/sdks/go/pkg/beam/register/register.go>:3382 +0xaa
github.com/apache/beam/sdks/v2/go/pkg/beam/register.(*caller3x1[...]).Call3x1(0x10000?, {0x16d95a0?, 0xc00011ce10?}, {0x1736aa0?, 0xc0001105d0?}, {0x13f2f80?, 0xc00011ce40?})
	<https://ci-beam.apache.org/job/beam_LoadTests_Go_GBK_Flink_Batch/ws/src/sdks/go/pkg/beam/register/register.go>:3371 +0xaf
github.com/apache/beam/sdks/v2/go/pkg/beam/core/runtime/exec.(*invoker).initCall.func13({0x0, 0x0, 0x0, 0x0, 0x0}, {0x2c6c700, 0x1, 0x1}, 0x0?)
	<https://ci-beam.apache.org/job/beam_LoadTests_Go_GBK_Flink_Batch/ws/src/sdks/go/pkg/beam/core/runtime/exec/fn_arity.go>:109 +0xa9
github.com/apache/beam/sdks/v2/go/pkg/beam/core/runtime/exec.(*invoker).invokeWithOpts(0xc0004fadc0, {0x1a85c30?, 0xc000277280}, {0x0, 0x0, 0x0, 0x0, 0x0}, {0x2c6c700, 0x1, ...}, ...)
	<https://ci-beam.apache.org/job/beam_LoadTests_Go_GBK_Flink_Batch/ws/src/sdks/go/pkg/beam/core/runtime/exec/fn.go>:297 +0xf90
github.com/apache/beam/sdks/v2/go/pkg/beam/core/runtime/exec.(*ParDo).invokeProcessFn(0xc0004e5680, {0x1a85c30, 0xc000277280}, {0x0, 0x0, 0x0, 0x0, 0x0}, {0x2c6c700, 0x1, ...}, ...)
	<https://ci-beam.apache.org/job/beam_LoadTests_Go_GBK_Flink_Batch/ws/src/sdks/go/pkg/beam/core/runtime/exec/pardo.go>:508 +0x29f
github.com/apache/beam/sdks/v2/go/pkg/beam/core/runtime/exec.(*ParDo).processSingleWindow(0xc0004e5680, 0xc00052c090)
	<https://ci-beam.apache.org/job/beam_LoadTests_Go_GBK_Flink_Batch/ws/src/sdks/go/pkg/beam/core/runtime/exec/pardo.go>:194 +0x8f
github.com/apache/beam/sdks/v2/go/pkg/beam/core/runtime/exec.(*ProcessSizedElementsAndRestrictions).ProcessElement(0xc000324d20, {0x1a85c30, 0xc00051a180}, 0xc000274a80, {0x0, 0x0, 0x0})
	<https://ci-beam.apache.org/job/beam_LoadTests_Go_GBK_Flink_Batch/ws/src/sdks/go/pkg/beam/core/runtime/exec/sdf.go>:556 +0x62f
github.com/apache/beam/sdks/v2/go/pkg/beam/core/runtime/exec.(*DataSource).Process.func1(0xc00011c9c0, {0xc0004bd328?, 0xc0002e6020?})
	<https://ci-beam.apache.org/job/beam_LoadTests_Go_GBK_Flink_Batch/ws/src/sdks/go/pkg/beam/core/runtime/exec/datasource.go>:240 +0x223
github.com/apache/beam/sdks/v2/go/pkg/beam/core/runtime/exec.(*DataSource).process(0xc0004c29a0, {0x1a85c30, 0xc00051a180}, 0xc0004bd618, 0xc0004bd5f8)
	<https://ci-beam.apache.org/job/beam_LoadTests_Go_GBK_Flink_Batch/ws/src/sdks/go/pkg/beam/core/runtime/exec/datasource.go>:146 +0x4d3
github.com/apache/beam/sdks/v2/go/pkg/beam/core/runtime/exec.(*DataSource).Process(0xc0004c29a0, {0x1a85c30, 0xc00051a180})
	<https://ci-beam.apache.org/job/beam_LoadTests_Go_GBK_Flink_Batch/ws/src/sdks/go/pkg/beam/core/runtime/exec/datasource.go>:214 +0x20a
github.com/apache/beam/sdks/v2/go/pkg/beam/core/runtime/exec.(*Plan).Execute.func2({0x1a85c30?, 0xc00051a180?})
	<https://ci-beam.apache.org/job/beam_LoadTests_Go_GBK_Flink_Batch/ws/src/sdks/go/pkg/beam/core/runtime/exec/plan.go>:151 +0x3b
github.com/apache/beam/sdks/v2/go/pkg/beam/core/runtime/exec.callNoPanic({0x1a85c30?, 0xc00051a180?}, 0x418488?)
	<https://ci-beam.apache.org/job/beam_LoadTests_Go_GBK_Flink_Batch/ws/src/sdks/go/pkg/beam/core/runtime/exec/util.go>:62 +0x62
github.com/apache/beam/sdks/v2/go/pkg/beam/core/runtime/exec.(*Plan).Execute(0xc000031e60, {0x1a85c30, 0xc00051a180}, {0x2c0ef38, 0x1}, {{0x1a84b60?, 0xc000276980?}, {0x1abe418?, 0xc0001cea80?}})
	<https://ci-beam.apache.org/job/beam_LoadTests_Go_GBK_Flink_Batch/ws/src/sdks/go/pkg/beam/core/runtime/exec/plan.go>:150 +0x3b8
github.com/apache/beam/sdks/v2/go/pkg/beam/core/runtime/harness.(*control).handleInstruction(0xc0004aa000, {0x1a85820?, 0xc000297e30?}, 0xc000126d70)
	<https://ci-beam.apache.org/job/beam_LoadTests_Go_GBK_Flink_Batch/ws/src/sdks/go/pkg/beam/core/runtime/harness/harness.go>:409 +0x9f8
github.com/apache/beam/sdks/v2/go/pkg/beam/core/runtime/harness.MainWithOptions.func4({0x1a85820?, 0xc000297e30?}, 0x0?)
	<https://ci-beam.apache.org/job/beam_LoadTests_Go_GBK_Flink_Batch/ws/src/sdks/go/pkg/beam/core/runtime/harness/harness.go>:195 +0x74
created by github.com/apache/beam/sdks/v2/go/pkg/beam/core/runtime/harness.MainWithOptions in goroutine 1
	<https://ci-beam.apache.org/job/beam_LoadTests_Go_GBK_Flink_Batch/ws/src/sdks/go/pkg/beam/core/runtime/harness/harness.go>:213 +0xede


goroutine 1 [running]:
github.com/apache/beam/sdks/v2/go/pkg/beam/log.Fatalf({0x1a857e8, 0x2cc1820}, {0x18eeec0?, 0x2cc1820?}, {0xc000393e30?, 0x0?, 0x0?})
	<https://ci-beam.apache.org/job/beam_LoadTests_Go_GBK_Flink_Batch/ws/src/sdks/go/pkg/beam/log/log.go>:162 +0x7d
main.main()
	<https://ci-beam.apache.org/job/beam_LoadTests_Go_GBK_Flink_Batch/ws/src/sdks/go/test/load/group_by_key/group_by_key.go>:98 +0x3d3

> Task :sdks:go:test:load:run FAILED

FAILURE: Build failed with an exception.

* Where:
Build file '<https://ci-beam.apache.org/job/beam_LoadTests_Go_GBK_Flink_Batch/ws/src/sdks/go/test/load/build.gradle'> line: 31

* What went wrong:
Execution failed for task ':sdks:go:test:load:run'.
> Process 'command 'sh'' finished with non-zero exit value 2

* Try:
> Run with --stacktrace option to get the stack trace.
> Run with --info or --debug option to get more log output.
> Get more help at https://help.gradle.org.

Deprecated Gradle features were used in this build, making it incompatible with Gradle 9.0.

You can use '--warning-mode all' to show the individual deprecation warnings and determine if they come from your own scripts or plugins.

For more on this, please refer to https://docs.gradle.org/8.4/userguide/command_line_interface.html#sec:command_line_warnings in the Gradle documentation.

BUILD FAILED in 3m 4s
6 actionable tasks: 5 executed, 1 from cache

Publishing build scan...
https://ge.apache.org/s/yz4rxxzbzq3ww

Build step 'Invoke Gradle script' changed build result to FAILURE
Build step 'Invoke Gradle script' marked build as failure

---------------------------------------------------------------------
To unsubscribe, e-mail: builds-unsubscribe@beam.apache.org
For additional commands, e-mail: builds-help@beam.apache.org


Build failed in Jenkins: beam_LoadTests_Go_GBK_Flink_Batch #1063

Posted by Apache Jenkins Server <je...@builds.apache.org>.
See <https://ci-beam.apache.org/job/beam_LoadTests_Go_GBK_Flink_Batch/1063/display/redirect>

Changes:


------------------------------------------
[...truncated 63.71 KB...]
github.com/apache/beam/sdks/v2/go/pkg/beam/core/runtime/exec.(*invoker).initCall.func4({0x0, 0x0, 0x0, 0x0, 0x0}, {0x2c6c700?, 0x1?, 0x1?}, 0xffdf3b645a1cac09?)
	<https://ci-beam.apache.org/job/beam_LoadTests_Go_GBK_Flink_Batch/ws/src/sdks/go/pkg/beam/core/runtime/exec/fn_arity.go>:55 +0x6f
github.com/apache/beam/sdks/v2/go/pkg/beam/core/runtime/exec.(*invoker).invokeWithOpts(0xc000188f00, {0x1a85c30?, 0xc000405400}, {0x0, 0x0, 0x0, 0x0, 0x0}, {0x2c6c700, 0x1, ...}, ...)
	<https://ci-beam.apache.org/job/beam_LoadTests_Go_GBK_Flink_Batch/ws/src/sdks/go/pkg/beam/core/runtime/exec/fn.go>:297 +0xf90
github.com/apache/beam/sdks/v2/go/pkg/beam/core/runtime/exec.(*ParDo).invokeProcessFn(0xc000446360, {0x1a85c30, 0xc000405400}, {0x0, 0x0, 0x0, 0x0, 0x0}, {0x2c6c700, 0x1, ...}, ...)
	<https://ci-beam.apache.org/job/beam_LoadTests_Go_GBK_Flink_Batch/ws/src/sdks/go/pkg/beam/core/runtime/exec/pardo.go>:508 +0x29f
github.com/apache/beam/sdks/v2/go/pkg/beam/core/runtime/exec.(*ParDo).processSingleWindow(0xc000446360, 0xc0009ea3f0)
	<https://ci-beam.apache.org/job/beam_LoadTests_Go_GBK_Flink_Batch/ws/src/sdks/go/pkg/beam/core/runtime/exec/pardo.go>:194 +0x8f
github.com/apache/beam/sdks/v2/go/pkg/beam/core/runtime/exec.(*ParDo).processMainInput(0x155?, 0x1a85c30?)
	<https://ci-beam.apache.org/job/beam_LoadTests_Go_GBK_Flink_Batch/ws/src/sdks/go/pkg/beam/core/runtime/exec/pardo.go>:172 +0x7f
github.com/apache/beam/sdks/v2/go/pkg/beam/core/runtime/exec.(*ParDo).ProcessElement(0xc000446360, {0x18?, 0xc000074400?}, 0xc0002eebe8, {0x0, 0x0, 0x0})
	<https://ci-beam.apache.org/job/beam_LoadTests_Go_GBK_Flink_Batch/ws/src/sdks/go/pkg/beam/core/runtime/exec/pardo.go>:156 +0x129
github.com/apache/beam/sdks/v2/go/pkg/beam/core/runtime/exec.(*PCollection).ProcessElement(0xc0009e6500?, {0x1a85c30?, 0xc0004053c0?}, 0x424bc5?, {0x0?, 0x200?, 0x40?})
	<https://ci-beam.apache.org/job/beam_LoadTests_Go_GBK_Flink_Batch/ws/src/sdks/go/pkg/beam/core/runtime/exec/pcollection.go>:100 +0x151
github.com/apache/beam/sdks/v2/go/pkg/beam/register.(*emit2[...]).invoke(0x1a87360, {0xc0009e64f8, 0xc00040e6d0?, 0x1a6f720?}, {0xc0009e6500?, 0x9, 0x9})
	<https://ci-beam.apache.org/job/beam_LoadTests_Go_GBK_Flink_Batch/ws/src/sdks/go/pkg/beam/register/emitter.go>:80 +0x1fa
github.com/apache/beam/sdks/v2/go/pkg/beam/io/synthetic.(*sourceFn).ProcessElement(0xc0004448f0, 0x0?, {0xbebc200, 0x1, 0x1, 0x9, 0x0, 0x0}, 0xc0003fcc30)
	<https://ci-beam.apache.org/job/beam_LoadTests_Go_GBK_Flink_Batch/ws/src/sdks/go/pkg/beam/io/synthetic/source.go>:151 +0x116
github.com/apache/beam/sdks/v2/go/pkg/beam/register.registerDoFn3x1StructWrappersAndFuncs[...].func2.1({0xbebc200?, 0x1, 0x1, 0x9, 0x0, 0x0}, 0xc0002115c8)
	<https://ci-beam.apache.org/job/beam_LoadTests_Go_GBK_Flink_Batch/ws/src/sdks/go/pkg/beam/register/register.go>:3382 +0xaa
github.com/apache/beam/sdks/v2/go/pkg/beam/register.(*caller3x1[...]).Call3x1(0x10000?, {0x16d95a0?, 0xc0003fcc00?}, {0x1736aa0?, 0xc0004204b0?}, {0x13f2f80?, 0xc0003fcc30?})
	<https://ci-beam.apache.org/job/beam_LoadTests_Go_GBK_Flink_Batch/ws/src/sdks/go/pkg/beam/register/register.go>:3371 +0xaf
github.com/apache/beam/sdks/v2/go/pkg/beam/core/runtime/exec.(*invoker).initCall.func13({0x0, 0x0, 0x0, 0x0, 0x0}, {0x2c6c700, 0x1, 0x1}, 0x0?)
	<https://ci-beam.apache.org/job/beam_LoadTests_Go_GBK_Flink_Batch/ws/src/sdks/go/pkg/beam/core/runtime/exec/fn_arity.go>:109 +0xa9
github.com/apache/beam/sdks/v2/go/pkg/beam/core/runtime/exec.(*invoker).invokeWithOpts(0xc000189040, {0x1a85c30?, 0xc0004053c0}, {0x0, 0x0, 0x0, 0x0, 0x0}, {0x2c6c700, 0x1, ...}, ...)
	<https://ci-beam.apache.org/job/beam_LoadTests_Go_GBK_Flink_Batch/ws/src/sdks/go/pkg/beam/core/runtime/exec/fn.go>:297 +0xf90
github.com/apache/beam/sdks/v2/go/pkg/beam/core/runtime/exec.(*ParDo).invokeProcessFn(0xc0004465a0, {0x1a85c30, 0xc0004053c0}, {0x0, 0x0, 0x0, 0x0, 0x0}, {0x2c6c700, 0x1, ...}, ...)
	<https://ci-beam.apache.org/job/beam_LoadTests_Go_GBK_Flink_Batch/ws/src/sdks/go/pkg/beam/core/runtime/exec/pardo.go>:508 +0x29f
github.com/apache/beam/sdks/v2/go/pkg/beam/core/runtime/exec.(*ParDo).processSingleWindow(0xc0004465a0, 0xc0004573b0)
	<https://ci-beam.apache.org/job/beam_LoadTests_Go_GBK_Flink_Batch/ws/src/sdks/go/pkg/beam/core/runtime/exec/pardo.go>:194 +0x8f
github.com/apache/beam/sdks/v2/go/pkg/beam/core/runtime/exec.(*ProcessSizedElementsAndRestrictions).ProcessElement(0xc00044c820, {0x1a85c30, 0xc000552fc0}, 0xc0000515e0, {0x0, 0x0, 0x0})
	<https://ci-beam.apache.org/job/beam_LoadTests_Go_GBK_Flink_Batch/ws/src/sdks/go/pkg/beam/core/runtime/exec/sdf.go>:556 +0x62f
github.com/apache/beam/sdks/v2/go/pkg/beam/core/runtime/exec.(*DataSource).Process.func1(0xc00057cbb8, {0xc00040f328?, 0xc0001141a0?})
	<https://ci-beam.apache.org/job/beam_LoadTests_Go_GBK_Flink_Batch/ws/src/sdks/go/pkg/beam/core/runtime/exec/datasource.go>:240 +0x223
github.com/apache/beam/sdks/v2/go/pkg/beam/core/runtime/exec.(*DataSource).process(0xc0002fe9a0, {0x1a85c30, 0xc000552fc0}, 0xc00040f618, 0xc00040f5f8)
	<https://ci-beam.apache.org/job/beam_LoadTests_Go_GBK_Flink_Batch/ws/src/sdks/go/pkg/beam/core/runtime/exec/datasource.go>:146 +0x4d3
github.com/apache/beam/sdks/v2/go/pkg/beam/core/runtime/exec.(*DataSource).Process(0xc0002fe9a0, {0x1a85c30, 0xc000552fc0})
	<https://ci-beam.apache.org/job/beam_LoadTests_Go_GBK_Flink_Batch/ws/src/sdks/go/pkg/beam/core/runtime/exec/datasource.go>:214 +0x20a
github.com/apache/beam/sdks/v2/go/pkg/beam/core/runtime/exec.(*Plan).Execute.func2({0x1a85c30?, 0xc000552fc0?})
	<https://ci-beam.apache.org/job/beam_LoadTests_Go_GBK_Flink_Batch/ws/src/sdks/go/pkg/beam/core/runtime/exec/plan.go>:151 +0x3b
github.com/apache/beam/sdks/v2/go/pkg/beam/core/runtime/exec.callNoPanic({0x1a85c30?, 0xc000552fc0?}, 0x418488?)
	<https://ci-beam.apache.org/job/beam_LoadTests_Go_GBK_Flink_Batch/ws/src/sdks/go/pkg/beam/core/runtime/exec/util.go>:62 +0x62
github.com/apache/beam/sdks/v2/go/pkg/beam/core/runtime/exec.(*Plan).Execute(0xc0002f1d40, {0x1a85c30, 0xc000552fc0}, {0x2c0ef48, 0x1}, {{0x1a84b60?, 0xc000405300?}, {0x1abe418?, 0xc00044e4b0?}})
	<https://ci-beam.apache.org/job/beam_LoadTests_Go_GBK_Flink_Batch/ws/src/sdks/go/pkg/beam/core/runtime/exec/plan.go>:150 +0x3b8
github.com/apache/beam/sdks/v2/go/pkg/beam/core/runtime/harness.(*control).handleInstruction(0xc000336000, {0x1a85820?, 0xc000291a70?}, 0xc0000539a0)
	<https://ci-beam.apache.org/job/beam_LoadTests_Go_GBK_Flink_Batch/ws/src/sdks/go/pkg/beam/core/runtime/harness/harness.go>:409 +0x9f8
github.com/apache/beam/sdks/v2/go/pkg/beam/core/runtime/harness.MainWithOptions.func4({0x1a85820?, 0xc000291a70?}, 0x38500000007?)
	<https://ci-beam.apache.org/job/beam_LoadTests_Go_GBK_Flink_Batch/ws/src/sdks/go/pkg/beam/core/runtime/harness/harness.go>:195 +0x74
created by github.com/apache/beam/sdks/v2/go/pkg/beam/core/runtime/harness.MainWithOptions in goroutine 1
	<https://ci-beam.apache.org/job/beam_LoadTests_Go_GBK_Flink_Batch/ws/src/sdks/go/pkg/beam/core/runtime/harness/harness.go>:213 +0xede
2023/11/01 08:08:37 Job[load0tests0go0flink0batch0gbk0101101065328-root-1101080623-c0cdadf3_065946ce-abb2-42e5-b571-8addd3d6c18e] state: FAILED
2023/11/01 08:08:37 Failed to execute job: job load0tests0go0flink0batch0gbk0101101065328-root-1101080623-c0cdadf3_065946ce-abb2-42e5-b571-8addd3d6c18e failed:
java.lang.RuntimeException: Error received from SDK harness for instruction 5: process bundle failed for instruction 5 using plan 1-7 : panic: datamgr.go [{5 fn/write/n4:0}]: error flushing buffer of length 4000000
	caused by:
rpc error: code = Unknown desc = 
Full error:
while executing Process for Plan[1-7]:
1: DataSource[S[fn/read/n2/SplitAndSize0:0@localhost:43587], local_output] Out:6 Coder:W;fn/wire/n2/SplitAndSize0:0<KV;c5/SplitAndSize0<KV;c5/PairWithRestriction0<R;c5[synthetic.SourceConfig],KV;c9<offsetrange.Restriction[offsetrange.Restriction;c6];c7,bool;c8>>,double;DoubleCoder0>>!GWC 
6: SDF.ProcessSizedElementsAndRestrictions[synthetic.sourceFn] UID:6 Out:[5]
5: PCollection[n3] Out:[4]
4: ParDo[load.RuntimeMonitor] Out:[2] Sig: func([]uint8, []uint8, func([]uint8, []uint8)), SideInputs: []
3: PCollection[n4] Out:[2]
2: DataSink[S[fn/write/n4:0@localhost:43587]] Coder:W;fn/wire/n4:0<KV;c1<bytes;c0,bytes;c0>>!GWC
	caused by:
panic: datamgr.go [{5 fn/write/n4:0}]: error flushing buffer of length 4000000
	caused by:
rpc error: code = Unknown desc =  goroutine 38 [running]:
runtime/debug.Stack()
	/home/jenkins/sdk/go1.21.3/src/runtime/debug/stack.go:24 +0x5e
github.com/apache/beam/sdks/v2/go/pkg/beam/core/runtime/exec.callNoPanic.func1()
	<https://ci-beam.apache.org/job/beam_LoadTests_Go_GBK_Flink_Batch/ws/src/sdks/go/pkg/beam/core/runtime/exec/util.go>:58 +0x94
panic({0x15d5e80?, 0xc0004b8480?})
	/home/jenkins/sdk/go1.21.3/src/runtime/panic.go:914 +0x21f
github.com/apache/beam/sdks/v2/go/pkg/beam/register.(*emit2[...]).invoke(0x1a87360, {0xc0009e64f8, 0x40d39a?, 0x43c199?}, {0xc0009e6500?, 0x9, 0x9})
	<https://ci-beam.apache.org/job/beam_LoadTests_Go_GBK_Flink_Batch/ws/src/sdks/go/pkg/beam/register/emitter.go>:81 +0x213
github.com/apache/beam/sdks/v2/go/test/load.(*RuntimeMonitor).ProcessElement(0x14eabc0?, {0xc0009e64f8?, 0x2c6c700?, 0xc0003101a0?}, {0xc0009e6500?, 0x1?, 0x1?}, 0x3c00000000000000?)
	<https://ci-beam.apache.org/job/beam_LoadTests_Go_GBK_Flink_Batch/ws/src/sdks/go/test/load/util.go>:87 +0x33
github.com/apache/beam/sdks/v2/go/pkg/beam/register.registerDoFn3x0StructWrappersAndFuncs[...].func2.1({0xc0009e6500, 0x9, 0x9}, 0x46e472)
	<https://ci-beam.apache.org/job/beam_LoadTests_Go_GBK_Flink_Batch/ws/src/sdks/go/pkg/beam/register/register.go>:2469 +0x92
github.com/apache/beam/sdks/v2/go/pkg/beam/register.(*caller3x0[...]).Call3x0(0xc00040de40?, {0x13a2240?, 0xc0009e8a20?}, {0x13a2240?, 0xc0009e8a38?}, {0x13f2f80?, 0xc00057cba0?})
	<https://ci-beam.apache.org/job/beam_LoadTests_Go_GBK_Flink_Batch/ws/src/sdks/go/pkg/beam/register/register.go>:2458 +0x70
github.com/apache/beam/sdks/v2/go/pkg/beam/core/runtime/exec.(*invoker).initCall.func4({0x0, 0x0, 0x0, 0x0, 0x0}, {0x2c6c700?, 0x1?, 0x1?}, 0xffdf3b645a1cac09?)
	<https://ci-beam.apache.org/job/beam_LoadTests_Go_GBK_Flink_Batch/ws/src/sdks/go/pkg/beam/core/runtime/exec/fn_arity.go>:55 +0x6f
github.com/apache/beam/sdks/v2/go/pkg/beam/core/runtime/exec.(*invoker).invokeWithOpts(0xc000188f00, {0x1a85c30?, 0xc000405400}, {0x0, 0x0, 0x0, 0x0, 0x0}, {0x2c6c700, 0x1, ...}, ...)
	<https://ci-beam.apache.org/job/beam_LoadTests_Go_GBK_Flink_Batch/ws/src/sdks/go/pkg/beam/core/runtime/exec/fn.go>:297 +0xf90
github.com/apache/beam/sdks/v2/go/pkg/beam/core/runtime/exec.(*ParDo).invokeProcessFn(0xc000446360, {0x1a85c30, 0xc000405400}, {0x0, 0x0, 0x0, 0x0, 0x0}, {0x2c6c700, 0x1, ...}, ...)
	<https://ci-beam.apache.org/job/beam_LoadTests_Go_GBK_Flink_Batch/ws/src/sdks/go/pkg/beam/core/runtime/exec/pardo.go>:508 +0x29f
github.com/apache/beam/sdks/v2/go/pkg/beam/core/runtime/exec.(*ParDo).processSingleWindow(0xc000446360, 0xc0009ea3f0)
	<https://ci-beam.apache.org/job/beam_LoadTests_Go_GBK_Flink_Batch/ws/src/sdks/go/pkg/beam/core/runtime/exec/pardo.go>:194 +0x8f
github.com/apache/beam/sdks/v2/go/pkg/beam/core/runtime/exec.(*ParDo).processMainInput(0x155?, 0x1a85c30?)
	<https://ci-beam.apache.org/job/beam_LoadTests_Go_GBK_Flink_Batch/ws/src/sdks/go/pkg/beam/core/runtime/exec/pardo.go>:172 +0x7f
github.com/apache/beam/sdks/v2/go/pkg/beam/core/runtime/exec.(*ParDo).ProcessElement(0xc000446360, {0x18?, 0xc000074400?}, 0xc0002eebe8, {0x0, 0x0, 0x0})
	<https://ci-beam.apache.org/job/beam_LoadTests_Go_GBK_Flink_Batch/ws/src/sdks/go/pkg/beam/core/runtime/exec/pardo.go>:156 +0x129
github.com/apache/beam/sdks/v2/go/pkg/beam/core/runtime/exec.(*PCollection).ProcessElement(0xc0009e6500?, {0x1a85c30?, 0xc0004053c0?}, 0x424bc5?, {0x0?, 0x200?, 0x40?})
	<https://ci-beam.apache.org/job/beam_LoadTests_Go_GBK_Flink_Batch/ws/src/sdks/go/pkg/beam/core/runtime/exec/pcollection.go>:100 +0x151
github.com/apache/beam/sdks/v2/go/pkg/beam/register.(*emit2[...]).invoke(0x1a87360, {0xc0009e64f8, 0xc00040e6d0?, 0x1a6f720?}, {0xc0009e6500?, 0x9, 0x9})
	<https://ci-beam.apache.org/job/beam_LoadTests_Go_GBK_Flink_Batch/ws/src/sdks/go/pkg/beam/register/emitter.go>:80 +0x1fa
github.com/apache/beam/sdks/v2/go/pkg/beam/io/synthetic.(*sourceFn).ProcessElement(0xc0004448f0, 0x0?, {0xbebc200, 0x1, 0x1, 0x9, 0x0, 0x0}, 0xc0003fcc30)
	<https://ci-beam.apache.org/job/beam_LoadTests_Go_GBK_Flink_Batch/ws/src/sdks/go/pkg/beam/io/synthetic/source.go>:151 +0x116
github.com/apache/beam/sdks/v2/go/pkg/beam/register.registerDoFn3x1StructWrappersAndFuncs[...].func2.1({0xbebc200?, 0x1, 0x1, 0x9, 0x0, 0x0}, 0xc0002115c8)
	<https://ci-beam.apache.org/job/beam_LoadTests_Go_GBK_Flink_Batch/ws/src/sdks/go/pkg/beam/register/register.go>:3382 +0xaa
github.com/apache/beam/sdks/v2/go/pkg/beam/register.(*caller3x1[...]).Call3x1(0x10000?, {0x16d95a0?, 0xc0003fcc00?}, {0x1736aa0?, 0xc0004204b0?}, {0x13f2f80?, 0xc0003fcc30?})
	<https://ci-beam.apache.org/job/beam_LoadTests_Go_GBK_Flink_Batch/ws/src/sdks/go/pkg/beam/register/register.go>:3371 +0xaf
github.com/apache/beam/sdks/v2/go/pkg/beam/core/runtime/exec.(*invoker).initCall.func13({0x0, 0x0, 0x0, 0x0, 0x0}, {0x2c6c700, 0x1, 0x1}, 0x0?)
	<https://ci-beam.apache.org/job/beam_LoadTests_Go_GBK_Flink_Batch/ws/src/sdks/go/pkg/beam/core/runtime/exec/fn_arity.go>:109 +0xa9
github.com/apache/beam/sdks/v2/go/pkg/beam/core/runtime/exec.(*invoker).invokeWithOpts(0xc000189040, {0x1a85c30?, 0xc0004053c0}, {0x0, 0x0, 0x0, 0x0, 0x0}, {0x2c6c700, 0x1, ...}, ...)
	<https://ci-beam.apache.org/job/beam_LoadTests_Go_GBK_Flink_Batch/ws/src/sdks/go/pkg/beam/core/runtime/exec/fn.go>:297 +0xf90
github.com/apache/beam/sdks/v2/go/pkg/beam/core/runtime/exec.(*ParDo).invokeProcessFn(0xc0004465a0, {0x1a85c30, 0xc0004053c0}, {0x0, 0x0, 0x0, 0x0, 0x0}, {0x2c6c700, 0x1, ...}, ...)
	<https://ci-beam.apache.org/job/beam_LoadTests_Go_GBK_Flink_Batch/ws/src/sdks/go/pkg/beam/core/runtime/exec/pardo.go>:508 +0x29f
github.com/apache/beam/sdks/v2/go/pkg/beam/core/runtime/exec.(*ParDo).processSingleWindow(0xc0004465a0, 0xc0004573b0)
	<https://ci-beam.apache.org/job/beam_LoadTests_Go_GBK_Flink_Batch/ws/src/sdks/go/pkg/beam/core/runtime/exec/pardo.go>:194 +0x8f
github.com/apache/beam/sdks/v2/go/pkg/beam/core/runtime/exec.(*ProcessSizedElementsAndRestrictions).ProcessElement(0xc00044c820, {0x1a85c30, 0xc000552fc0}, 0xc0000515e0, {0x0, 0x0, 0x0})
	<https://ci-beam.apache.org/job/beam_LoadTests_Go_GBK_Flink_Batch/ws/src/sdks/go/pkg/beam/core/runtime/exec/sdf.go>:556 +0x62f
github.com/apache/beam/sdks/v2/go/pkg/beam/core/runtime/exec.(*DataSource).Process.func1(0xc00057cbb8, {0xc00040f328?, 0xc0001141a0?})
	<https://ci-beam.apache.org/job/beam_LoadTests_Go_GBK_Flink_Batch/ws/src/sdks/go/pkg/beam/core/runtime/exec/datasource.go>:240 +0x223
github.com/apache/beam/sdks/v2/go/pkg/beam/core/runtime/exec.(*DataSource).process(0xc0002fe9a0, {0x1a85c30, 0xc000552fc0}, 0xc00040f618, 0xc00040f5f8)
	<https://ci-beam.apache.org/job/beam_LoadTests_Go_GBK_Flink_Batch/ws/src/sdks/go/pkg/beam/core/runtime/exec/datasource.go>:146 +0x4d3
github.com/apache/beam/sdks/v2/go/pkg/beam/core/runtime/exec.(*DataSource).Process(0xc0002fe9a0, {0x1a85c30, 0xc000552fc0})
	<https://ci-beam.apache.org/job/beam_LoadTests_Go_GBK_Flink_Batch/ws/src/sdks/go/pkg/beam/core/runtime/exec/datasource.go>:214 +0x20a
github.com/apache/beam/sdks/v2/go/pkg/beam/core/runtime/exec.(*Plan).Execute.func2({0x1a85c30?, 0xc000552fc0?})
	<https://ci-beam.apache.org/job/beam_LoadTests_Go_GBK_Flink_Batch/ws/src/sdks/go/pkg/beam/core/runtime/exec/plan.go>:151 +0x3b
github.com/apache/beam/sdks/v2/go/pkg/beam/core/runtime/exec.callNoPanic({0x1a85c30?, 0xc000552fc0?}, 0x418488?)
	<https://ci-beam.apache.org/job/beam_LoadTests_Go_GBK_Flink_Batch/ws/src/sdks/go/pkg/beam/core/runtime/exec/util.go>:62 +0x62
github.com/apache/beam/sdks/v2/go/pkg/beam/core/runtime/exec.(*Plan).Execute(0xc0002f1d40, {0x1a85c30, 0xc000552fc0}, {0x2c0ef48, 0x1}, {{0x1a84b60?, 0xc000405300?}, {0x1abe418?, 0xc00044e4b0?}})
	<https://ci-beam.apache.org/job/beam_LoadTests_Go_GBK_Flink_Batch/ws/src/sdks/go/pkg/beam/core/runtime/exec/plan.go>:150 +0x3b8
github.com/apache/beam/sdks/v2/go/pkg/beam/core/runtime/harness.(*control).handleInstruction(0xc000336000, {0x1a85820?, 0xc000291a70?}, 0xc0000539a0)
	<https://ci-beam.apache.org/job/beam_LoadTests_Go_GBK_Flink_Batch/ws/src/sdks/go/pkg/beam/core/runtime/harness/harness.go>:409 +0x9f8
github.com/apache/beam/sdks/v2/go/pkg/beam/core/runtime/harness.MainWithOptions.func4({0x1a85820?, 0xc000291a70?}, 0x38500000007?)
	<https://ci-beam.apache.org/job/beam_LoadTests_Go_GBK_Flink_Batch/ws/src/sdks/go/pkg/beam/core/runtime/harness/harness.go>:195 +0x74
created by github.com/apache/beam/sdks/v2/go/pkg/beam/core/runtime/harness.MainWithOptions in goroutine 1
	<https://ci-beam.apache.org/job/beam_LoadTests_Go_GBK_Flink_Batch/ws/src/sdks/go/pkg/beam/core/runtime/harness/harness.go>:213 +0xede
panic: Failed to execute job: job load0tests0go0flink0batch0gbk0101101065328-root-1101080623-c0cdadf3_065946ce-abb2-42e5-b571-8addd3d6c18e failed:
java.lang.RuntimeException: Error received from SDK harness for instruction 5: process bundle failed for instruction 5 using plan 1-7 : panic: datamgr.go [{5 fn/write/n4:0}]: error flushing buffer of length 4000000
	caused by:
rpc error: code = Unknown desc = 
Full error:
while executing Process for Plan[1-7]:
1: DataSource[S[fn/read/n2/SplitAndSize0:0@localhost:43587], local_output] Out:6 Coder:W;fn/wire/n2/SplitAndSize0:0<KV;c5/SplitAndSize0<KV;c5/PairWithRestriction0<R;c5[synthetic.SourceConfig],KV;c9<offsetrange.Restriction[offsetrange.Restriction;c6];c7,bool;c8>>,double;DoubleCoder0>>!GWC 
6: SDF.ProcessSizedElementsAndRestrictions[synthetic.sourceFn] UID:6 Out:[5]
5: PCollection[n3] Out:[4]
4: ParDo[load.RuntimeMonitor] Out:[2] Sig: func([]uint8, []uint8, func([]uint8, []uint8)), SideInputs: []
3: PCollection[n4] Out:[2]
2: DataSink[S[fn/write/n4:0@localhost:43587]] Coder:W;fn/wire/n4:0<KV;c1<bytes;c0,bytes;c0>>!GWC
	caused by:
panic: datamgr.go [{5 fn/write/n4:0}]: error flushing buffer of length 4000000
	caused by:
rpc error: code = Unknown desc =  goroutine 38 [running]:
runtime/debug.Stack()
	/home/jenkins/sdk/go1.21.3/src/runtime/debug/stack.go:24 +0x5e
github.com/apache/beam/sdks/v2/go/pkg/beam/core/runtime/exec.callNoPanic.func1()
	<https://ci-beam.apache.org/job/beam_LoadTests_Go_GBK_Flink_Batch/ws/src/sdks/go/pkg/beam/core/runtime/exec/util.go>:58 +0x94
panic({0x15d5e80?, 0xc0004b8480?})
	/home/jenkins/sdk/go1.21.3/src/runtime/panic.go:914 +0x21f
github.com/apache/beam/sdks/v2/go/pkg/beam/register.(*emit2[...]).invoke(0x1a87360, {0xc0009e64f8, 0x40d39a?, 0x43c199?}, {0xc0009e6500?, 0x9, 0x9})
	<https://ci-beam.apache.org/job/beam_LoadTests_Go_GBK_Flink_Batch/ws/src/sdks/go/pkg/beam/register/emitter.go>:81 +0x213
github.com/apache/beam/sdks/v2/go/test/load.(*RuntimeMonitor).ProcessElement(0x14eabc0?, {0xc0009e64f8?, 0x2c6c700?, 0xc0003101a0?}, {0xc0009e6500?, 0x1?, 0x1?}, 0x3c00000000000000?)
	<https://ci-beam.apache.org/job/beam_LoadTests_Go_GBK_Flink_Batch/ws/src/sdks/go/test/load/util.go>:87 +0x33
github.com/apache/beam/sdks/v2/go/pkg/beam/register.registerDoFn3x0StructWrappersAndFuncs[...].func2.1({0xc0009e6500, 0x9, 0x9}, 0x46e472)
	<https://ci-beam.apache.org/job/beam_LoadTests_Go_GBK_Flink_Batch/ws/src/sdks/go/pkg/beam/register/register.go>:2469 +0x92
github.com/apache/beam/sdks/v2/go/pkg/beam/register.(*caller3x0[...]).Call3x0(0xc00040de40?, {0x13a2240?, 0xc0009e8a20?}, {0x13a2240?, 0xc0009e8a38?}, {0x13f2f80?, 0xc00057cba0?})
	<https://ci-beam.apache.org/job/beam_LoadTests_Go_GBK_Flink_Batch/ws/src/sdks/go/pkg/beam/register/register.go>:2458 +0x70
github.com/apache/beam/sdks/v2/go/pkg/beam/core/runtime/exec.(*invoker).initCall.func4({0x0, 0x0, 0x0, 0x0, 0x0}, {0x2c6c700?, 0x1?, 0x1?}, 0xffdf3b645a1cac09?)
	<https://ci-beam.apache.org/job/beam_LoadTests_Go_GBK_Flink_Batch/ws/src/sdks/go/pkg/beam/core/runtime/exec/fn_arity.go>:55 +0x6f
github.com/apache/beam/sdks/v2/go/pkg/beam/core/runtime/exec.(*invoker).invokeWithOpts(0xc000188f00, {0x1a85c30?, 0xc000405400}, {0x0, 0x0, 0x0, 0x0, 0x0}, {0x2c6c700, 0x1, ...}, ...)
	<https://ci-beam.apache.org/job/beam_LoadTests_Go_GBK_Flink_Batch/ws/src/sdks/go/pkg/beam/core/runtime/exec/fn.go>:297 +0xf90
github.com/apache/beam/sdks/v2/go/pkg/beam/core/runtime/exec.(*ParDo).invokeProcessFn(0xc000446360, {0x1a85c30, 0xc000405400}, {0x0, 0x0, 0x0, 0x0, 0x0}, {0x2c6c700, 0x1, ...}, ...)
	<https://ci-beam.apache.org/job/beam_LoadTests_Go_GBK_Flink_Batch/ws/src/sdks/go/pkg/beam/core/runtime/exec/pardo.go>:508 +0x29f
github.com/apache/beam/sdks/v2/go/pkg/beam/core/runtime/exec.(*ParDo).processSingleWindow(0xc000446360, 0xc0009ea3f0)
	<https://ci-beam.apache.org/job/beam_LoadTests_Go_GBK_Flink_Batch/ws/src/sdks/go/pkg/beam/core/runtime/exec/pardo.go>:194 +0x8f
github.com/apache/beam/sdks/v2/go/pkg/beam/core/runtime/exec.(*ParDo).processMainInput(0x155?, 0x1a85c30?)
	<https://ci-beam.apache.org/job/beam_LoadTests_Go_GBK_Flink_Batch/ws/src/sdks/go/pkg/beam/core/runtime/exec/pardo.go>:172 +0x7f
github.com/apache/beam/sdks/v2/go/pkg/beam/core/runtime/exec.(*ParDo).ProcessElement(0xc000446360, {0x18?, 0xc000074400?}, 0xc0002eebe8, {0x0, 0x0, 0x0})
	<https://ci-beam.apache.org/job/beam_LoadTests_Go_GBK_Flink_Batch/ws/src/sdks/go/pkg/beam/core/runtime/exec/pardo.go>:156 +0x129
github.com/apache/beam/sdks/v2/go/pkg/beam/core/runtime/exec.(*PCollection).ProcessElement(0xc0009e6500?, {0x1a85c30?, 0xc0004053c0?}, 0x424bc5?, {0x0?, 0x200?, 0x40?})
	<https://ci-beam.apache.org/job/beam_LoadTests_Go_GBK_Flink_Batch/ws/src/sdks/go/pkg/beam/core/runtime/exec/pcollection.go>:100 +0x151
github.com/apache/beam/sdks/v2/go/pkg/beam/register.(*emit2[...]).invoke(0x1a87360, {0xc0009e64f8, 0xc00040e6d0?, 0x1a6f720?}, {0xc0009e6500?, 0x9, 0x9})
	<https://ci-beam.apache.org/job/beam_LoadTests_Go_GBK_Flink_Batch/ws/src/sdks/go/pkg/beam/register/emitter.go>:80 +0x1fa
github.com/apache/beam/sdks/v2/go/pkg/beam/io/synthetic.(*sourceFn).ProcessElement(0xc0004448f0, 0x0?, {0xbebc200, 0x1, 0x1, 0x9, 0x0, 0x0}, 0xc0003fcc30)
	<https://ci-beam.apache.org/job/beam_LoadTests_Go_GBK_Flink_Batch/ws/src/sdks/go/pkg/beam/io/synthetic/source.go>:151 +0x116
github.com/apache/beam/sdks/v2/go/pkg/beam/register.registerDoFn3x1StructWrappersAndFuncs[...].func2.1({0xbebc200?, 0x1, 0x1, 0x9, 0x0, 0x0}, 0xc0002115c8)
	<https://ci-beam.apache.org/job/beam_LoadTests_Go_GBK_Flink_Batch/ws/src/sdks/go/pkg/beam/register/register.go>:3382 +0xaa
github.com/apache/beam/sdks/v2/go/pkg/beam/register.(*caller3x1[...]).Call3x1(0x10000?, {0x16d95a0?, 0xc0003fcc00?}, {0x1736aa0?, 0xc0004204b0?}, {0x13f2f80?, 0xc0003fcc30?})
	<https://ci-beam.apache.org/job/beam_LoadTests_Go_GBK_Flink_Batch/ws/src/sdks/go/pkg/beam/register/register.go>:3371 +0xaf
github.com/apache/beam/sdks/v2/go/pkg/beam/core/runtime/exec.(*invoker).initCall.func13({0x0, 0x0, 0x0, 0x0, 0x0}, {0x2c6c700, 0x1, 0x1}, 0x0?)
	<https://ci-beam.apache.org/job/beam_LoadTests_Go_GBK_Flink_Batch/ws/src/sdks/go/pkg/beam/core/runtime/exec/fn_arity.go>:109 +0xa9
github.com/apache/beam/sdks/v2/go/pkg/beam/core/runtime/exec.(*invoker).invokeWithOpts(0xc000189040, {0x1a85c30?, 0xc0004053c0}, {0x0, 0x0, 0x0, 0x0, 0x0}, {0x2c6c700, 0x1, ...}, ...)
	<https://ci-beam.apache.org/job/beam_LoadTests_Go_GBK_Flink_Batch/ws/src/sdks/go/pkg/beam/core/runtime/exec/fn.go>:297 +0xf90
github.com/apache/beam/sdks/v2/go/pkg/beam/core/runtime/exec.(*ParDo).invokeProcessFn(0xc0004465a0, {0x1a85c30, 0xc0004053c0}, {0x0, 0x0, 0x0, 0x0, 0x0}, {0x2c6c700, 0x1, ...}, ...)
	<https://ci-beam.apache.org/job/beam_LoadTests_Go_GBK_Flink_Batch/ws/src/sdks/go/pkg/beam/core/runtime/exec/pardo.go>:508 +0x29f
github.com/apache/beam/sdks/v2/go/pkg/beam/core/runtime/exec.(*ParDo).processSingleWindow(0xc0004465a0, 0xc0004573b0)
	<https://ci-beam.apache.org/job/beam_LoadTests_Go_GBK_Flink_Batch/ws/src/sdks/go/pkg/beam/core/runtime/exec/pardo.go>:194 +0x8f
github.com/apache/beam/sdks/v2/go/pkg/beam/core/runtime/exec.(*ProcessSizedElementsAndRestrictions).ProcessElement(0xc00044c820, {0x1a85c30, 0xc000552fc0}, 0xc0000515e0, {0x0, 0x0, 0x0})
	<https://ci-beam.apache.org/job/beam_LoadTests_Go_GBK_Flink_Batch/ws/src/sdks/go/pkg/beam/core/runtime/exec/sdf.go>:556 +0x62f
github.com/apache/beam/sdks/v2/go/pkg/beam/core/runtime/exec.(*DataSource).Process.func1(0xc00057cbb8, {0xc00040f328?, 0xc0001141a0?})
	<https://ci-beam.apache.org/job/beam_LoadTests_Go_GBK_Flink_Batch/ws/src/sdks/go/pkg/beam/core/runtime/exec/datasource.go>:240 +0x223
github.com/apache/beam/sdks/v2/go/pkg/beam/core/runtime/exec.(*DataSource).process(0xc0002fe9a0, {0x1a85c30, 0xc000552fc0}, 0xc00040f618, 0xc00040f5f8)
	<https://ci-beam.apache.org/job/beam_LoadTests_Go_GBK_Flink_Batch/ws/src/sdks/go/pkg/beam/core/runtime/exec/datasource.go>:146 +0x4d3
github.com/apache/beam/sdks/v2/go/pkg/beam/core/runtime/exec.(*DataSource).Process(0xc0002fe9a0, {0x1a85c30, 0xc000552fc0})
	<https://ci-beam.apache.org/job/beam_LoadTests_Go_GBK_Flink_Batch/ws/src/sdks/go/pkg/beam/core/runtime/exec/datasource.go>:214 +0x20a
github.com/apache/beam/sdks/v2/go/pkg/beam/core/runtime/exec.(*Plan).Execute.func2({0x1a85c30?, 0xc000552fc0?})
	<https://ci-beam.apache.org/job/beam_LoadTests_Go_GBK_Flink_Batch/ws/src/sdks/go/pkg/beam/core/runtime/exec/plan.go>:151 +0x3b
github.com/apache/beam/sdks/v2/go/pkg/beam/core/runtime/exec.callNoPanic({0x1a85c30?, 0xc000552fc0?}, 0x418488?)
	<https://ci-beam.apache.org/job/beam_LoadTests_Go_GBK_Flink_Batch/ws/src/sdks/go/pkg/beam/core/runtime/exec/util.go>:62 +0x62
github.com/apache/beam/sdks/v2/go/pkg/beam/core/runtime/exec.(*Plan).Execute(0xc0002f1d40, {0x1a85c30, 0xc000552fc0}, {0x2c0ef48, 0x1}, {{0x1a84b60?, 0xc000405300?}, {0x1abe418?, 0xc00044e4b0?}})
	<https://ci-beam.apache.org/job/beam_LoadTests_Go_GBK_Flink_Batch/ws/src/sdks/go/pkg/beam/core/runtime/exec/plan.go>:150 +0x3b8
github.com/apache/beam/sdks/v2/go/pkg/beam/core/runtime/harness.(*control).handleInstruction(0xc000336000, {0x1a85820?, 0xc000291a70?}, 0xc0000539a0)
	<https://ci-beam.apache.org/job/beam_LoadTests_Go_GBK_Flink_Batch/ws/src/sdks/go/pkg/beam/core/runtime/harness/harness.go>:409 +0x9f8
github.com/apache/beam/sdks/v2/go/pkg/beam/core/runtime/harness.MainWithOptions.func4({0x1a85820?, 0xc000291a70?}, 0x38500000007?)
	<https://ci-beam.apache.org/job/beam_LoadTests_Go_GBK_Flink_Batch/ws/src/sdks/go/pkg/beam/core/runtime/harness/harness.go>:195 +0x74
created by github.com/apache/beam/sdks/v2/go/pkg/beam/core/runtime/harness.MainWithOptions in goroutine 1
	<https://ci-beam.apache.org/job/beam_LoadTests_Go_GBK_Flink_Batch/ws/src/sdks/go/pkg/beam/core/runtime/harness/harness.go>:213 +0xede


goroutine 1 [running]:
github.com/apache/beam/sdks/v2/go/pkg/beam/log.Fatalf({0x1a857e8, 0x2cc1820}, {0x18eeec0?, 0x2cc1820?}, {0xc000427e30?, 0x0?, 0x0?})
	<https://ci-beam.apache.org/job/beam_LoadTests_Go_GBK_Flink_Batch/ws/src/sdks/go/pkg/beam/log/log.go>:162 +0x7d
main.main()
	<https://ci-beam.apache.org/job/beam_LoadTests_Go_GBK_Flink_Batch/ws/src/sdks/go/test/load/group_by_key/group_by_key.go>:98 +0x3d3

> Task :sdks:go:test:load:run FAILED

FAILURE: Build failed with an exception.

* Where:
Build file '<https://ci-beam.apache.org/job/beam_LoadTests_Go_GBK_Flink_Batch/ws/src/sdks/go/test/load/build.gradle'> line: 31

* What went wrong:
Execution failed for task ':sdks:go:test:load:run'.
> Process 'command 'sh'' finished with non-zero exit value 2

* Try:
> Run with --stacktrace option to get the stack trace.
> Run with --info or --debug option to get more log output.
> Get more help at https://help.gradle.org.

Deprecated Gradle features were used in this build, making it incompatible with Gradle 9.0.

You can use '--warning-mode all' to show the individual deprecation warnings and determine if they come from your own scripts or plugins.

For more on this, please refer to https://docs.gradle.org/8.4/userguide/command_line_interface.html#sec:command_line_warnings in the Gradle documentation.

BUILD FAILED in 2m 47s
6 actionable tasks: 5 executed, 1 from cache

Publishing build scan...
https://ge.apache.org/s/bgbmffk67pol6

Build step 'Invoke Gradle script' changed build result to FAILURE
Build step 'Invoke Gradle script' marked build as failure

---------------------------------------------------------------------
To unsubscribe, e-mail: builds-unsubscribe@beam.apache.org
For additional commands, e-mail: builds-help@beam.apache.org