You are viewing a plain text version of this content. The canonical link for it is here.
Posted to dev@zookeeper.apache.org by Apache Jenkins Server <je...@builds.apache.org> on 2014/12/16 12:17:58 UTC

ZooKeeper-trunk - Build # 2533 - Still Failing

See https://builds.apache.org/job/ZooKeeper-trunk/2533/

###################################################################################
########################## LAST 60 LINES OF THE CONSOLE ###########################
[...truncated 329314 lines...]
     [exec] mv -f .deps/zktest_mt-ZooKeeperQuorumServer.Tpo .deps/zktest_mt-ZooKeeperQuorumServer.Po
     [exec] g++ -DHAVE_CONFIG_H -I. -I/home/jenkins/jenkins-slave/workspace/ZooKeeper-trunk/trunk/src/c  -I/home/jenkins/jenkins-slave/workspace/ZooKeeper-trunk/trunk/src/c/include -I/home/jenkins/jenkins-slave/workspace/ZooKeeper-trunk/trunk/src/c/tests -I/home/jenkins/jenkins-slave/workspace/ZooKeeper-trunk/trunk/src/c/generated  -DUSE_STATIC_LIB -DTHREADED -DZKSERVER_CMD="\"/home/jenkins/jenkins-slave/workspace/ZooKeeper-trunk/trunk/src/c/tests/zkServer.sh\"" -DZOO_IPV6_ENABLED -g -O2 -MT zktest_mt-TestReadOnlyClient.o -MD -MP -MF .deps/zktest_mt-TestReadOnlyClient.Tpo -c -o zktest_mt-TestReadOnlyClient.o `test -f 'tests/TestReadOnlyClient.cc' || echo '/home/jenkins/jenkins-slave/workspace/ZooKeeper-trunk/trunk/src/c/'`tests/TestReadOnlyClient.cc
     [exec] mv -f .deps/zktest_mt-TestReadOnlyClient.Tpo .deps/zktest_mt-TestReadOnlyClient.Po
     [exec] g++ -DHAVE_CONFIG_H -I. -I/home/jenkins/jenkins-slave/workspace/ZooKeeper-trunk/trunk/src/c  -I/home/jenkins/jenkins-slave/workspace/ZooKeeper-trunk/trunk/src/c/include -I/home/jenkins/jenkins-slave/workspace/ZooKeeper-trunk/trunk/src/c/tests -I/home/jenkins/jenkins-slave/workspace/ZooKeeper-trunk/trunk/src/c/generated  -DUSE_STATIC_LIB -DTHREADED -DZKSERVER_CMD="\"/home/jenkins/jenkins-slave/workspace/ZooKeeper-trunk/trunk/src/c/tests/zkServer.sh\"" -DZOO_IPV6_ENABLED -g -O2 -MT zktest_mt-PthreadMocks.o -MD -MP -MF .deps/zktest_mt-PthreadMocks.Tpo -c -o zktest_mt-PthreadMocks.o `test -f 'tests/PthreadMocks.cc' || echo '/home/jenkins/jenkins-slave/workspace/ZooKeeper-trunk/trunk/src/c/'`tests/PthreadMocks.cc
     [exec] mv -f .deps/zktest_mt-PthreadMocks.Tpo .deps/zktest_mt-PthreadMocks.Po
     [exec] /bin/bash ./libtool  --tag=CXX   --mode=link g++ -DUSE_STATIC_LIB -DTHREADED -DZKSERVER_CMD="\"/home/jenkins/jenkins-slave/workspace/ZooKeeper-trunk/trunk/src/c/tests/zkServer.sh\"" -DZOO_IPV6_ENABLED -g -O2 -static-libtool-libs -Wl,--wrap -Wl,calloc -Wl,--wrap -Wl,free -Wl,--wrap -Wl,flush_send_queue -Wl,--wrap -Wl,get_xid -Wl,--wrap -Wl,deliverWatchers -Wl,--wrap -Wl,activateWatcher -Wl,--wrap -Wl,pthread_mutex_lock -Wl,--wrap -Wl,pthread_mutex_trylock -Wl,--wrap -Wl,pthread_mutex_unlock  -o zktest-mt zktest_mt-TestDriver.o zktest_mt-LibCMocks.o zktest_mt-LibCSymTable.o zktest_mt-MocksBase.o zktest_mt-ZKMocks.o zktest_mt-Util.o zktest_mt-ThreadingUtil.o zktest_mt-TestZookeeperInit.o zktest_mt-TestZookeeperClose.o zktest_mt-TestReconfig.o zktest_mt-TestReconfigServer.o zktest_mt-TestClientRetry.o zktest_mt-TestOperations.o zktest_mt-TestMulti.o zktest_mt-TestWatchers.o zktest_mt-TestClient.o zktest_mt-ZooKeeperQuorumServer.o zktest_mt-TestReadOnlyClient.o zktest_mt-PthreadMocks.o libzkmt.la libhashtable.la -lpthread -L/usr/lib/x86_64-linux-gnu -lcppunit -ldl 
     [exec] libtool: link: g++ -DUSE_STATIC_LIB -DTHREADED -DZKSERVER_CMD=\"/home/jenkins/jenkins-slave/workspace/ZooKeeper-trunk/trunk/src/c/tests/zkServer.sh\" -DZOO_IPV6_ENABLED -g -O2 -Wl,--wrap -Wl,calloc -Wl,--wrap -Wl,free -Wl,--wrap -Wl,flush_send_queue -Wl,--wrap -Wl,get_xid -Wl,--wrap -Wl,deliverWatchers -Wl,--wrap -Wl,activateWatcher -Wl,--wrap -Wl,pthread_mutex_lock -Wl,--wrap -Wl,pthread_mutex_trylock -Wl,--wrap -Wl,pthread_mutex_unlock -o zktest-mt zktest_mt-TestDriver.o zktest_mt-LibCMocks.o zktest_mt-LibCSymTable.o zktest_mt-MocksBase.o zktest_mt-ZKMocks.o zktest_mt-Util.o zktest_mt-ThreadingUtil.o zktest_mt-TestZookeeperInit.o zktest_mt-TestZookeeperClose.o zktest_mt-TestReconfig.o zktest_mt-TestReconfigServer.o zktest_mt-TestClientRetry.o zktest_mt-TestOperations.o zktest_mt-TestMulti.o zktest_mt-TestWatchers.o zktest_mt-TestClient.o zktest_mt-ZooKeeperQuorumServer.o zktest_mt-TestReadOnlyClient.o zktest_mt-PthreadMocks.o  ./.libs/libzkmt.a -lm ./.libs/libhashtable.a -lpthread -L/usr/lib/x86_64-linux-gnu -lcppunit -ldl
     [exec] make[1]: Leaving directory `/home/jenkins/jenkins-slave/workspace/ZooKeeper-trunk/trunk/build/test/test-cppunit'
     [exec] make  check-TESTS
     [exec] make[1]: Entering directory `/home/jenkins/jenkins-slave/workspace/ZooKeeper-trunk/trunk/build/test/test-cppunit'
     [exec] make[2]: Entering directory `/home/jenkins/jenkins-slave/workspace/ZooKeeper-trunk/trunk/build/test/test-cppunit'
     [exec] PASS: zktest-st
     [exec] FAIL: zktest-mt
     [exec] make[3]: Entering directory `/home/jenkins/jenkins-slave/workspace/ZooKeeper-trunk/trunk/build/test/test-cppunit'
     [exec] make  all-am
     [exec] make[4]: Entering directory `/home/jenkins/jenkins-slave/workspace/ZooKeeper-trunk/trunk/build/test/test-cppunit'
     [exec] make[4]: Leaving directory `/home/jenkins/jenkins-slave/workspace/ZooKeeper-trunk/trunk/build/test/test-cppunit'
     [exec] make[3]: Leaving directory `/home/jenkins/jenkins-slave/workspace/ZooKeeper-trunk/trunk/build/test/test-cppunit'
     [exec] ============================================================================
     [exec] Testsuite summary for zookeeper C client 3.6.0
     [exec] ============================================================================
     [exec] # TOTAL: 2
     [exec] # PASS:  1
     [exec] # SKIP:  0
     [exec] # XFAIL: 0
     [exec] # FAIL:  1
     [exec] # XPASS: 0
     [exec] # ERROR: 0
     [exec] ============================================================================
     [exec] See ./test-suite.log
     [exec] Please report to user@zookeeper.apache.org
     [exec] ============================================================================
     [exec] make[2]: Leaving directory `/home/jenkins/jenkins-slave/workspace/ZooKeeper-trunk/trunk/build/test/test-cppunit'
     [exec] make[1]: Leaving directory `/home/jenkins/jenkins-slave/workspace/ZooKeeper-trunk/trunk/build/test/test-cppunit'
     [exec] make[2]: *** [test-suite.log] Error 1
     [exec] make[1]: *** [check-TESTS] Error 2
     [exec] make: *** [check-am] Error 2

BUILD FAILED
/home/jenkins/jenkins-slave/workspace/ZooKeeper-trunk/trunk/build.xml:1422: The following error occurred while executing this line:
/home/jenkins/jenkins-slave/workspace/ZooKeeper-trunk/trunk/build.xml:1382: The following error occurred while executing this line:
/home/jenkins/jenkins-slave/workspace/ZooKeeper-trunk/trunk/build.xml:1392: exec returned: 2

Total time: 43 minutes 55 seconds
Build step 'Execute shell' marked build as failure
[FINDBUGS] Skipping publisher since build result is FAILURE
[WARNINGS] Skipping publisher since build result is FAILURE
Archiving artifacts
Sending artifact delta relative to ZooKeeper-trunk #2531
Archived 8 artifacts
Archive block size is 32768
Received 2 blocks and 17936470 bytes
Compression is 0.4%
Took 4.7 sec
Recording fingerprints
Recording test results
Publishing Javadoc
Email was triggered for: Failure
Sending email for trigger: Failure



###################################################################################
############################## FAILED TESTS (if any) ##############################
All tests passed

ZooKeeper-trunk - Build # 2578 - Still Failing

Posted by Apache Jenkins Server <je...@builds.apache.org>.
See https://builds.apache.org/job/ZooKeeper-trunk/2578/

###################################################################################
########################## LAST 60 LINES OF THE CONSOLE ###########################
[...truncated 2963 lines...]
   [clover] Updating existing database at '/home/jenkins/jenkins-slave/workspace/ZooKeeper-trunk/trunk/build/test/clover/db/zookeeper_coverage.db'.
   [clover] Processing files at 1.3 source level.
   [clover] /home/jenkins/jenkins-slave/workspace/ZooKeeper-trunk/trunk/src/java/main/org/apache/zookeeper/KeeperException.java:318:24:unexpected token: Code
   [clover] /home/jenkins/jenkins-slave/workspace/ZooKeeper-trunk/trunk/src/java/main/org/apache/zookeeper/KeeperException.java:318:24:unexpected token: Code
   [clover] ** Error(s) occurred and the instrumentation process can't continue.

BUILD FAILED
/home/jenkins/jenkins-slave/workspace/ZooKeeper-trunk/trunk/build.xml:1422: The following error occurred while executing this line:
/home/jenkins/jenkins-slave/workspace/ZooKeeper-trunk/trunk/build.xml:432: com.cenqua.clover.CloverException: /home/jenkins/jenkins-slave/workspace/ZooKeeper-trunk/trunk/src/java/main/org/apache/zookeeper/KeeperException.java:318:24:unexpected token: Code
	at com.cenqua.clover.instr.Instrumenter.instrument(Instrumenter.java:155)
	at org.apache.tools.ant.taskdefs.CloverCompilerAdapter.setJavac(CloverCompilerAdapter.java:339)
	at org.apache.tools.ant.taskdefs.Javac.compile(Javac.java:1156)
	at org.apache.tools.ant.taskdefs.Javac.execute(Javac.java:935)
	at org.apache.tools.ant.UnknownElement.execute(UnknownElement.java:292)
	at sun.reflect.GeneratedMethodAccessor4.invoke(Unknown Source)
	at sun.reflect.DelegatingMethodAccessorImpl.invoke(DelegatingMethodAccessorImpl.java:43)
	at java.lang.reflect.Method.invoke(Method.java:601)
	at org.apache.tools.ant.dispatch.DispatchUtils.execute(DispatchUtils.java:106)
	at org.apache.tools.ant.Task.perform(Task.java:348)
	at org.apache.tools.ant.Target.execute(Target.java:435)
	at org.apache.tools.ant.Target.performTasks(Target.java:456)
	at org.apache.tools.ant.Project.executeSortedTargets(Project.java:1393)
	at org.apache.tools.ant.helper.SingleCheckExecutor.executeTargets(SingleCheckExecutor.java:38)
	at org.apache.tools.ant.Project.executeTargets(Project.java:1248)
	at org.apache.tools.ant.taskdefs.Ant.execute(Ant.java:441)
	at org.apache.tools.ant.taskdefs.CallTarget.execute(CallTarget.java:105)
	at org.apache.tools.ant.UnknownElement.execute(UnknownElement.java:292)
	at sun.reflect.GeneratedMethodAccessor4.invoke(Unknown Source)
	at sun.reflect.DelegatingMethodAccessorImpl.invoke(DelegatingMethodAccessorImpl.java:43)
	at java.lang.reflect.Method.invoke(Method.java:601)
	at org.apache.tools.ant.dispatch.DispatchUtils.execute(DispatchUtils.java:106)
	at org.apache.tools.ant.Task.perform(Task.java:348)
	at org.apache.tools.ant.Target.execute(Target.java:435)
	at org.apache.tools.ant.Target.performTasks(Target.java:456)
	at org.apache.tools.ant.Project.executeSortedTargets(Project.java:1393)
	at org.apache.tools.ant.Project.executeTarget(Project.java:1364)
	at org.apache.tools.ant.helper.DefaultExecutor.executeTargets(DefaultExecutor.java:41)
	at org.apache.tools.ant.Project.executeTargets(Project.java:1248)
	at org.apache.tools.ant.Main.runBuild(Main.java:851)
	at org.apache.tools.ant.Main.startAnt(Main.java:235)
	at org.apache.tools.ant.launch.Launcher.run(Launcher.java:280)
	at org.apache.tools.ant.launch.Launcher.main(Launcher.java:109)

Total time: 5 seconds
Build step 'Execute shell' marked build as failure
[FINDBUGS] Skipping publisher since build result is FAILURE
[WARNINGS] Skipping publisher since build result is FAILURE
Archiving artifacts
Sending artifact delta relative to ZooKeeper-trunk #2531
Archived 3 artifacts
Archive block size is 32768
Received 0 blocks and 18058422 bytes
Compression is 0.0%
Took 4.5 sec
Recording fingerprints
Recording test results
Publishing Javadoc
Email was triggered for: Failure
Sending email for trigger: Failure



###################################################################################
############################## FAILED TESTS (if any) ##############################
No tests ran.

ZooKeeper-trunk - Build # 2577 - Still Failing

Posted by Apache Jenkins Server <je...@builds.apache.org>.
See https://builds.apache.org/job/ZooKeeper-trunk/2577/

###################################################################################
########################## LAST 60 LINES OF THE CONSOLE ###########################
[...truncated 2963 lines...]
   [clover] Processing files at 1.3 source level.
   [clover] /home/jenkins/jenkins-slave/workspace/ZooKeeper-trunk/trunk/src/java/main/org/apache/zookeeper/KeeperException.java:318:24:unexpected token: Code
   [clover] /home/jenkins/jenkins-slave/workspace/ZooKeeper-trunk/trunk/src/java/main/org/apache/zookeeper/KeeperException.java:318:24:unexpected token: Code
   [clover] ** Error(s) occurred and the instrumentation process can't continue.

BUILD FAILED
/home/jenkins/jenkins-slave/workspace/ZooKeeper-trunk/trunk/build.xml:1422: The following error occurred while executing this line:
/home/jenkins/jenkins-slave/workspace/ZooKeeper-trunk/trunk/build.xml:432: com.cenqua.clover.CloverException: /home/jenkins/jenkins-slave/workspace/ZooKeeper-trunk/trunk/src/java/main/org/apache/zookeeper/KeeperException.java:318:24:unexpected token: Code
	at com.cenqua.clover.instr.Instrumenter.instrument(Instrumenter.java:155)
	at org.apache.tools.ant.taskdefs.CloverCompilerAdapter.setJavac(CloverCompilerAdapter.java:339)
	at org.apache.tools.ant.taskdefs.Javac.compile(Javac.java:1156)
	at org.apache.tools.ant.taskdefs.Javac.execute(Javac.java:935)
	at org.apache.tools.ant.UnknownElement.execute(UnknownElement.java:292)
	at sun.reflect.GeneratedMethodAccessor4.invoke(Unknown Source)
	at sun.reflect.DelegatingMethodAccessorImpl.invoke(DelegatingMethodAccessorImpl.java:43)
	at java.lang.reflect.Method.invoke(Method.java:601)
	at org.apache.tools.ant.dispatch.DispatchUtils.execute(DispatchUtils.java:106)
	at org.apache.tools.ant.Task.perform(Task.java:348)
	at org.apache.tools.ant.Target.execute(Target.java:435)
	at org.apache.tools.ant.Target.performTasks(Target.java:456)
	at org.apache.tools.ant.Project.executeSortedTargets(Project.java:1393)
	at org.apache.tools.ant.helper.SingleCheckExecutor.executeTargets(SingleCheckExecutor.java:38)
	at org.apache.tools.ant.Project.executeTargets(Project.java:1248)
	at org.apache.tools.ant.taskdefs.Ant.execute(Ant.java:441)
	at org.apache.tools.ant.taskdefs.CallTarget.execute(CallTarget.java:105)
	at org.apache.tools.ant.UnknownElement.execute(UnknownElement.java:292)
	at sun.reflect.GeneratedMethodAccessor4.invoke(Unknown Source)
	at sun.reflect.DelegatingMethodAccessorImpl.invoke(DelegatingMethodAccessorImpl.java:43)
	at java.lang.reflect.Method.invoke(Method.java:601)
	at org.apache.tools.ant.dispatch.DispatchUtils.execute(DispatchUtils.java:106)
	at org.apache.tools.ant.Task.perform(Task.java:348)
	at org.apache.tools.ant.Target.execute(Target.java:435)
	at org.apache.tools.ant.Target.performTasks(Target.java:456)
	at org.apache.tools.ant.Project.executeSortedTargets(Project.java:1393)
	at org.apache.tools.ant.Project.executeTarget(Project.java:1364)
	at org.apache.tools.ant.helper.DefaultExecutor.executeTargets(DefaultExecutor.java:41)
	at org.apache.tools.ant.Project.executeTargets(Project.java:1248)
	at org.apache.tools.ant.Main.runBuild(Main.java:851)
	at org.apache.tools.ant.Main.startAnt(Main.java:235)
	at org.apache.tools.ant.launch.Launcher.run(Launcher.java:280)
	at org.apache.tools.ant.launch.Launcher.main(Launcher.java:109)

Total time: 5 seconds
Build step 'Execute shell' marked build as failure
[FINDBUGS] Skipping publisher since build result is FAILURE
[WARNINGS] Skipping publisher since build result is FAILURE
Archiving artifacts
Sending artifact delta relative to ZooKeeper-trunk #2531
Archived 3 artifacts
Archive block size is 32768
Received 0 blocks and 18056132 bytes
Compression is 0.0%
Took 4.6 sec
Recording fingerprints
Updating ZOOKEEPER-2110
Recording test results
Publishing Javadoc
Email was triggered for: Failure
Sending email for trigger: Failure



###################################################################################
############################## FAILED TESTS (if any) ##############################
No tests ran.

ZooKeeper-trunk - Build # 2576 - Still Failing

Posted by Apache Jenkins Server <je...@builds.apache.org>.
See https://builds.apache.org/job/ZooKeeper-trunk/2576/

###################################################################################
########################## LAST 60 LINES OF THE CONSOLE ###########################
[...truncated 2963 lines...]
   [clover] Updating existing database at '/home/jenkins/jenkins-slave/workspace/ZooKeeper-trunk/trunk/build/test/clover/db/zookeeper_coverage.db'.
   [clover] Processing files at 1.3 source level.
   [clover] /home/jenkins/jenkins-slave/workspace/ZooKeeper-trunk/trunk/src/java/main/org/apache/zookeeper/KeeperException.java:318:24:unexpected token: Code
   [clover] /home/jenkins/jenkins-slave/workspace/ZooKeeper-trunk/trunk/src/java/main/org/apache/zookeeper/KeeperException.java:318:24:unexpected token: Code
   [clover] ** Error(s) occurred and the instrumentation process can't continue.

BUILD FAILED
/home/jenkins/jenkins-slave/workspace/ZooKeeper-trunk/trunk/build.xml:1422: The following error occurred while executing this line:
/home/jenkins/jenkins-slave/workspace/ZooKeeper-trunk/trunk/build.xml:432: com.cenqua.clover.CloverException: /home/jenkins/jenkins-slave/workspace/ZooKeeper-trunk/trunk/src/java/main/org/apache/zookeeper/KeeperException.java:318:24:unexpected token: Code
	at com.cenqua.clover.instr.Instrumenter.instrument(Instrumenter.java:155)
	at org.apache.tools.ant.taskdefs.CloverCompilerAdapter.setJavac(CloverCompilerAdapter.java:339)
	at org.apache.tools.ant.taskdefs.Javac.compile(Javac.java:1156)
	at org.apache.tools.ant.taskdefs.Javac.execute(Javac.java:935)
	at org.apache.tools.ant.UnknownElement.execute(UnknownElement.java:292)
	at sun.reflect.GeneratedMethodAccessor4.invoke(Unknown Source)
	at sun.reflect.DelegatingMethodAccessorImpl.invoke(DelegatingMethodAccessorImpl.java:43)
	at java.lang.reflect.Method.invoke(Method.java:601)
	at org.apache.tools.ant.dispatch.DispatchUtils.execute(DispatchUtils.java:106)
	at org.apache.tools.ant.Task.perform(Task.java:348)
	at org.apache.tools.ant.Target.execute(Target.java:435)
	at org.apache.tools.ant.Target.performTasks(Target.java:456)
	at org.apache.tools.ant.Project.executeSortedTargets(Project.java:1393)
	at org.apache.tools.ant.helper.SingleCheckExecutor.executeTargets(SingleCheckExecutor.java:38)
	at org.apache.tools.ant.Project.executeTargets(Project.java:1248)
	at org.apache.tools.ant.taskdefs.Ant.execute(Ant.java:441)
	at org.apache.tools.ant.taskdefs.CallTarget.execute(CallTarget.java:105)
	at org.apache.tools.ant.UnknownElement.execute(UnknownElement.java:292)
	at sun.reflect.GeneratedMethodAccessor4.invoke(Unknown Source)
	at sun.reflect.DelegatingMethodAccessorImpl.invoke(DelegatingMethodAccessorImpl.java:43)
	at java.lang.reflect.Method.invoke(Method.java:601)
	at org.apache.tools.ant.dispatch.DispatchUtils.execute(DispatchUtils.java:106)
	at org.apache.tools.ant.Task.perform(Task.java:348)
	at org.apache.tools.ant.Target.execute(Target.java:435)
	at org.apache.tools.ant.Target.performTasks(Target.java:456)
	at org.apache.tools.ant.Project.executeSortedTargets(Project.java:1393)
	at org.apache.tools.ant.Project.executeTarget(Project.java:1364)
	at org.apache.tools.ant.helper.DefaultExecutor.executeTargets(DefaultExecutor.java:41)
	at org.apache.tools.ant.Project.executeTargets(Project.java:1248)
	at org.apache.tools.ant.Main.runBuild(Main.java:851)
	at org.apache.tools.ant.Main.startAnt(Main.java:235)
	at org.apache.tools.ant.launch.Launcher.run(Launcher.java:280)
	at org.apache.tools.ant.launch.Launcher.main(Launcher.java:109)

Total time: 5 seconds
Build step 'Execute shell' marked build as failure
[FINDBUGS] Skipping publisher since build result is FAILURE
[WARNINGS] Skipping publisher since build result is FAILURE
Archiving artifacts
Sending artifact delta relative to ZooKeeper-trunk #2531
Archived 3 artifacts
Archive block size is 32768
Received 0 blocks and 18057519 bytes
Compression is 0.0%
Took 4.6 sec
Recording fingerprints
Recording test results
Publishing Javadoc
Email was triggered for: Failure
Sending email for trigger: Failure



###################################################################################
############################## FAILED TESTS (if any) ##############################
No tests ran.

ZooKeeper-trunk - Build # 2575 - Still Failing

Posted by Apache Jenkins Server <je...@builds.apache.org>.
See https://builds.apache.org/job/ZooKeeper-trunk/2575/

###################################################################################
########################## LAST 60 LINES OF THE CONSOLE ###########################
[...truncated 2963 lines...]
   [clover] Updating existing database at '/home/jenkins/jenkins-slave/workspace/ZooKeeper-trunk/trunk/build/test/clover/db/zookeeper_coverage.db'.
   [clover] Processing files at 1.3 source level.
   [clover] /home/jenkins/jenkins-slave/workspace/ZooKeeper-trunk/trunk/src/java/main/org/apache/zookeeper/KeeperException.java:318:24:unexpected token: Code
   [clover] /home/jenkins/jenkins-slave/workspace/ZooKeeper-trunk/trunk/src/java/main/org/apache/zookeeper/KeeperException.java:318:24:unexpected token: Code
   [clover] ** Error(s) occurred and the instrumentation process can't continue.

BUILD FAILED
/home/jenkins/jenkins-slave/workspace/ZooKeeper-trunk/trunk/build.xml:1422: The following error occurred while executing this line:
/home/jenkins/jenkins-slave/workspace/ZooKeeper-trunk/trunk/build.xml:432: com.cenqua.clover.CloverException: /home/jenkins/jenkins-slave/workspace/ZooKeeper-trunk/trunk/src/java/main/org/apache/zookeeper/KeeperException.java:318:24:unexpected token: Code
	at com.cenqua.clover.instr.Instrumenter.instrument(Instrumenter.java:155)
	at org.apache.tools.ant.taskdefs.CloverCompilerAdapter.setJavac(CloverCompilerAdapter.java:339)
	at org.apache.tools.ant.taskdefs.Javac.compile(Javac.java:1156)
	at org.apache.tools.ant.taskdefs.Javac.execute(Javac.java:935)
	at org.apache.tools.ant.UnknownElement.execute(UnknownElement.java:292)
	at sun.reflect.GeneratedMethodAccessor4.invoke(Unknown Source)
	at sun.reflect.DelegatingMethodAccessorImpl.invoke(DelegatingMethodAccessorImpl.java:43)
	at java.lang.reflect.Method.invoke(Method.java:601)
	at org.apache.tools.ant.dispatch.DispatchUtils.execute(DispatchUtils.java:106)
	at org.apache.tools.ant.Task.perform(Task.java:348)
	at org.apache.tools.ant.Target.execute(Target.java:435)
	at org.apache.tools.ant.Target.performTasks(Target.java:456)
	at org.apache.tools.ant.Project.executeSortedTargets(Project.java:1393)
	at org.apache.tools.ant.helper.SingleCheckExecutor.executeTargets(SingleCheckExecutor.java:38)
	at org.apache.tools.ant.Project.executeTargets(Project.java:1248)
	at org.apache.tools.ant.taskdefs.Ant.execute(Ant.java:441)
	at org.apache.tools.ant.taskdefs.CallTarget.execute(CallTarget.java:105)
	at org.apache.tools.ant.UnknownElement.execute(UnknownElement.java:292)
	at sun.reflect.GeneratedMethodAccessor4.invoke(Unknown Source)
	at sun.reflect.DelegatingMethodAccessorImpl.invoke(DelegatingMethodAccessorImpl.java:43)
	at java.lang.reflect.Method.invoke(Method.java:601)
	at org.apache.tools.ant.dispatch.DispatchUtils.execute(DispatchUtils.java:106)
	at org.apache.tools.ant.Task.perform(Task.java:348)
	at org.apache.tools.ant.Target.execute(Target.java:435)
	at org.apache.tools.ant.Target.performTasks(Target.java:456)
	at org.apache.tools.ant.Project.executeSortedTargets(Project.java:1393)
	at org.apache.tools.ant.Project.executeTarget(Project.java:1364)
	at org.apache.tools.ant.helper.DefaultExecutor.executeTargets(DefaultExecutor.java:41)
	at org.apache.tools.ant.Project.executeTargets(Project.java:1248)
	at org.apache.tools.ant.Main.runBuild(Main.java:851)
	at org.apache.tools.ant.Main.startAnt(Main.java:235)
	at org.apache.tools.ant.launch.Launcher.run(Launcher.java:280)
	at org.apache.tools.ant.launch.Launcher.main(Launcher.java:109)

Total time: 5 seconds
Build step 'Execute shell' marked build as failure
[FINDBUGS] Skipping publisher since build result is FAILURE
[WARNINGS] Skipping publisher since build result is FAILURE
Archiving artifacts
Sending artifact delta relative to ZooKeeper-trunk #2531
Archived 3 artifacts
Archive block size is 32768
Received 0 blocks and 18057835 bytes
Compression is 0.0%
Took 4.8 sec
Recording fingerprints
Recording test results
Publishing Javadoc
Email was triggered for: Failure
Sending email for trigger: Failure



###################################################################################
############################## FAILED TESTS (if any) ##############################
No tests ran.

ZooKeeper-trunk - Build # 2574 - Still Failing

Posted by Apache Jenkins Server <je...@builds.apache.org>.
See https://builds.apache.org/job/ZooKeeper-trunk/2574/

###################################################################################
########################## LAST 60 LINES OF THE CONSOLE ###########################
[...truncated 2963 lines...]
   [clover] Processing files at 1.3 source level.
   [clover] /home/jenkins/jenkins-slave/workspace/ZooKeeper-trunk/trunk/src/java/main/org/apache/zookeeper/KeeperException.java:318:24:unexpected token: Code
   [clover] /home/jenkins/jenkins-slave/workspace/ZooKeeper-trunk/trunk/src/java/main/org/apache/zookeeper/KeeperException.java:318:24:unexpected token: Code
   [clover] ** Error(s) occurred and the instrumentation process can't continue.

BUILD FAILED
/home/jenkins/jenkins-slave/workspace/ZooKeeper-trunk/trunk/build.xml:1422: The following error occurred while executing this line:
/home/jenkins/jenkins-slave/workspace/ZooKeeper-trunk/trunk/build.xml:432: com.cenqua.clover.CloverException: /home/jenkins/jenkins-slave/workspace/ZooKeeper-trunk/trunk/src/java/main/org/apache/zookeeper/KeeperException.java:318:24:unexpected token: Code
	at com.cenqua.clover.instr.Instrumenter.instrument(Instrumenter.java:155)
	at org.apache.tools.ant.taskdefs.CloverCompilerAdapter.setJavac(CloverCompilerAdapter.java:339)
	at org.apache.tools.ant.taskdefs.Javac.compile(Javac.java:1156)
	at org.apache.tools.ant.taskdefs.Javac.execute(Javac.java:935)
	at org.apache.tools.ant.UnknownElement.execute(UnknownElement.java:292)
	at sun.reflect.GeneratedMethodAccessor4.invoke(Unknown Source)
	at sun.reflect.DelegatingMethodAccessorImpl.invoke(DelegatingMethodAccessorImpl.java:43)
	at java.lang.reflect.Method.invoke(Method.java:601)
	at org.apache.tools.ant.dispatch.DispatchUtils.execute(DispatchUtils.java:106)
	at org.apache.tools.ant.Task.perform(Task.java:348)
	at org.apache.tools.ant.Target.execute(Target.java:435)
	at org.apache.tools.ant.Target.performTasks(Target.java:456)
	at org.apache.tools.ant.Project.executeSortedTargets(Project.java:1393)
	at org.apache.tools.ant.helper.SingleCheckExecutor.executeTargets(SingleCheckExecutor.java:38)
	at org.apache.tools.ant.Project.executeTargets(Project.java:1248)
	at org.apache.tools.ant.taskdefs.Ant.execute(Ant.java:441)
	at org.apache.tools.ant.taskdefs.CallTarget.execute(CallTarget.java:105)
	at org.apache.tools.ant.UnknownElement.execute(UnknownElement.java:292)
	at sun.reflect.GeneratedMethodAccessor4.invoke(Unknown Source)
	at sun.reflect.DelegatingMethodAccessorImpl.invoke(DelegatingMethodAccessorImpl.java:43)
	at java.lang.reflect.Method.invoke(Method.java:601)
	at org.apache.tools.ant.dispatch.DispatchUtils.execute(DispatchUtils.java:106)
	at org.apache.tools.ant.Task.perform(Task.java:348)
	at org.apache.tools.ant.Target.execute(Target.java:435)
	at org.apache.tools.ant.Target.performTasks(Target.java:456)
	at org.apache.tools.ant.Project.executeSortedTargets(Project.java:1393)
	at org.apache.tools.ant.Project.executeTarget(Project.java:1364)
	at org.apache.tools.ant.helper.DefaultExecutor.executeTargets(DefaultExecutor.java:41)
	at org.apache.tools.ant.Project.executeTargets(Project.java:1248)
	at org.apache.tools.ant.Main.runBuild(Main.java:851)
	at org.apache.tools.ant.Main.startAnt(Main.java:235)
	at org.apache.tools.ant.launch.Launcher.run(Launcher.java:280)
	at org.apache.tools.ant.launch.Launcher.main(Launcher.java:109)

Total time: 5 seconds
Build step 'Execute shell' marked build as failure
[FINDBUGS] Skipping publisher since build result is FAILURE
[WARNINGS] Skipping publisher since build result is FAILURE
Archiving artifacts
Sending artifact delta relative to ZooKeeper-trunk #2531
Archived 3 artifacts
Archive block size is 32768
Received 0 blocks and 18057132 bytes
Compression is 0.0%
Took 4.7 sec
Recording fingerprints
Updating ZOOKEEPER-1784
Recording test results
Publishing Javadoc
Email was triggered for: Failure
Sending email for trigger: Failure



###################################################################################
############################## FAILED TESTS (if any) ##############################
No tests ran.

ZooKeeper-trunk - Build # 2573 - Still Failing

Posted by Apache Jenkins Server <je...@builds.apache.org>.
See https://builds.apache.org/job/ZooKeeper-trunk/2573/

###################################################################################
########################## LAST 60 LINES OF THE CONSOLE ###########################
[...truncated 2963 lines...]
   [clover] Updating existing database at '/home/jenkins/jenkins-slave/workspace/ZooKeeper-trunk/trunk/build/test/clover/db/zookeeper_coverage.db'.
   [clover] Processing files at 1.3 source level.
   [clover] /home/jenkins/jenkins-slave/workspace/ZooKeeper-trunk/trunk/src/java/main/org/apache/zookeeper/KeeperException.java:318:24:unexpected token: Code
   [clover] /home/jenkins/jenkins-slave/workspace/ZooKeeper-trunk/trunk/src/java/main/org/apache/zookeeper/KeeperException.java:318:24:unexpected token: Code
   [clover] ** Error(s) occurred and the instrumentation process can't continue.

BUILD FAILED
/home/jenkins/jenkins-slave/workspace/ZooKeeper-trunk/trunk/build.xml:1422: The following error occurred while executing this line:
/home/jenkins/jenkins-slave/workspace/ZooKeeper-trunk/trunk/build.xml:432: com.cenqua.clover.CloverException: /home/jenkins/jenkins-slave/workspace/ZooKeeper-trunk/trunk/src/java/main/org/apache/zookeeper/KeeperException.java:318:24:unexpected token: Code
	at com.cenqua.clover.instr.Instrumenter.instrument(Instrumenter.java:155)
	at org.apache.tools.ant.taskdefs.CloverCompilerAdapter.setJavac(CloverCompilerAdapter.java:339)
	at org.apache.tools.ant.taskdefs.Javac.compile(Javac.java:1156)
	at org.apache.tools.ant.taskdefs.Javac.execute(Javac.java:935)
	at org.apache.tools.ant.UnknownElement.execute(UnknownElement.java:292)
	at sun.reflect.GeneratedMethodAccessor4.invoke(Unknown Source)
	at sun.reflect.DelegatingMethodAccessorImpl.invoke(DelegatingMethodAccessorImpl.java:43)
	at java.lang.reflect.Method.invoke(Method.java:601)
	at org.apache.tools.ant.dispatch.DispatchUtils.execute(DispatchUtils.java:106)
	at org.apache.tools.ant.Task.perform(Task.java:348)
	at org.apache.tools.ant.Target.execute(Target.java:435)
	at org.apache.tools.ant.Target.performTasks(Target.java:456)
	at org.apache.tools.ant.Project.executeSortedTargets(Project.java:1393)
	at org.apache.tools.ant.helper.SingleCheckExecutor.executeTargets(SingleCheckExecutor.java:38)
	at org.apache.tools.ant.Project.executeTargets(Project.java:1248)
	at org.apache.tools.ant.taskdefs.Ant.execute(Ant.java:441)
	at org.apache.tools.ant.taskdefs.CallTarget.execute(CallTarget.java:105)
	at org.apache.tools.ant.UnknownElement.execute(UnknownElement.java:292)
	at sun.reflect.GeneratedMethodAccessor4.invoke(Unknown Source)
	at sun.reflect.DelegatingMethodAccessorImpl.invoke(DelegatingMethodAccessorImpl.java:43)
	at java.lang.reflect.Method.invoke(Method.java:601)
	at org.apache.tools.ant.dispatch.DispatchUtils.execute(DispatchUtils.java:106)
	at org.apache.tools.ant.Task.perform(Task.java:348)
	at org.apache.tools.ant.Target.execute(Target.java:435)
	at org.apache.tools.ant.Target.performTasks(Target.java:456)
	at org.apache.tools.ant.Project.executeSortedTargets(Project.java:1393)
	at org.apache.tools.ant.Project.executeTarget(Project.java:1364)
	at org.apache.tools.ant.helper.DefaultExecutor.executeTargets(DefaultExecutor.java:41)
	at org.apache.tools.ant.Project.executeTargets(Project.java:1248)
	at org.apache.tools.ant.Main.runBuild(Main.java:851)
	at org.apache.tools.ant.Main.startAnt(Main.java:235)
	at org.apache.tools.ant.launch.Launcher.run(Launcher.java:280)
	at org.apache.tools.ant.launch.Launcher.main(Launcher.java:109)

Total time: 5 seconds
Build step 'Execute shell' marked build as failure
[FINDBUGS] Skipping publisher since build result is FAILURE
[WARNINGS] Skipping publisher since build result is FAILURE
Archiving artifacts
Sending artifact delta relative to ZooKeeper-trunk #2531
Archived 3 artifacts
Archive block size is 32768
Received 0 blocks and 18055777 bytes
Compression is 0.0%
Took 4.6 sec
Recording fingerprints
Recording test results
Publishing Javadoc
Email was triggered for: Failure
Sending email for trigger: Failure



###################################################################################
############################## FAILED TESTS (if any) ##############################
No tests ran.

ZooKeeper-trunk - Build # 2572 - Still Failing

Posted by Apache Jenkins Server <je...@builds.apache.org>.
See https://builds.apache.org/job/ZooKeeper-trunk/2572/

###################################################################################
########################## LAST 60 LINES OF THE CONSOLE ###########################
[...truncated 2963 lines...]
   [clover] Updating existing database at '/home/jenkins/jenkins-slave/workspace/ZooKeeper-trunk/trunk/build/test/clover/db/zookeeper_coverage.db'.
   [clover] Processing files at 1.3 source level.
   [clover] /home/jenkins/jenkins-slave/workspace/ZooKeeper-trunk/trunk/src/java/main/org/apache/zookeeper/KeeperException.java:318:24:unexpected token: Code
   [clover] /home/jenkins/jenkins-slave/workspace/ZooKeeper-trunk/trunk/src/java/main/org/apache/zookeeper/KeeperException.java:318:24:unexpected token: Code
   [clover] ** Error(s) occurred and the instrumentation process can't continue.

BUILD FAILED
/home/jenkins/jenkins-slave/workspace/ZooKeeper-trunk/trunk/build.xml:1422: The following error occurred while executing this line:
/home/jenkins/jenkins-slave/workspace/ZooKeeper-trunk/trunk/build.xml:432: com.cenqua.clover.CloverException: /home/jenkins/jenkins-slave/workspace/ZooKeeper-trunk/trunk/src/java/main/org/apache/zookeeper/KeeperException.java:318:24:unexpected token: Code
	at com.cenqua.clover.instr.Instrumenter.instrument(Instrumenter.java:155)
	at org.apache.tools.ant.taskdefs.CloverCompilerAdapter.setJavac(CloverCompilerAdapter.java:339)
	at org.apache.tools.ant.taskdefs.Javac.compile(Javac.java:1156)
	at org.apache.tools.ant.taskdefs.Javac.execute(Javac.java:935)
	at org.apache.tools.ant.UnknownElement.execute(UnknownElement.java:292)
	at sun.reflect.GeneratedMethodAccessor4.invoke(Unknown Source)
	at sun.reflect.DelegatingMethodAccessorImpl.invoke(DelegatingMethodAccessorImpl.java:43)
	at java.lang.reflect.Method.invoke(Method.java:601)
	at org.apache.tools.ant.dispatch.DispatchUtils.execute(DispatchUtils.java:106)
	at org.apache.tools.ant.Task.perform(Task.java:348)
	at org.apache.tools.ant.Target.execute(Target.java:435)
	at org.apache.tools.ant.Target.performTasks(Target.java:456)
	at org.apache.tools.ant.Project.executeSortedTargets(Project.java:1393)
	at org.apache.tools.ant.helper.SingleCheckExecutor.executeTargets(SingleCheckExecutor.java:38)
	at org.apache.tools.ant.Project.executeTargets(Project.java:1248)
	at org.apache.tools.ant.taskdefs.Ant.execute(Ant.java:441)
	at org.apache.tools.ant.taskdefs.CallTarget.execute(CallTarget.java:105)
	at org.apache.tools.ant.UnknownElement.execute(UnknownElement.java:292)
	at sun.reflect.GeneratedMethodAccessor4.invoke(Unknown Source)
	at sun.reflect.DelegatingMethodAccessorImpl.invoke(DelegatingMethodAccessorImpl.java:43)
	at java.lang.reflect.Method.invoke(Method.java:601)
	at org.apache.tools.ant.dispatch.DispatchUtils.execute(DispatchUtils.java:106)
	at org.apache.tools.ant.Task.perform(Task.java:348)
	at org.apache.tools.ant.Target.execute(Target.java:435)
	at org.apache.tools.ant.Target.performTasks(Target.java:456)
	at org.apache.tools.ant.Project.executeSortedTargets(Project.java:1393)
	at org.apache.tools.ant.Project.executeTarget(Project.java:1364)
	at org.apache.tools.ant.helper.DefaultExecutor.executeTargets(DefaultExecutor.java:41)
	at org.apache.tools.ant.Project.executeTargets(Project.java:1248)
	at org.apache.tools.ant.Main.runBuild(Main.java:851)
	at org.apache.tools.ant.Main.startAnt(Main.java:235)
	at org.apache.tools.ant.launch.Launcher.run(Launcher.java:280)
	at org.apache.tools.ant.launch.Launcher.main(Launcher.java:109)

Total time: 5 seconds
Build step 'Execute shell' marked build as failure
[FINDBUGS] Skipping publisher since build result is FAILURE
[WARNINGS] Skipping publisher since build result is FAILURE
Archiving artifacts
Sending artifact delta relative to ZooKeeper-trunk #2531
Archived 3 artifacts
Archive block size is 32768
Received 0 blocks and 18055182 bytes
Compression is 0.0%
Took 4.6 sec
Recording fingerprints
Recording test results
Publishing Javadoc
Email was triggered for: Failure
Sending email for trigger: Failure



###################################################################################
############################## FAILED TESTS (if any) ##############################
No tests ran.

ZooKeeper-trunk - Build # 2571 - Still Failing

Posted by Apache Jenkins Server <je...@builds.apache.org>.
See https://builds.apache.org/job/ZooKeeper-trunk/2571/

###################################################################################
########################## LAST 60 LINES OF THE CONSOLE ###########################
[...truncated 2963 lines...]
   [clover] Updating existing database at '/home/jenkins/jenkins-slave/workspace/ZooKeeper-trunk/trunk/build/test/clover/db/zookeeper_coverage.db'.
   [clover] Processing files at 1.3 source level.
   [clover] /home/jenkins/jenkins-slave/workspace/ZooKeeper-trunk/trunk/src/java/main/org/apache/zookeeper/KeeperException.java:318:24:unexpected token: Code
   [clover] /home/jenkins/jenkins-slave/workspace/ZooKeeper-trunk/trunk/src/java/main/org/apache/zookeeper/KeeperException.java:318:24:unexpected token: Code
   [clover] ** Error(s) occurred and the instrumentation process can't continue.

BUILD FAILED
/home/jenkins/jenkins-slave/workspace/ZooKeeper-trunk/trunk/build.xml:1422: The following error occurred while executing this line:
/home/jenkins/jenkins-slave/workspace/ZooKeeper-trunk/trunk/build.xml:432: com.cenqua.clover.CloverException: /home/jenkins/jenkins-slave/workspace/ZooKeeper-trunk/trunk/src/java/main/org/apache/zookeeper/KeeperException.java:318:24:unexpected token: Code
	at com.cenqua.clover.instr.Instrumenter.instrument(Instrumenter.java:155)
	at org.apache.tools.ant.taskdefs.CloverCompilerAdapter.setJavac(CloverCompilerAdapter.java:339)
	at org.apache.tools.ant.taskdefs.Javac.compile(Javac.java:1156)
	at org.apache.tools.ant.taskdefs.Javac.execute(Javac.java:935)
	at org.apache.tools.ant.UnknownElement.execute(UnknownElement.java:292)
	at sun.reflect.GeneratedMethodAccessor4.invoke(Unknown Source)
	at sun.reflect.DelegatingMethodAccessorImpl.invoke(DelegatingMethodAccessorImpl.java:43)
	at java.lang.reflect.Method.invoke(Method.java:601)
	at org.apache.tools.ant.dispatch.DispatchUtils.execute(DispatchUtils.java:106)
	at org.apache.tools.ant.Task.perform(Task.java:348)
	at org.apache.tools.ant.Target.execute(Target.java:435)
	at org.apache.tools.ant.Target.performTasks(Target.java:456)
	at org.apache.tools.ant.Project.executeSortedTargets(Project.java:1393)
	at org.apache.tools.ant.helper.SingleCheckExecutor.executeTargets(SingleCheckExecutor.java:38)
	at org.apache.tools.ant.Project.executeTargets(Project.java:1248)
	at org.apache.tools.ant.taskdefs.Ant.execute(Ant.java:441)
	at org.apache.tools.ant.taskdefs.CallTarget.execute(CallTarget.java:105)
	at org.apache.tools.ant.UnknownElement.execute(UnknownElement.java:292)
	at sun.reflect.GeneratedMethodAccessor4.invoke(Unknown Source)
	at sun.reflect.DelegatingMethodAccessorImpl.invoke(DelegatingMethodAccessorImpl.java:43)
	at java.lang.reflect.Method.invoke(Method.java:601)
	at org.apache.tools.ant.dispatch.DispatchUtils.execute(DispatchUtils.java:106)
	at org.apache.tools.ant.Task.perform(Task.java:348)
	at org.apache.tools.ant.Target.execute(Target.java:435)
	at org.apache.tools.ant.Target.performTasks(Target.java:456)
	at org.apache.tools.ant.Project.executeSortedTargets(Project.java:1393)
	at org.apache.tools.ant.Project.executeTarget(Project.java:1364)
	at org.apache.tools.ant.helper.DefaultExecutor.executeTargets(DefaultExecutor.java:41)
	at org.apache.tools.ant.Project.executeTargets(Project.java:1248)
	at org.apache.tools.ant.Main.runBuild(Main.java:851)
	at org.apache.tools.ant.Main.startAnt(Main.java:235)
	at org.apache.tools.ant.launch.Launcher.run(Launcher.java:280)
	at org.apache.tools.ant.launch.Launcher.main(Launcher.java:109)

Total time: 5 seconds
Build step 'Execute shell' marked build as failure
[FINDBUGS] Skipping publisher since build result is FAILURE
[WARNINGS] Skipping publisher since build result is FAILURE
Archiving artifacts
Sending artifact delta relative to ZooKeeper-trunk #2531
Archived 3 artifacts
Archive block size is 32768
Received 0 blocks and 18056632 bytes
Compression is 0.0%
Took 4.8 sec
Recording fingerprints
Recording test results
Publishing Javadoc
Email was triggered for: Failure
Sending email for trigger: Failure



###################################################################################
############################## FAILED TESTS (if any) ##############################
No tests ran.

ZooKeeper-trunk - Build # 2570 - Still Failing

Posted by Apache Jenkins Server <je...@builds.apache.org>.
See https://builds.apache.org/job/ZooKeeper-trunk/2570/

###################################################################################
########################## LAST 60 LINES OF THE CONSOLE ###########################
[...truncated 2963 lines...]
   [clover] Updating existing database at '/home/jenkins/jenkins-slave/workspace/ZooKeeper-trunk/trunk/build/test/clover/db/zookeeper_coverage.db'.
   [clover] Processing files at 1.3 source level.
   [clover] /home/jenkins/jenkins-slave/workspace/ZooKeeper-trunk/trunk/src/java/main/org/apache/zookeeper/KeeperException.java:318:24:unexpected token: Code
   [clover] /home/jenkins/jenkins-slave/workspace/ZooKeeper-trunk/trunk/src/java/main/org/apache/zookeeper/KeeperException.java:318:24:unexpected token: Code
   [clover] ** Error(s) occurred and the instrumentation process can't continue.

BUILD FAILED
/home/jenkins/jenkins-slave/workspace/ZooKeeper-trunk/trunk/build.xml:1422: The following error occurred while executing this line:
/home/jenkins/jenkins-slave/workspace/ZooKeeper-trunk/trunk/build.xml:432: com.cenqua.clover.CloverException: /home/jenkins/jenkins-slave/workspace/ZooKeeper-trunk/trunk/src/java/main/org/apache/zookeeper/KeeperException.java:318:24:unexpected token: Code
	at com.cenqua.clover.instr.Instrumenter.instrument(Instrumenter.java:155)
	at org.apache.tools.ant.taskdefs.CloverCompilerAdapter.setJavac(CloverCompilerAdapter.java:339)
	at org.apache.tools.ant.taskdefs.Javac.compile(Javac.java:1156)
	at org.apache.tools.ant.taskdefs.Javac.execute(Javac.java:935)
	at org.apache.tools.ant.UnknownElement.execute(UnknownElement.java:292)
	at sun.reflect.GeneratedMethodAccessor4.invoke(Unknown Source)
	at sun.reflect.DelegatingMethodAccessorImpl.invoke(DelegatingMethodAccessorImpl.java:43)
	at java.lang.reflect.Method.invoke(Method.java:601)
	at org.apache.tools.ant.dispatch.DispatchUtils.execute(DispatchUtils.java:106)
	at org.apache.tools.ant.Task.perform(Task.java:348)
	at org.apache.tools.ant.Target.execute(Target.java:435)
	at org.apache.tools.ant.Target.performTasks(Target.java:456)
	at org.apache.tools.ant.Project.executeSortedTargets(Project.java:1393)
	at org.apache.tools.ant.helper.SingleCheckExecutor.executeTargets(SingleCheckExecutor.java:38)
	at org.apache.tools.ant.Project.executeTargets(Project.java:1248)
	at org.apache.tools.ant.taskdefs.Ant.execute(Ant.java:441)
	at org.apache.tools.ant.taskdefs.CallTarget.execute(CallTarget.java:105)
	at org.apache.tools.ant.UnknownElement.execute(UnknownElement.java:292)
	at sun.reflect.GeneratedMethodAccessor4.invoke(Unknown Source)
	at sun.reflect.DelegatingMethodAccessorImpl.invoke(DelegatingMethodAccessorImpl.java:43)
	at java.lang.reflect.Method.invoke(Method.java:601)
	at org.apache.tools.ant.dispatch.DispatchUtils.execute(DispatchUtils.java:106)
	at org.apache.tools.ant.Task.perform(Task.java:348)
	at org.apache.tools.ant.Target.execute(Target.java:435)
	at org.apache.tools.ant.Target.performTasks(Target.java:456)
	at org.apache.tools.ant.Project.executeSortedTargets(Project.java:1393)
	at org.apache.tools.ant.Project.executeTarget(Project.java:1364)
	at org.apache.tools.ant.helper.DefaultExecutor.executeTargets(DefaultExecutor.java:41)
	at org.apache.tools.ant.Project.executeTargets(Project.java:1248)
	at org.apache.tools.ant.Main.runBuild(Main.java:851)
	at org.apache.tools.ant.Main.startAnt(Main.java:235)
	at org.apache.tools.ant.launch.Launcher.run(Launcher.java:280)
	at org.apache.tools.ant.launch.Launcher.main(Launcher.java:109)

Total time: 5 seconds
Build step 'Execute shell' marked build as failure
[FINDBUGS] Skipping publisher since build result is FAILURE
[WARNINGS] Skipping publisher since build result is FAILURE
Archiving artifacts
Sending artifact delta relative to ZooKeeper-trunk #2531
Archived 3 artifacts
Archive block size is 32768
Received 0 blocks and 18056322 bytes
Compression is 0.0%
Took 4.8 sec
Recording fingerprints
Recording test results
Publishing Javadoc
Email was triggered for: Failure
Sending email for trigger: Failure



###################################################################################
############################## FAILED TESTS (if any) ##############################
No tests ran.

ZooKeeper-trunk - Build # 2569 - Still Failing

Posted by Apache Jenkins Server <je...@builds.apache.org>.
See https://builds.apache.org/job/ZooKeeper-trunk/2569/

###################################################################################
########################## LAST 60 LINES OF THE CONSOLE ###########################
[...truncated 2963 lines...]
   [clover] Updating existing database at '/home/jenkins/jenkins-slave/workspace/ZooKeeper-trunk/trunk/build/test/clover/db/zookeeper_coverage.db'.
   [clover] Processing files at 1.3 source level.
   [clover] /home/jenkins/jenkins-slave/workspace/ZooKeeper-trunk/trunk/src/java/main/org/apache/zookeeper/KeeperException.java:318:24:unexpected token: Code
   [clover] /home/jenkins/jenkins-slave/workspace/ZooKeeper-trunk/trunk/src/java/main/org/apache/zookeeper/KeeperException.java:318:24:unexpected token: Code
   [clover] ** Error(s) occurred and the instrumentation process can't continue.

BUILD FAILED
/home/jenkins/jenkins-slave/workspace/ZooKeeper-trunk/trunk/build.xml:1422: The following error occurred while executing this line:
/home/jenkins/jenkins-slave/workspace/ZooKeeper-trunk/trunk/build.xml:432: com.cenqua.clover.CloverException: /home/jenkins/jenkins-slave/workspace/ZooKeeper-trunk/trunk/src/java/main/org/apache/zookeeper/KeeperException.java:318:24:unexpected token: Code
	at com.cenqua.clover.instr.Instrumenter.instrument(Instrumenter.java:155)
	at org.apache.tools.ant.taskdefs.CloverCompilerAdapter.setJavac(CloverCompilerAdapter.java:339)
	at org.apache.tools.ant.taskdefs.Javac.compile(Javac.java:1156)
	at org.apache.tools.ant.taskdefs.Javac.execute(Javac.java:935)
	at org.apache.tools.ant.UnknownElement.execute(UnknownElement.java:292)
	at sun.reflect.GeneratedMethodAccessor4.invoke(Unknown Source)
	at sun.reflect.DelegatingMethodAccessorImpl.invoke(DelegatingMethodAccessorImpl.java:43)
	at java.lang.reflect.Method.invoke(Method.java:601)
	at org.apache.tools.ant.dispatch.DispatchUtils.execute(DispatchUtils.java:106)
	at org.apache.tools.ant.Task.perform(Task.java:348)
	at org.apache.tools.ant.Target.execute(Target.java:435)
	at org.apache.tools.ant.Target.performTasks(Target.java:456)
	at org.apache.tools.ant.Project.executeSortedTargets(Project.java:1393)
	at org.apache.tools.ant.helper.SingleCheckExecutor.executeTargets(SingleCheckExecutor.java:38)
	at org.apache.tools.ant.Project.executeTargets(Project.java:1248)
	at org.apache.tools.ant.taskdefs.Ant.execute(Ant.java:441)
	at org.apache.tools.ant.taskdefs.CallTarget.execute(CallTarget.java:105)
	at org.apache.tools.ant.UnknownElement.execute(UnknownElement.java:292)
	at sun.reflect.GeneratedMethodAccessor4.invoke(Unknown Source)
	at sun.reflect.DelegatingMethodAccessorImpl.invoke(DelegatingMethodAccessorImpl.java:43)
	at java.lang.reflect.Method.invoke(Method.java:601)
	at org.apache.tools.ant.dispatch.DispatchUtils.execute(DispatchUtils.java:106)
	at org.apache.tools.ant.Task.perform(Task.java:348)
	at org.apache.tools.ant.Target.execute(Target.java:435)
	at org.apache.tools.ant.Target.performTasks(Target.java:456)
	at org.apache.tools.ant.Project.executeSortedTargets(Project.java:1393)
	at org.apache.tools.ant.Project.executeTarget(Project.java:1364)
	at org.apache.tools.ant.helper.DefaultExecutor.executeTargets(DefaultExecutor.java:41)
	at org.apache.tools.ant.Project.executeTargets(Project.java:1248)
	at org.apache.tools.ant.Main.runBuild(Main.java:851)
	at org.apache.tools.ant.Main.startAnt(Main.java:235)
	at org.apache.tools.ant.launch.Launcher.run(Launcher.java:280)
	at org.apache.tools.ant.launch.Launcher.main(Launcher.java:109)

Total time: 5 seconds
Build step 'Execute shell' marked build as failure
[FINDBUGS] Skipping publisher since build result is FAILURE
[WARNINGS] Skipping publisher since build result is FAILURE
Archiving artifacts
Sending artifact delta relative to ZooKeeper-trunk #2531
Archived 3 artifacts
Archive block size is 32768
Received 0 blocks and 18057920 bytes
Compression is 0.0%
Took 4.7 sec
Recording fingerprints
Recording test results
Publishing Javadoc
Email was triggered for: Failure
Sending email for trigger: Failure



###################################################################################
############################## FAILED TESTS (if any) ##############################
No tests ran.

ZooKeeper-trunk - Build # 2568 - Still Failing

Posted by Apache Jenkins Server <je...@builds.apache.org>.
See https://builds.apache.org/job/ZooKeeper-trunk/2568/

###################################################################################
########################## LAST 60 LINES OF THE CONSOLE ###########################
[...truncated 2963 lines...]
   [clover] Updating existing database at '/home/jenkins/jenkins-slave/workspace/ZooKeeper-trunk/trunk/build/test/clover/db/zookeeper_coverage.db'.
   [clover] Processing files at 1.3 source level.
   [clover] /home/jenkins/jenkins-slave/workspace/ZooKeeper-trunk/trunk/src/java/main/org/apache/zookeeper/KeeperException.java:318:24:unexpected token: Code
   [clover] /home/jenkins/jenkins-slave/workspace/ZooKeeper-trunk/trunk/src/java/main/org/apache/zookeeper/KeeperException.java:318:24:unexpected token: Code
   [clover] ** Error(s) occurred and the instrumentation process can't continue.

BUILD FAILED
/home/jenkins/jenkins-slave/workspace/ZooKeeper-trunk/trunk/build.xml:1422: The following error occurred while executing this line:
/home/jenkins/jenkins-slave/workspace/ZooKeeper-trunk/trunk/build.xml:432: com.cenqua.clover.CloverException: /home/jenkins/jenkins-slave/workspace/ZooKeeper-trunk/trunk/src/java/main/org/apache/zookeeper/KeeperException.java:318:24:unexpected token: Code
	at com.cenqua.clover.instr.Instrumenter.instrument(Instrumenter.java:155)
	at org.apache.tools.ant.taskdefs.CloverCompilerAdapter.setJavac(CloverCompilerAdapter.java:339)
	at org.apache.tools.ant.taskdefs.Javac.compile(Javac.java:1156)
	at org.apache.tools.ant.taskdefs.Javac.execute(Javac.java:935)
	at org.apache.tools.ant.UnknownElement.execute(UnknownElement.java:292)
	at sun.reflect.GeneratedMethodAccessor4.invoke(Unknown Source)
	at sun.reflect.DelegatingMethodAccessorImpl.invoke(DelegatingMethodAccessorImpl.java:43)
	at java.lang.reflect.Method.invoke(Method.java:601)
	at org.apache.tools.ant.dispatch.DispatchUtils.execute(DispatchUtils.java:106)
	at org.apache.tools.ant.Task.perform(Task.java:348)
	at org.apache.tools.ant.Target.execute(Target.java:435)
	at org.apache.tools.ant.Target.performTasks(Target.java:456)
	at org.apache.tools.ant.Project.executeSortedTargets(Project.java:1393)
	at org.apache.tools.ant.helper.SingleCheckExecutor.executeTargets(SingleCheckExecutor.java:38)
	at org.apache.tools.ant.Project.executeTargets(Project.java:1248)
	at org.apache.tools.ant.taskdefs.Ant.execute(Ant.java:441)
	at org.apache.tools.ant.taskdefs.CallTarget.execute(CallTarget.java:105)
	at org.apache.tools.ant.UnknownElement.execute(UnknownElement.java:292)
	at sun.reflect.GeneratedMethodAccessor4.invoke(Unknown Source)
	at sun.reflect.DelegatingMethodAccessorImpl.invoke(DelegatingMethodAccessorImpl.java:43)
	at java.lang.reflect.Method.invoke(Method.java:601)
	at org.apache.tools.ant.dispatch.DispatchUtils.execute(DispatchUtils.java:106)
	at org.apache.tools.ant.Task.perform(Task.java:348)
	at org.apache.tools.ant.Target.execute(Target.java:435)
	at org.apache.tools.ant.Target.performTasks(Target.java:456)
	at org.apache.tools.ant.Project.executeSortedTargets(Project.java:1393)
	at org.apache.tools.ant.Project.executeTarget(Project.java:1364)
	at org.apache.tools.ant.helper.DefaultExecutor.executeTargets(DefaultExecutor.java:41)
	at org.apache.tools.ant.Project.executeTargets(Project.java:1248)
	at org.apache.tools.ant.Main.runBuild(Main.java:851)
	at org.apache.tools.ant.Main.startAnt(Main.java:235)
	at org.apache.tools.ant.launch.Launcher.run(Launcher.java:280)
	at org.apache.tools.ant.launch.Launcher.main(Launcher.java:109)

Total time: 5 seconds
Build step 'Execute shell' marked build as failure
[FINDBUGS] Skipping publisher since build result is FAILURE
[WARNINGS] Skipping publisher since build result is FAILURE
Archiving artifacts
Sending artifact delta relative to ZooKeeper-trunk #2531
Archived 3 artifacts
Archive block size is 32768
Received 0 blocks and 18056033 bytes
Compression is 0.0%
Took 5.1 sec
Recording fingerprints
Recording test results
Publishing Javadoc
Email was triggered for: Failure
Sending email for trigger: Failure



###################################################################################
############################## FAILED TESTS (if any) ##############################
No tests ran.

ZooKeeper-trunk - Build # 2567 - Still Failing

Posted by Apache Jenkins Server <je...@builds.apache.org>.
See https://builds.apache.org/job/ZooKeeper-trunk/2567/

###################################################################################
########################## LAST 60 LINES OF THE CONSOLE ###########################
[...truncated 2963 lines...]
   [clover] Updating existing database at '/home/jenkins/jenkins-slave/workspace/ZooKeeper-trunk/trunk/build/test/clover/db/zookeeper_coverage.db'.
   [clover] Processing files at 1.3 source level.
   [clover] /home/jenkins/jenkins-slave/workspace/ZooKeeper-trunk/trunk/src/java/main/org/apache/zookeeper/KeeperException.java:318:24:unexpected token: Code
   [clover] /home/jenkins/jenkins-slave/workspace/ZooKeeper-trunk/trunk/src/java/main/org/apache/zookeeper/KeeperException.java:318:24:unexpected token: Code
   [clover] ** Error(s) occurred and the instrumentation process can't continue.

BUILD FAILED
/home/jenkins/jenkins-slave/workspace/ZooKeeper-trunk/trunk/build.xml:1422: The following error occurred while executing this line:
/home/jenkins/jenkins-slave/workspace/ZooKeeper-trunk/trunk/build.xml:432: com.cenqua.clover.CloverException: /home/jenkins/jenkins-slave/workspace/ZooKeeper-trunk/trunk/src/java/main/org/apache/zookeeper/KeeperException.java:318:24:unexpected token: Code
	at com.cenqua.clover.instr.Instrumenter.instrument(Instrumenter.java:155)
	at org.apache.tools.ant.taskdefs.CloverCompilerAdapter.setJavac(CloverCompilerAdapter.java:339)
	at org.apache.tools.ant.taskdefs.Javac.compile(Javac.java:1156)
	at org.apache.tools.ant.taskdefs.Javac.execute(Javac.java:935)
	at org.apache.tools.ant.UnknownElement.execute(UnknownElement.java:292)
	at sun.reflect.GeneratedMethodAccessor4.invoke(Unknown Source)
	at sun.reflect.DelegatingMethodAccessorImpl.invoke(DelegatingMethodAccessorImpl.java:43)
	at java.lang.reflect.Method.invoke(Method.java:601)
	at org.apache.tools.ant.dispatch.DispatchUtils.execute(DispatchUtils.java:106)
	at org.apache.tools.ant.Task.perform(Task.java:348)
	at org.apache.tools.ant.Target.execute(Target.java:435)
	at org.apache.tools.ant.Target.performTasks(Target.java:456)
	at org.apache.tools.ant.Project.executeSortedTargets(Project.java:1393)
	at org.apache.tools.ant.helper.SingleCheckExecutor.executeTargets(SingleCheckExecutor.java:38)
	at org.apache.tools.ant.Project.executeTargets(Project.java:1248)
	at org.apache.tools.ant.taskdefs.Ant.execute(Ant.java:441)
	at org.apache.tools.ant.taskdefs.CallTarget.execute(CallTarget.java:105)
	at org.apache.tools.ant.UnknownElement.execute(UnknownElement.java:292)
	at sun.reflect.GeneratedMethodAccessor4.invoke(Unknown Source)
	at sun.reflect.DelegatingMethodAccessorImpl.invoke(DelegatingMethodAccessorImpl.java:43)
	at java.lang.reflect.Method.invoke(Method.java:601)
	at org.apache.tools.ant.dispatch.DispatchUtils.execute(DispatchUtils.java:106)
	at org.apache.tools.ant.Task.perform(Task.java:348)
	at org.apache.tools.ant.Target.execute(Target.java:435)
	at org.apache.tools.ant.Target.performTasks(Target.java:456)
	at org.apache.tools.ant.Project.executeSortedTargets(Project.java:1393)
	at org.apache.tools.ant.Project.executeTarget(Project.java:1364)
	at org.apache.tools.ant.helper.DefaultExecutor.executeTargets(DefaultExecutor.java:41)
	at org.apache.tools.ant.Project.executeTargets(Project.java:1248)
	at org.apache.tools.ant.Main.runBuild(Main.java:851)
	at org.apache.tools.ant.Main.startAnt(Main.java:235)
	at org.apache.tools.ant.launch.Launcher.run(Launcher.java:280)
	at org.apache.tools.ant.launch.Launcher.main(Launcher.java:109)

Total time: 5 seconds
Build step 'Execute shell' marked build as failure
[FINDBUGS] Skipping publisher since build result is FAILURE
[WARNINGS] Skipping publisher since build result is FAILURE
Archiving artifacts
Sending artifact delta relative to ZooKeeper-trunk #2531
Archived 3 artifacts
Archive block size is 32768
Received 0 blocks and 18057258 bytes
Compression is 0.0%
Took 7.4 sec
Recording fingerprints
Recording test results
Publishing Javadoc
Email was triggered for: Failure
Sending email for trigger: Failure



###################################################################################
############################## FAILED TESTS (if any) ##############################
No tests ran.

ZooKeeper-trunk - Build # 2566 - Still Failing

Posted by Apache Jenkins Server <je...@builds.apache.org>.
See https://builds.apache.org/job/ZooKeeper-trunk/2566/

###################################################################################
########################## LAST 60 LINES OF THE CONSOLE ###########################
[...truncated 2963 lines...]
   [clover] Updating existing database at '/home/jenkins/jenkins-slave/workspace/ZooKeeper-trunk/trunk/build/test/clover/db/zookeeper_coverage.db'.
   [clover] Processing files at 1.3 source level.
   [clover] /home/jenkins/jenkins-slave/workspace/ZooKeeper-trunk/trunk/src/java/main/org/apache/zookeeper/KeeperException.java:318:24:unexpected token: Code
   [clover] /home/jenkins/jenkins-slave/workspace/ZooKeeper-trunk/trunk/src/java/main/org/apache/zookeeper/KeeperException.java:318:24:unexpected token: Code
   [clover] ** Error(s) occurred and the instrumentation process can't continue.

BUILD FAILED
/home/jenkins/jenkins-slave/workspace/ZooKeeper-trunk/trunk/build.xml:1422: The following error occurred while executing this line:
/home/jenkins/jenkins-slave/workspace/ZooKeeper-trunk/trunk/build.xml:432: com.cenqua.clover.CloverException: /home/jenkins/jenkins-slave/workspace/ZooKeeper-trunk/trunk/src/java/main/org/apache/zookeeper/KeeperException.java:318:24:unexpected token: Code
	at com.cenqua.clover.instr.Instrumenter.instrument(Instrumenter.java:155)
	at org.apache.tools.ant.taskdefs.CloverCompilerAdapter.setJavac(CloverCompilerAdapter.java:339)
	at org.apache.tools.ant.taskdefs.Javac.compile(Javac.java:1156)
	at org.apache.tools.ant.taskdefs.Javac.execute(Javac.java:935)
	at org.apache.tools.ant.UnknownElement.execute(UnknownElement.java:292)
	at sun.reflect.GeneratedMethodAccessor4.invoke(Unknown Source)
	at sun.reflect.DelegatingMethodAccessorImpl.invoke(DelegatingMethodAccessorImpl.java:43)
	at java.lang.reflect.Method.invoke(Method.java:601)
	at org.apache.tools.ant.dispatch.DispatchUtils.execute(DispatchUtils.java:106)
	at org.apache.tools.ant.Task.perform(Task.java:348)
	at org.apache.tools.ant.Target.execute(Target.java:435)
	at org.apache.tools.ant.Target.performTasks(Target.java:456)
	at org.apache.tools.ant.Project.executeSortedTargets(Project.java:1393)
	at org.apache.tools.ant.helper.SingleCheckExecutor.executeTargets(SingleCheckExecutor.java:38)
	at org.apache.tools.ant.Project.executeTargets(Project.java:1248)
	at org.apache.tools.ant.taskdefs.Ant.execute(Ant.java:441)
	at org.apache.tools.ant.taskdefs.CallTarget.execute(CallTarget.java:105)
	at org.apache.tools.ant.UnknownElement.execute(UnknownElement.java:292)
	at sun.reflect.GeneratedMethodAccessor4.invoke(Unknown Source)
	at sun.reflect.DelegatingMethodAccessorImpl.invoke(DelegatingMethodAccessorImpl.java:43)
	at java.lang.reflect.Method.invoke(Method.java:601)
	at org.apache.tools.ant.dispatch.DispatchUtils.execute(DispatchUtils.java:106)
	at org.apache.tools.ant.Task.perform(Task.java:348)
	at org.apache.tools.ant.Target.execute(Target.java:435)
	at org.apache.tools.ant.Target.performTasks(Target.java:456)
	at org.apache.tools.ant.Project.executeSortedTargets(Project.java:1393)
	at org.apache.tools.ant.Project.executeTarget(Project.java:1364)
	at org.apache.tools.ant.helper.DefaultExecutor.executeTargets(DefaultExecutor.java:41)
	at org.apache.tools.ant.Project.executeTargets(Project.java:1248)
	at org.apache.tools.ant.Main.runBuild(Main.java:851)
	at org.apache.tools.ant.Main.startAnt(Main.java:235)
	at org.apache.tools.ant.launch.Launcher.run(Launcher.java:280)
	at org.apache.tools.ant.launch.Launcher.main(Launcher.java:109)

Total time: 5 seconds
Build step 'Execute shell' marked build as failure
[FINDBUGS] Skipping publisher since build result is FAILURE
[WARNINGS] Skipping publisher since build result is FAILURE
Archiving artifacts
Sending artifact delta relative to ZooKeeper-trunk #2531
Archived 3 artifacts
Archive block size is 32768
Received 0 blocks and 18058225 bytes
Compression is 0.0%
Took 4.7 sec
Recording fingerprints
Recording test results
Publishing Javadoc
Email was triggered for: Failure
Sending email for trigger: Failure



###################################################################################
############################## FAILED TESTS (if any) ##############################
No tests ran.

ZooKeeper-trunk - Build # 2565 - Still Failing

Posted by Apache Jenkins Server <je...@builds.apache.org>.
See https://builds.apache.org/job/ZooKeeper-trunk/2565/

###################################################################################
########################## LAST 60 LINES OF THE CONSOLE ###########################
[...truncated 2963 lines...]
   [clover] Updating existing database at '/home/jenkins/jenkins-slave/workspace/ZooKeeper-trunk/trunk/build/test/clover/db/zookeeper_coverage.db'.
   [clover] Processing files at 1.3 source level.
   [clover] /home/jenkins/jenkins-slave/workspace/ZooKeeper-trunk/trunk/src/java/main/org/apache/zookeeper/KeeperException.java:318:24:unexpected token: Code
   [clover] /home/jenkins/jenkins-slave/workspace/ZooKeeper-trunk/trunk/src/java/main/org/apache/zookeeper/KeeperException.java:318:24:unexpected token: Code
   [clover] ** Error(s) occurred and the instrumentation process can't continue.

BUILD FAILED
/home/jenkins/jenkins-slave/workspace/ZooKeeper-trunk/trunk/build.xml:1422: The following error occurred while executing this line:
/home/jenkins/jenkins-slave/workspace/ZooKeeper-trunk/trunk/build.xml:432: com.cenqua.clover.CloverException: /home/jenkins/jenkins-slave/workspace/ZooKeeper-trunk/trunk/src/java/main/org/apache/zookeeper/KeeperException.java:318:24:unexpected token: Code
	at com.cenqua.clover.instr.Instrumenter.instrument(Instrumenter.java:155)
	at org.apache.tools.ant.taskdefs.CloverCompilerAdapter.setJavac(CloverCompilerAdapter.java:339)
	at org.apache.tools.ant.taskdefs.Javac.compile(Javac.java:1156)
	at org.apache.tools.ant.taskdefs.Javac.execute(Javac.java:935)
	at org.apache.tools.ant.UnknownElement.execute(UnknownElement.java:292)
	at sun.reflect.GeneratedMethodAccessor4.invoke(Unknown Source)
	at sun.reflect.DelegatingMethodAccessorImpl.invoke(DelegatingMethodAccessorImpl.java:43)
	at java.lang.reflect.Method.invoke(Method.java:601)
	at org.apache.tools.ant.dispatch.DispatchUtils.execute(DispatchUtils.java:106)
	at org.apache.tools.ant.Task.perform(Task.java:348)
	at org.apache.tools.ant.Target.execute(Target.java:435)
	at org.apache.tools.ant.Target.performTasks(Target.java:456)
	at org.apache.tools.ant.Project.executeSortedTargets(Project.java:1393)
	at org.apache.tools.ant.helper.SingleCheckExecutor.executeTargets(SingleCheckExecutor.java:38)
	at org.apache.tools.ant.Project.executeTargets(Project.java:1248)
	at org.apache.tools.ant.taskdefs.Ant.execute(Ant.java:441)
	at org.apache.tools.ant.taskdefs.CallTarget.execute(CallTarget.java:105)
	at org.apache.tools.ant.UnknownElement.execute(UnknownElement.java:292)
	at sun.reflect.GeneratedMethodAccessor4.invoke(Unknown Source)
	at sun.reflect.DelegatingMethodAccessorImpl.invoke(DelegatingMethodAccessorImpl.java:43)
	at java.lang.reflect.Method.invoke(Method.java:601)
	at org.apache.tools.ant.dispatch.DispatchUtils.execute(DispatchUtils.java:106)
	at org.apache.tools.ant.Task.perform(Task.java:348)
	at org.apache.tools.ant.Target.execute(Target.java:435)
	at org.apache.tools.ant.Target.performTasks(Target.java:456)
	at org.apache.tools.ant.Project.executeSortedTargets(Project.java:1393)
	at org.apache.tools.ant.Project.executeTarget(Project.java:1364)
	at org.apache.tools.ant.helper.DefaultExecutor.executeTargets(DefaultExecutor.java:41)
	at org.apache.tools.ant.Project.executeTargets(Project.java:1248)
	at org.apache.tools.ant.Main.runBuild(Main.java:851)
	at org.apache.tools.ant.Main.startAnt(Main.java:235)
	at org.apache.tools.ant.launch.Launcher.run(Launcher.java:280)
	at org.apache.tools.ant.launch.Launcher.main(Launcher.java:109)

Total time: 5 seconds
Build step 'Execute shell' marked build as failure
[FINDBUGS] Skipping publisher since build result is FAILURE
[WARNINGS] Skipping publisher since build result is FAILURE
Archiving artifacts
Sending artifact delta relative to ZooKeeper-trunk #2531
Archived 3 artifacts
Archive block size is 32768
Received 0 blocks and 18055627 bytes
Compression is 0.0%
Took 5.2 sec
Recording fingerprints
Recording test results
Publishing Javadoc
Email was triggered for: Failure
Sending email for trigger: Failure



###################################################################################
############################## FAILED TESTS (if any) ##############################
No tests ran.

ZooKeeper-trunk - Build # 2564 - Still Failing

Posted by Apache Jenkins Server <je...@builds.apache.org>.
See https://builds.apache.org/job/ZooKeeper-trunk/2564/

###################################################################################
########################## LAST 60 LINES OF THE CONSOLE ###########################
[...truncated 2963 lines...]
   [clover] Updating existing database at '/home/jenkins/jenkins-slave/workspace/ZooKeeper-trunk/trunk/build/test/clover/db/zookeeper_coverage.db'.
   [clover] Processing files at 1.3 source level.
   [clover] /home/jenkins/jenkins-slave/workspace/ZooKeeper-trunk/trunk/src/java/main/org/apache/zookeeper/KeeperException.java:318:24:unexpected token: Code
   [clover] /home/jenkins/jenkins-slave/workspace/ZooKeeper-trunk/trunk/src/java/main/org/apache/zookeeper/KeeperException.java:318:24:unexpected token: Code
   [clover] ** Error(s) occurred and the instrumentation process can't continue.

BUILD FAILED
/home/jenkins/jenkins-slave/workspace/ZooKeeper-trunk/trunk/build.xml:1422: The following error occurred while executing this line:
/home/jenkins/jenkins-slave/workspace/ZooKeeper-trunk/trunk/build.xml:432: com.cenqua.clover.CloverException: /home/jenkins/jenkins-slave/workspace/ZooKeeper-trunk/trunk/src/java/main/org/apache/zookeeper/KeeperException.java:318:24:unexpected token: Code
	at com.cenqua.clover.instr.Instrumenter.instrument(Instrumenter.java:155)
	at org.apache.tools.ant.taskdefs.CloverCompilerAdapter.setJavac(CloverCompilerAdapter.java:339)
	at org.apache.tools.ant.taskdefs.Javac.compile(Javac.java:1156)
	at org.apache.tools.ant.taskdefs.Javac.execute(Javac.java:935)
	at org.apache.tools.ant.UnknownElement.execute(UnknownElement.java:292)
	at sun.reflect.GeneratedMethodAccessor4.invoke(Unknown Source)
	at sun.reflect.DelegatingMethodAccessorImpl.invoke(DelegatingMethodAccessorImpl.java:43)
	at java.lang.reflect.Method.invoke(Method.java:601)
	at org.apache.tools.ant.dispatch.DispatchUtils.execute(DispatchUtils.java:106)
	at org.apache.tools.ant.Task.perform(Task.java:348)
	at org.apache.tools.ant.Target.execute(Target.java:435)
	at org.apache.tools.ant.Target.performTasks(Target.java:456)
	at org.apache.tools.ant.Project.executeSortedTargets(Project.java:1393)
	at org.apache.tools.ant.helper.SingleCheckExecutor.executeTargets(SingleCheckExecutor.java:38)
	at org.apache.tools.ant.Project.executeTargets(Project.java:1248)
	at org.apache.tools.ant.taskdefs.Ant.execute(Ant.java:441)
	at org.apache.tools.ant.taskdefs.CallTarget.execute(CallTarget.java:105)
	at org.apache.tools.ant.UnknownElement.execute(UnknownElement.java:292)
	at sun.reflect.GeneratedMethodAccessor4.invoke(Unknown Source)
	at sun.reflect.DelegatingMethodAccessorImpl.invoke(DelegatingMethodAccessorImpl.java:43)
	at java.lang.reflect.Method.invoke(Method.java:601)
	at org.apache.tools.ant.dispatch.DispatchUtils.execute(DispatchUtils.java:106)
	at org.apache.tools.ant.Task.perform(Task.java:348)
	at org.apache.tools.ant.Target.execute(Target.java:435)
	at org.apache.tools.ant.Target.performTasks(Target.java:456)
	at org.apache.tools.ant.Project.executeSortedTargets(Project.java:1393)
	at org.apache.tools.ant.Project.executeTarget(Project.java:1364)
	at org.apache.tools.ant.helper.DefaultExecutor.executeTargets(DefaultExecutor.java:41)
	at org.apache.tools.ant.Project.executeTargets(Project.java:1248)
	at org.apache.tools.ant.Main.runBuild(Main.java:851)
	at org.apache.tools.ant.Main.startAnt(Main.java:235)
	at org.apache.tools.ant.launch.Launcher.run(Launcher.java:280)
	at org.apache.tools.ant.launch.Launcher.main(Launcher.java:109)

Total time: 5 seconds
Build step 'Execute shell' marked build as failure
[FINDBUGS] Skipping publisher since build result is FAILURE
[WARNINGS] Skipping publisher since build result is FAILURE
Archiving artifacts
Sending artifact delta relative to ZooKeeper-trunk #2531
Archived 3 artifacts
Archive block size is 32768
Received 0 blocks and 18056819 bytes
Compression is 0.0%
Took 6.3 sec
Recording fingerprints
Recording test results
Publishing Javadoc
Email was triggered for: Failure
Sending email for trigger: Failure



###################################################################################
############################## FAILED TESTS (if any) ##############################
No tests ran.

ZooKeeper-trunk - Build # 2563 - Still Failing

Posted by Apache Jenkins Server <je...@builds.apache.org>.
See https://builds.apache.org/job/ZooKeeper-trunk/2563/

###################################################################################
########################## LAST 60 LINES OF THE CONSOLE ###########################
[...truncated 2963 lines...]
   [clover] Updating existing database at '/home/jenkins/jenkins-slave/workspace/ZooKeeper-trunk/trunk/build/test/clover/db/zookeeper_coverage.db'.
   [clover] Processing files at 1.3 source level.
   [clover] /home/jenkins/jenkins-slave/workspace/ZooKeeper-trunk/trunk/src/java/main/org/apache/zookeeper/KeeperException.java:318:24:unexpected token: Code
   [clover] /home/jenkins/jenkins-slave/workspace/ZooKeeper-trunk/trunk/src/java/main/org/apache/zookeeper/KeeperException.java:318:24:unexpected token: Code
   [clover] ** Error(s) occurred and the instrumentation process can't continue.

BUILD FAILED
/home/jenkins/jenkins-slave/workspace/ZooKeeper-trunk/trunk/build.xml:1422: The following error occurred while executing this line:
/home/jenkins/jenkins-slave/workspace/ZooKeeper-trunk/trunk/build.xml:432: com.cenqua.clover.CloverException: /home/jenkins/jenkins-slave/workspace/ZooKeeper-trunk/trunk/src/java/main/org/apache/zookeeper/KeeperException.java:318:24:unexpected token: Code
	at com.cenqua.clover.instr.Instrumenter.instrument(Instrumenter.java:155)
	at org.apache.tools.ant.taskdefs.CloverCompilerAdapter.setJavac(CloverCompilerAdapter.java:339)
	at org.apache.tools.ant.taskdefs.Javac.compile(Javac.java:1156)
	at org.apache.tools.ant.taskdefs.Javac.execute(Javac.java:935)
	at org.apache.tools.ant.UnknownElement.execute(UnknownElement.java:292)
	at sun.reflect.GeneratedMethodAccessor4.invoke(Unknown Source)
	at sun.reflect.DelegatingMethodAccessorImpl.invoke(DelegatingMethodAccessorImpl.java:43)
	at java.lang.reflect.Method.invoke(Method.java:601)
	at org.apache.tools.ant.dispatch.DispatchUtils.execute(DispatchUtils.java:106)
	at org.apache.tools.ant.Task.perform(Task.java:348)
	at org.apache.tools.ant.Target.execute(Target.java:435)
	at org.apache.tools.ant.Target.performTasks(Target.java:456)
	at org.apache.tools.ant.Project.executeSortedTargets(Project.java:1393)
	at org.apache.tools.ant.helper.SingleCheckExecutor.executeTargets(SingleCheckExecutor.java:38)
	at org.apache.tools.ant.Project.executeTargets(Project.java:1248)
	at org.apache.tools.ant.taskdefs.Ant.execute(Ant.java:441)
	at org.apache.tools.ant.taskdefs.CallTarget.execute(CallTarget.java:105)
	at org.apache.tools.ant.UnknownElement.execute(UnknownElement.java:292)
	at sun.reflect.GeneratedMethodAccessor4.invoke(Unknown Source)
	at sun.reflect.DelegatingMethodAccessorImpl.invoke(DelegatingMethodAccessorImpl.java:43)
	at java.lang.reflect.Method.invoke(Method.java:601)
	at org.apache.tools.ant.dispatch.DispatchUtils.execute(DispatchUtils.java:106)
	at org.apache.tools.ant.Task.perform(Task.java:348)
	at org.apache.tools.ant.Target.execute(Target.java:435)
	at org.apache.tools.ant.Target.performTasks(Target.java:456)
	at org.apache.tools.ant.Project.executeSortedTargets(Project.java:1393)
	at org.apache.tools.ant.Project.executeTarget(Project.java:1364)
	at org.apache.tools.ant.helper.DefaultExecutor.executeTargets(DefaultExecutor.java:41)
	at org.apache.tools.ant.Project.executeTargets(Project.java:1248)
	at org.apache.tools.ant.Main.runBuild(Main.java:851)
	at org.apache.tools.ant.Main.startAnt(Main.java:235)
	at org.apache.tools.ant.launch.Launcher.run(Launcher.java:280)
	at org.apache.tools.ant.launch.Launcher.main(Launcher.java:109)

Total time: 5 seconds
Build step 'Execute shell' marked build as failure
[FINDBUGS] Skipping publisher since build result is FAILURE
[WARNINGS] Skipping publisher since build result is FAILURE
Archiving artifacts
Sending artifact delta relative to ZooKeeper-trunk #2531
Archived 3 artifacts
Archive block size is 32768
Received 0 blocks and 18058045 bytes
Compression is 0.0%
Took 4.9 sec
Recording fingerprints
Recording test results
Publishing Javadoc
Email was triggered for: Failure
Sending email for trigger: Failure



###################################################################################
############################## FAILED TESTS (if any) ##############################
No tests ran.

ZooKeeper-trunk - Build # 2562 - Still Failing

Posted by Apache Jenkins Server <je...@builds.apache.org>.
See https://builds.apache.org/job/ZooKeeper-trunk/2562/

###################################################################################
########################## LAST 60 LINES OF THE CONSOLE ###########################
[...truncated 2963 lines...]
   [clover] Updating existing database at '/home/jenkins/jenkins-slave/workspace/ZooKeeper-trunk/trunk/build/test/clover/db/zookeeper_coverage.db'.
   [clover] Processing files at 1.3 source level.
   [clover] /home/jenkins/jenkins-slave/workspace/ZooKeeper-trunk/trunk/src/java/main/org/apache/zookeeper/KeeperException.java:318:24:unexpected token: Code
   [clover] /home/jenkins/jenkins-slave/workspace/ZooKeeper-trunk/trunk/src/java/main/org/apache/zookeeper/KeeperException.java:318:24:unexpected token: Code
   [clover] ** Error(s) occurred and the instrumentation process can't continue.

BUILD FAILED
/home/jenkins/jenkins-slave/workspace/ZooKeeper-trunk/trunk/build.xml:1422: The following error occurred while executing this line:
/home/jenkins/jenkins-slave/workspace/ZooKeeper-trunk/trunk/build.xml:432: com.cenqua.clover.CloverException: /home/jenkins/jenkins-slave/workspace/ZooKeeper-trunk/trunk/src/java/main/org/apache/zookeeper/KeeperException.java:318:24:unexpected token: Code
	at com.cenqua.clover.instr.Instrumenter.instrument(Instrumenter.java:155)
	at org.apache.tools.ant.taskdefs.CloverCompilerAdapter.setJavac(CloverCompilerAdapter.java:339)
	at org.apache.tools.ant.taskdefs.Javac.compile(Javac.java:1156)
	at org.apache.tools.ant.taskdefs.Javac.execute(Javac.java:935)
	at org.apache.tools.ant.UnknownElement.execute(UnknownElement.java:292)
	at sun.reflect.GeneratedMethodAccessor4.invoke(Unknown Source)
	at sun.reflect.DelegatingMethodAccessorImpl.invoke(DelegatingMethodAccessorImpl.java:43)
	at java.lang.reflect.Method.invoke(Method.java:601)
	at org.apache.tools.ant.dispatch.DispatchUtils.execute(DispatchUtils.java:106)
	at org.apache.tools.ant.Task.perform(Task.java:348)
	at org.apache.tools.ant.Target.execute(Target.java:435)
	at org.apache.tools.ant.Target.performTasks(Target.java:456)
	at org.apache.tools.ant.Project.executeSortedTargets(Project.java:1393)
	at org.apache.tools.ant.helper.SingleCheckExecutor.executeTargets(SingleCheckExecutor.java:38)
	at org.apache.tools.ant.Project.executeTargets(Project.java:1248)
	at org.apache.tools.ant.taskdefs.Ant.execute(Ant.java:441)
	at org.apache.tools.ant.taskdefs.CallTarget.execute(CallTarget.java:105)
	at org.apache.tools.ant.UnknownElement.execute(UnknownElement.java:292)
	at sun.reflect.GeneratedMethodAccessor4.invoke(Unknown Source)
	at sun.reflect.DelegatingMethodAccessorImpl.invoke(DelegatingMethodAccessorImpl.java:43)
	at java.lang.reflect.Method.invoke(Method.java:601)
	at org.apache.tools.ant.dispatch.DispatchUtils.execute(DispatchUtils.java:106)
	at org.apache.tools.ant.Task.perform(Task.java:348)
	at org.apache.tools.ant.Target.execute(Target.java:435)
	at org.apache.tools.ant.Target.performTasks(Target.java:456)
	at org.apache.tools.ant.Project.executeSortedTargets(Project.java:1393)
	at org.apache.tools.ant.Project.executeTarget(Project.java:1364)
	at org.apache.tools.ant.helper.DefaultExecutor.executeTargets(DefaultExecutor.java:41)
	at org.apache.tools.ant.Project.executeTargets(Project.java:1248)
	at org.apache.tools.ant.Main.runBuild(Main.java:851)
	at org.apache.tools.ant.Main.startAnt(Main.java:235)
	at org.apache.tools.ant.launch.Launcher.run(Launcher.java:280)
	at org.apache.tools.ant.launch.Launcher.main(Launcher.java:109)

Total time: 5 seconds
Build step 'Execute shell' marked build as failure
[FINDBUGS] Skipping publisher since build result is FAILURE
[WARNINGS] Skipping publisher since build result is FAILURE
Archiving artifacts
Sending artifact delta relative to ZooKeeper-trunk #2531
Archived 3 artifacts
Archive block size is 32768
Received 0 blocks and 18054949 bytes
Compression is 0.0%
Took 5 sec
Recording fingerprints
Recording test results
Publishing Javadoc
Email was triggered for: Failure
Sending email for trigger: Failure



###################################################################################
############################## FAILED TESTS (if any) ##############################
No tests ran.

ZooKeeper-trunk - Build # 2561 - Still Failing

Posted by Apache Jenkins Server <je...@builds.apache.org>.
See https://builds.apache.org/job/ZooKeeper-trunk/2561/

###################################################################################
########################## LAST 60 LINES OF THE CONSOLE ###########################
[...truncated 2963 lines...]
   [clover] Updating existing database at '/home/jenkins/jenkins-slave/workspace/ZooKeeper-trunk/trunk/build/test/clover/db/zookeeper_coverage.db'.
   [clover] Processing files at 1.3 source level.
   [clover] /home/jenkins/jenkins-slave/workspace/ZooKeeper-trunk/trunk/src/java/main/org/apache/zookeeper/KeeperException.java:318:24:unexpected token: Code
   [clover] /home/jenkins/jenkins-slave/workspace/ZooKeeper-trunk/trunk/src/java/main/org/apache/zookeeper/KeeperException.java:318:24:unexpected token: Code
   [clover] ** Error(s) occurred and the instrumentation process can't continue.

BUILD FAILED
/home/jenkins/jenkins-slave/workspace/ZooKeeper-trunk/trunk/build.xml:1422: The following error occurred while executing this line:
/home/jenkins/jenkins-slave/workspace/ZooKeeper-trunk/trunk/build.xml:432: com.cenqua.clover.CloverException: /home/jenkins/jenkins-slave/workspace/ZooKeeper-trunk/trunk/src/java/main/org/apache/zookeeper/KeeperException.java:318:24:unexpected token: Code
	at com.cenqua.clover.instr.Instrumenter.instrument(Instrumenter.java:155)
	at org.apache.tools.ant.taskdefs.CloverCompilerAdapter.setJavac(CloverCompilerAdapter.java:339)
	at org.apache.tools.ant.taskdefs.Javac.compile(Javac.java:1156)
	at org.apache.tools.ant.taskdefs.Javac.execute(Javac.java:935)
	at org.apache.tools.ant.UnknownElement.execute(UnknownElement.java:292)
	at sun.reflect.GeneratedMethodAccessor4.invoke(Unknown Source)
	at sun.reflect.DelegatingMethodAccessorImpl.invoke(DelegatingMethodAccessorImpl.java:43)
	at java.lang.reflect.Method.invoke(Method.java:601)
	at org.apache.tools.ant.dispatch.DispatchUtils.execute(DispatchUtils.java:106)
	at org.apache.tools.ant.Task.perform(Task.java:348)
	at org.apache.tools.ant.Target.execute(Target.java:435)
	at org.apache.tools.ant.Target.performTasks(Target.java:456)
	at org.apache.tools.ant.Project.executeSortedTargets(Project.java:1393)
	at org.apache.tools.ant.helper.SingleCheckExecutor.executeTargets(SingleCheckExecutor.java:38)
	at org.apache.tools.ant.Project.executeTargets(Project.java:1248)
	at org.apache.tools.ant.taskdefs.Ant.execute(Ant.java:441)
	at org.apache.tools.ant.taskdefs.CallTarget.execute(CallTarget.java:105)
	at org.apache.tools.ant.UnknownElement.execute(UnknownElement.java:292)
	at sun.reflect.GeneratedMethodAccessor4.invoke(Unknown Source)
	at sun.reflect.DelegatingMethodAccessorImpl.invoke(DelegatingMethodAccessorImpl.java:43)
	at java.lang.reflect.Method.invoke(Method.java:601)
	at org.apache.tools.ant.dispatch.DispatchUtils.execute(DispatchUtils.java:106)
	at org.apache.tools.ant.Task.perform(Task.java:348)
	at org.apache.tools.ant.Target.execute(Target.java:435)
	at org.apache.tools.ant.Target.performTasks(Target.java:456)
	at org.apache.tools.ant.Project.executeSortedTargets(Project.java:1393)
	at org.apache.tools.ant.Project.executeTarget(Project.java:1364)
	at org.apache.tools.ant.helper.DefaultExecutor.executeTargets(DefaultExecutor.java:41)
	at org.apache.tools.ant.Project.executeTargets(Project.java:1248)
	at org.apache.tools.ant.Main.runBuild(Main.java:851)
	at org.apache.tools.ant.Main.startAnt(Main.java:235)
	at org.apache.tools.ant.launch.Launcher.run(Launcher.java:280)
	at org.apache.tools.ant.launch.Launcher.main(Launcher.java:109)

Total time: 5 seconds
Build step 'Execute shell' marked build as failure
[FINDBUGS] Skipping publisher since build result is FAILURE
[WARNINGS] Skipping publisher since build result is FAILURE
Archiving artifacts
Sending artifact delta relative to ZooKeeper-trunk #2531
Archived 3 artifacts
Archive block size is 32768
Received 0 blocks and 18056097 bytes
Compression is 0.0%
Took 5.4 sec
Recording fingerprints
Recording test results
Publishing Javadoc
Email was triggered for: Failure
Sending email for trigger: Failure



###################################################################################
############################## FAILED TESTS (if any) ##############################
No tests ran.

ZooKeeper-trunk - Build # 2560 - Still Failing

Posted by Apache Jenkins Server <je...@builds.apache.org>.
See https://builds.apache.org/job/ZooKeeper-trunk/2560/

###################################################################################
########################## LAST 60 LINES OF THE CONSOLE ###########################
[...truncated 2963 lines...]
   [clover] Updating existing database at '/home/jenkins/jenkins-slave/workspace/ZooKeeper-trunk/trunk/build/test/clover/db/zookeeper_coverage.db'.
   [clover] Processing files at 1.3 source level.
   [clover] /home/jenkins/jenkins-slave/workspace/ZooKeeper-trunk/trunk/src/java/main/org/apache/zookeeper/KeeperException.java:318:24:unexpected token: Code
   [clover] /home/jenkins/jenkins-slave/workspace/ZooKeeper-trunk/trunk/src/java/main/org/apache/zookeeper/KeeperException.java:318:24:unexpected token: Code
   [clover] ** Error(s) occurred and the instrumentation process can't continue.

BUILD FAILED
/home/jenkins/jenkins-slave/workspace/ZooKeeper-trunk/trunk/build.xml:1422: The following error occurred while executing this line:
/home/jenkins/jenkins-slave/workspace/ZooKeeper-trunk/trunk/build.xml:432: com.cenqua.clover.CloverException: /home/jenkins/jenkins-slave/workspace/ZooKeeper-trunk/trunk/src/java/main/org/apache/zookeeper/KeeperException.java:318:24:unexpected token: Code
	at com.cenqua.clover.instr.Instrumenter.instrument(Instrumenter.java:155)
	at org.apache.tools.ant.taskdefs.CloverCompilerAdapter.setJavac(CloverCompilerAdapter.java:339)
	at org.apache.tools.ant.taskdefs.Javac.compile(Javac.java:1156)
	at org.apache.tools.ant.taskdefs.Javac.execute(Javac.java:935)
	at org.apache.tools.ant.UnknownElement.execute(UnknownElement.java:292)
	at sun.reflect.GeneratedMethodAccessor4.invoke(Unknown Source)
	at sun.reflect.DelegatingMethodAccessorImpl.invoke(DelegatingMethodAccessorImpl.java:43)
	at java.lang.reflect.Method.invoke(Method.java:601)
	at org.apache.tools.ant.dispatch.DispatchUtils.execute(DispatchUtils.java:106)
	at org.apache.tools.ant.Task.perform(Task.java:348)
	at org.apache.tools.ant.Target.execute(Target.java:435)
	at org.apache.tools.ant.Target.performTasks(Target.java:456)
	at org.apache.tools.ant.Project.executeSortedTargets(Project.java:1393)
	at org.apache.tools.ant.helper.SingleCheckExecutor.executeTargets(SingleCheckExecutor.java:38)
	at org.apache.tools.ant.Project.executeTargets(Project.java:1248)
	at org.apache.tools.ant.taskdefs.Ant.execute(Ant.java:441)
	at org.apache.tools.ant.taskdefs.CallTarget.execute(CallTarget.java:105)
	at org.apache.tools.ant.UnknownElement.execute(UnknownElement.java:292)
	at sun.reflect.GeneratedMethodAccessor4.invoke(Unknown Source)
	at sun.reflect.DelegatingMethodAccessorImpl.invoke(DelegatingMethodAccessorImpl.java:43)
	at java.lang.reflect.Method.invoke(Method.java:601)
	at org.apache.tools.ant.dispatch.DispatchUtils.execute(DispatchUtils.java:106)
	at org.apache.tools.ant.Task.perform(Task.java:348)
	at org.apache.tools.ant.Target.execute(Target.java:435)
	at org.apache.tools.ant.Target.performTasks(Target.java:456)
	at org.apache.tools.ant.Project.executeSortedTargets(Project.java:1393)
	at org.apache.tools.ant.Project.executeTarget(Project.java:1364)
	at org.apache.tools.ant.helper.DefaultExecutor.executeTargets(DefaultExecutor.java:41)
	at org.apache.tools.ant.Project.executeTargets(Project.java:1248)
	at org.apache.tools.ant.Main.runBuild(Main.java:851)
	at org.apache.tools.ant.Main.startAnt(Main.java:235)
	at org.apache.tools.ant.launch.Launcher.run(Launcher.java:280)
	at org.apache.tools.ant.launch.Launcher.main(Launcher.java:109)

Total time: 5 seconds
Build step 'Execute shell' marked build as failure
[FINDBUGS] Skipping publisher since build result is FAILURE
[WARNINGS] Skipping publisher since build result is FAILURE
Archiving artifacts
Sending artifact delta relative to ZooKeeper-trunk #2531
Archived 3 artifacts
Archive block size is 32768
Received 0 blocks and 18056966 bytes
Compression is 0.0%
Took 4.9 sec
Recording fingerprints
Recording test results
Publishing Javadoc
Email was triggered for: Failure
Sending email for trigger: Failure



###################################################################################
############################## FAILED TESTS (if any) ##############################
No tests ran.

ZooKeeper-trunk - Build # 2559 - Still Failing

Posted by Apache Jenkins Server <je...@builds.apache.org>.
See https://builds.apache.org/job/ZooKeeper-trunk/2559/

###################################################################################
########################## LAST 60 LINES OF THE CONSOLE ###########################
[...truncated 2963 lines...]
   [clover] Updating existing database at '/home/jenkins/jenkins-slave/workspace/ZooKeeper-trunk/trunk/build/test/clover/db/zookeeper_coverage.db'.
   [clover] Processing files at 1.3 source level.
   [clover] /home/jenkins/jenkins-slave/workspace/ZooKeeper-trunk/trunk/src/java/main/org/apache/zookeeper/KeeperException.java:318:24:unexpected token: Code
   [clover] /home/jenkins/jenkins-slave/workspace/ZooKeeper-trunk/trunk/src/java/main/org/apache/zookeeper/KeeperException.java:318:24:unexpected token: Code
   [clover] ** Error(s) occurred and the instrumentation process can't continue.

BUILD FAILED
/home/jenkins/jenkins-slave/workspace/ZooKeeper-trunk/trunk/build.xml:1422: The following error occurred while executing this line:
/home/jenkins/jenkins-slave/workspace/ZooKeeper-trunk/trunk/build.xml:432: com.cenqua.clover.CloverException: /home/jenkins/jenkins-slave/workspace/ZooKeeper-trunk/trunk/src/java/main/org/apache/zookeeper/KeeperException.java:318:24:unexpected token: Code
	at com.cenqua.clover.instr.Instrumenter.instrument(Instrumenter.java:155)
	at org.apache.tools.ant.taskdefs.CloverCompilerAdapter.setJavac(CloverCompilerAdapter.java:339)
	at org.apache.tools.ant.taskdefs.Javac.compile(Javac.java:1156)
	at org.apache.tools.ant.taskdefs.Javac.execute(Javac.java:935)
	at org.apache.tools.ant.UnknownElement.execute(UnknownElement.java:292)
	at sun.reflect.GeneratedMethodAccessor4.invoke(Unknown Source)
	at sun.reflect.DelegatingMethodAccessorImpl.invoke(DelegatingMethodAccessorImpl.java:43)
	at java.lang.reflect.Method.invoke(Method.java:601)
	at org.apache.tools.ant.dispatch.DispatchUtils.execute(DispatchUtils.java:106)
	at org.apache.tools.ant.Task.perform(Task.java:348)
	at org.apache.tools.ant.Target.execute(Target.java:435)
	at org.apache.tools.ant.Target.performTasks(Target.java:456)
	at org.apache.tools.ant.Project.executeSortedTargets(Project.java:1393)
	at org.apache.tools.ant.helper.SingleCheckExecutor.executeTargets(SingleCheckExecutor.java:38)
	at org.apache.tools.ant.Project.executeTargets(Project.java:1248)
	at org.apache.tools.ant.taskdefs.Ant.execute(Ant.java:441)
	at org.apache.tools.ant.taskdefs.CallTarget.execute(CallTarget.java:105)
	at org.apache.tools.ant.UnknownElement.execute(UnknownElement.java:292)
	at sun.reflect.GeneratedMethodAccessor4.invoke(Unknown Source)
	at sun.reflect.DelegatingMethodAccessorImpl.invoke(DelegatingMethodAccessorImpl.java:43)
	at java.lang.reflect.Method.invoke(Method.java:601)
	at org.apache.tools.ant.dispatch.DispatchUtils.execute(DispatchUtils.java:106)
	at org.apache.tools.ant.Task.perform(Task.java:348)
	at org.apache.tools.ant.Target.execute(Target.java:435)
	at org.apache.tools.ant.Target.performTasks(Target.java:456)
	at org.apache.tools.ant.Project.executeSortedTargets(Project.java:1393)
	at org.apache.tools.ant.Project.executeTarget(Project.java:1364)
	at org.apache.tools.ant.helper.DefaultExecutor.executeTargets(DefaultExecutor.java:41)
	at org.apache.tools.ant.Project.executeTargets(Project.java:1248)
	at org.apache.tools.ant.Main.runBuild(Main.java:851)
	at org.apache.tools.ant.Main.startAnt(Main.java:235)
	at org.apache.tools.ant.launch.Launcher.run(Launcher.java:280)
	at org.apache.tools.ant.launch.Launcher.main(Launcher.java:109)

Total time: 5 seconds
Build step 'Execute shell' marked build as failure
[FINDBUGS] Skipping publisher since build result is FAILURE
[WARNINGS] Skipping publisher since build result is FAILURE
Archiving artifacts
Sending artifact delta relative to ZooKeeper-trunk #2531
Archived 3 artifacts
Archive block size is 32768
Received 0 blocks and 18055854 bytes
Compression is 0.0%
Took 4.8 sec
Recording fingerprints
Recording test results
Publishing Javadoc
Email was triggered for: Failure
Sending email for trigger: Failure



###################################################################################
############################## FAILED TESTS (if any) ##############################
No tests ran.

ZooKeeper-trunk - Build # 2558 - Still Failing

Posted by Apache Jenkins Server <je...@builds.apache.org>.
See https://builds.apache.org/job/ZooKeeper-trunk/2558/

###################################################################################
########################## LAST 60 LINES OF THE CONSOLE ###########################
[...truncated 2963 lines...]
   [clover] Updating existing database at '/home/jenkins/jenkins-slave/workspace/ZooKeeper-trunk/trunk/build/test/clover/db/zookeeper_coverage.db'.
   [clover] Processing files at 1.3 source level.
   [clover] /home/jenkins/jenkins-slave/workspace/ZooKeeper-trunk/trunk/src/java/main/org/apache/zookeeper/KeeperException.java:318:24:unexpected token: Code
   [clover] /home/jenkins/jenkins-slave/workspace/ZooKeeper-trunk/trunk/src/java/main/org/apache/zookeeper/KeeperException.java:318:24:unexpected token: Code
   [clover] ** Error(s) occurred and the instrumentation process can't continue.

BUILD FAILED
/home/jenkins/jenkins-slave/workspace/ZooKeeper-trunk/trunk/build.xml:1422: The following error occurred while executing this line:
/home/jenkins/jenkins-slave/workspace/ZooKeeper-trunk/trunk/build.xml:432: com.cenqua.clover.CloverException: /home/jenkins/jenkins-slave/workspace/ZooKeeper-trunk/trunk/src/java/main/org/apache/zookeeper/KeeperException.java:318:24:unexpected token: Code
	at com.cenqua.clover.instr.Instrumenter.instrument(Instrumenter.java:155)
	at org.apache.tools.ant.taskdefs.CloverCompilerAdapter.setJavac(CloverCompilerAdapter.java:339)
	at org.apache.tools.ant.taskdefs.Javac.compile(Javac.java:1156)
	at org.apache.tools.ant.taskdefs.Javac.execute(Javac.java:935)
	at org.apache.tools.ant.UnknownElement.execute(UnknownElement.java:292)
	at sun.reflect.GeneratedMethodAccessor4.invoke(Unknown Source)
	at sun.reflect.DelegatingMethodAccessorImpl.invoke(DelegatingMethodAccessorImpl.java:43)
	at java.lang.reflect.Method.invoke(Method.java:601)
	at org.apache.tools.ant.dispatch.DispatchUtils.execute(DispatchUtils.java:106)
	at org.apache.tools.ant.Task.perform(Task.java:348)
	at org.apache.tools.ant.Target.execute(Target.java:435)
	at org.apache.tools.ant.Target.performTasks(Target.java:456)
	at org.apache.tools.ant.Project.executeSortedTargets(Project.java:1393)
	at org.apache.tools.ant.helper.SingleCheckExecutor.executeTargets(SingleCheckExecutor.java:38)
	at org.apache.tools.ant.Project.executeTargets(Project.java:1248)
	at org.apache.tools.ant.taskdefs.Ant.execute(Ant.java:441)
	at org.apache.tools.ant.taskdefs.CallTarget.execute(CallTarget.java:105)
	at org.apache.tools.ant.UnknownElement.execute(UnknownElement.java:292)
	at sun.reflect.GeneratedMethodAccessor4.invoke(Unknown Source)
	at sun.reflect.DelegatingMethodAccessorImpl.invoke(DelegatingMethodAccessorImpl.java:43)
	at java.lang.reflect.Method.invoke(Method.java:601)
	at org.apache.tools.ant.dispatch.DispatchUtils.execute(DispatchUtils.java:106)
	at org.apache.tools.ant.Task.perform(Task.java:348)
	at org.apache.tools.ant.Target.execute(Target.java:435)
	at org.apache.tools.ant.Target.performTasks(Target.java:456)
	at org.apache.tools.ant.Project.executeSortedTargets(Project.java:1393)
	at org.apache.tools.ant.Project.executeTarget(Project.java:1364)
	at org.apache.tools.ant.helper.DefaultExecutor.executeTargets(DefaultExecutor.java:41)
	at org.apache.tools.ant.Project.executeTargets(Project.java:1248)
	at org.apache.tools.ant.Main.runBuild(Main.java:851)
	at org.apache.tools.ant.Main.startAnt(Main.java:235)
	at org.apache.tools.ant.launch.Launcher.run(Launcher.java:280)
	at org.apache.tools.ant.launch.Launcher.main(Launcher.java:109)

Total time: 5 seconds
Build step 'Execute shell' marked build as failure
[FINDBUGS] Skipping publisher since build result is FAILURE
[WARNINGS] Skipping publisher since build result is FAILURE
Archiving artifacts
Sending artifact delta relative to ZooKeeper-trunk #2531
Archived 3 artifacts
Archive block size is 32768
Received 0 blocks and 18056008 bytes
Compression is 0.0%
Took 4.8 sec
Recording fingerprints
Recording test results
Publishing Javadoc
Email was triggered for: Failure
Sending email for trigger: Failure



###################################################################################
############################## FAILED TESTS (if any) ##############################
No tests ran.

ZooKeeper-trunk - Build # 2557 - Still Failing

Posted by Apache Jenkins Server <je...@builds.apache.org>.
See https://builds.apache.org/job/ZooKeeper-trunk/2557/

###################################################################################
########################## LAST 60 LINES OF THE CONSOLE ###########################
[...truncated 2963 lines...]
   [clover] Updating existing database at '/home/jenkins/jenkins-slave/workspace/ZooKeeper-trunk/trunk/build/test/clover/db/zookeeper_coverage.db'.
   [clover] Processing files at 1.3 source level.
   [clover] /home/jenkins/jenkins-slave/workspace/ZooKeeper-trunk/trunk/src/java/main/org/apache/zookeeper/KeeperException.java:318:24:unexpected token: Code
   [clover] /home/jenkins/jenkins-slave/workspace/ZooKeeper-trunk/trunk/src/java/main/org/apache/zookeeper/KeeperException.java:318:24:unexpected token: Code
   [clover] ** Error(s) occurred and the instrumentation process can't continue.

BUILD FAILED
/home/jenkins/jenkins-slave/workspace/ZooKeeper-trunk/trunk/build.xml:1422: The following error occurred while executing this line:
/home/jenkins/jenkins-slave/workspace/ZooKeeper-trunk/trunk/build.xml:432: com.cenqua.clover.CloverException: /home/jenkins/jenkins-slave/workspace/ZooKeeper-trunk/trunk/src/java/main/org/apache/zookeeper/KeeperException.java:318:24:unexpected token: Code
	at com.cenqua.clover.instr.Instrumenter.instrument(Instrumenter.java:155)
	at org.apache.tools.ant.taskdefs.CloverCompilerAdapter.setJavac(CloverCompilerAdapter.java:339)
	at org.apache.tools.ant.taskdefs.Javac.compile(Javac.java:1156)
	at org.apache.tools.ant.taskdefs.Javac.execute(Javac.java:935)
	at org.apache.tools.ant.UnknownElement.execute(UnknownElement.java:292)
	at sun.reflect.GeneratedMethodAccessor4.invoke(Unknown Source)
	at sun.reflect.DelegatingMethodAccessorImpl.invoke(DelegatingMethodAccessorImpl.java:43)
	at java.lang.reflect.Method.invoke(Method.java:601)
	at org.apache.tools.ant.dispatch.DispatchUtils.execute(DispatchUtils.java:106)
	at org.apache.tools.ant.Task.perform(Task.java:348)
	at org.apache.tools.ant.Target.execute(Target.java:435)
	at org.apache.tools.ant.Target.performTasks(Target.java:456)
	at org.apache.tools.ant.Project.executeSortedTargets(Project.java:1393)
	at org.apache.tools.ant.helper.SingleCheckExecutor.executeTargets(SingleCheckExecutor.java:38)
	at org.apache.tools.ant.Project.executeTargets(Project.java:1248)
	at org.apache.tools.ant.taskdefs.Ant.execute(Ant.java:441)
	at org.apache.tools.ant.taskdefs.CallTarget.execute(CallTarget.java:105)
	at org.apache.tools.ant.UnknownElement.execute(UnknownElement.java:292)
	at sun.reflect.GeneratedMethodAccessor4.invoke(Unknown Source)
	at sun.reflect.DelegatingMethodAccessorImpl.invoke(DelegatingMethodAccessorImpl.java:43)
	at java.lang.reflect.Method.invoke(Method.java:601)
	at org.apache.tools.ant.dispatch.DispatchUtils.execute(DispatchUtils.java:106)
	at org.apache.tools.ant.Task.perform(Task.java:348)
	at org.apache.tools.ant.Target.execute(Target.java:435)
	at org.apache.tools.ant.Target.performTasks(Target.java:456)
	at org.apache.tools.ant.Project.executeSortedTargets(Project.java:1393)
	at org.apache.tools.ant.Project.executeTarget(Project.java:1364)
	at org.apache.tools.ant.helper.DefaultExecutor.executeTargets(DefaultExecutor.java:41)
	at org.apache.tools.ant.Project.executeTargets(Project.java:1248)
	at org.apache.tools.ant.Main.runBuild(Main.java:851)
	at org.apache.tools.ant.Main.startAnt(Main.java:235)
	at org.apache.tools.ant.launch.Launcher.run(Launcher.java:280)
	at org.apache.tools.ant.launch.Launcher.main(Launcher.java:109)

Total time: 5 seconds
Build step 'Execute shell' marked build as failure
[FINDBUGS] Skipping publisher since build result is FAILURE
[WARNINGS] Skipping publisher since build result is FAILURE
Archiving artifacts
Sending artifact delta relative to ZooKeeper-trunk #2531
Archived 3 artifacts
Archive block size is 32768
Received 0 blocks and 18056682 bytes
Compression is 0.0%
Took 4.7 sec
Recording fingerprints
Recording test results
Publishing Javadoc
Email was triggered for: Failure
Sending email for trigger: Failure



###################################################################################
############################## FAILED TESTS (if any) ##############################
No tests ran.

ZooKeeper-trunk - Build # 2556 - Still Failing

Posted by Apache Jenkins Server <je...@builds.apache.org>.
See https://builds.apache.org/job/ZooKeeper-trunk/2556/

###################################################################################
########################## LAST 60 LINES OF THE CONSOLE ###########################
[...truncated 2963 lines...]
   [clover] Updating existing database at '/home/jenkins/jenkins-slave/workspace/ZooKeeper-trunk/trunk/build/test/clover/db/zookeeper_coverage.db'.
   [clover] Processing files at 1.3 source level.
   [clover] /home/jenkins/jenkins-slave/workspace/ZooKeeper-trunk/trunk/src/java/main/org/apache/zookeeper/KeeperException.java:318:24:unexpected token: Code
   [clover] /home/jenkins/jenkins-slave/workspace/ZooKeeper-trunk/trunk/src/java/main/org/apache/zookeeper/KeeperException.java:318:24:unexpected token: Code
   [clover] ** Error(s) occurred and the instrumentation process can't continue.

BUILD FAILED
/home/jenkins/jenkins-slave/workspace/ZooKeeper-trunk/trunk/build.xml:1422: The following error occurred while executing this line:
/home/jenkins/jenkins-slave/workspace/ZooKeeper-trunk/trunk/build.xml:432: com.cenqua.clover.CloverException: /home/jenkins/jenkins-slave/workspace/ZooKeeper-trunk/trunk/src/java/main/org/apache/zookeeper/KeeperException.java:318:24:unexpected token: Code
	at com.cenqua.clover.instr.Instrumenter.instrument(Instrumenter.java:155)
	at org.apache.tools.ant.taskdefs.CloverCompilerAdapter.setJavac(CloverCompilerAdapter.java:339)
	at org.apache.tools.ant.taskdefs.Javac.compile(Javac.java:1156)
	at org.apache.tools.ant.taskdefs.Javac.execute(Javac.java:935)
	at org.apache.tools.ant.UnknownElement.execute(UnknownElement.java:292)
	at sun.reflect.GeneratedMethodAccessor4.invoke(Unknown Source)
	at sun.reflect.DelegatingMethodAccessorImpl.invoke(DelegatingMethodAccessorImpl.java:43)
	at java.lang.reflect.Method.invoke(Method.java:601)
	at org.apache.tools.ant.dispatch.DispatchUtils.execute(DispatchUtils.java:106)
	at org.apache.tools.ant.Task.perform(Task.java:348)
	at org.apache.tools.ant.Target.execute(Target.java:435)
	at org.apache.tools.ant.Target.performTasks(Target.java:456)
	at org.apache.tools.ant.Project.executeSortedTargets(Project.java:1393)
	at org.apache.tools.ant.helper.SingleCheckExecutor.executeTargets(SingleCheckExecutor.java:38)
	at org.apache.tools.ant.Project.executeTargets(Project.java:1248)
	at org.apache.tools.ant.taskdefs.Ant.execute(Ant.java:441)
	at org.apache.tools.ant.taskdefs.CallTarget.execute(CallTarget.java:105)
	at org.apache.tools.ant.UnknownElement.execute(UnknownElement.java:292)
	at sun.reflect.GeneratedMethodAccessor4.invoke(Unknown Source)
	at sun.reflect.DelegatingMethodAccessorImpl.invoke(DelegatingMethodAccessorImpl.java:43)
	at java.lang.reflect.Method.invoke(Method.java:601)
	at org.apache.tools.ant.dispatch.DispatchUtils.execute(DispatchUtils.java:106)
	at org.apache.tools.ant.Task.perform(Task.java:348)
	at org.apache.tools.ant.Target.execute(Target.java:435)
	at org.apache.tools.ant.Target.performTasks(Target.java:456)
	at org.apache.tools.ant.Project.executeSortedTargets(Project.java:1393)
	at org.apache.tools.ant.Project.executeTarget(Project.java:1364)
	at org.apache.tools.ant.helper.DefaultExecutor.executeTargets(DefaultExecutor.java:41)
	at org.apache.tools.ant.Project.executeTargets(Project.java:1248)
	at org.apache.tools.ant.Main.runBuild(Main.java:851)
	at org.apache.tools.ant.Main.startAnt(Main.java:235)
	at org.apache.tools.ant.launch.Launcher.run(Launcher.java:280)
	at org.apache.tools.ant.launch.Launcher.main(Launcher.java:109)

Total time: 5 seconds
Build step 'Execute shell' marked build as failure
[FINDBUGS] Skipping publisher since build result is FAILURE
[WARNINGS] Skipping publisher since build result is FAILURE
Archiving artifacts
Sending artifact delta relative to ZooKeeper-trunk #2531
Archived 3 artifacts
Archive block size is 32768
Received 0 blocks and 18056116 bytes
Compression is 0.0%
Took 4.8 sec
Recording fingerprints
Recording test results
Publishing Javadoc
Email was triggered for: Failure
Sending email for trigger: Failure



###################################################################################
############################## FAILED TESTS (if any) ##############################
No tests ran.

ZooKeeper-trunk - Build # 2555 - Still Failing

Posted by Apache Jenkins Server <je...@builds.apache.org>.
See https://builds.apache.org/job/ZooKeeper-trunk/2555/

###################################################################################
########################## LAST 60 LINES OF THE CONSOLE ###########################
[...truncated 2963 lines...]
   [clover] Updating existing database at '/home/jenkins/jenkins-slave/workspace/ZooKeeper-trunk/trunk/build/test/clover/db/zookeeper_coverage.db'.
   [clover] Processing files at 1.3 source level.
   [clover] /home/jenkins/jenkins-slave/workspace/ZooKeeper-trunk/trunk/src/java/main/org/apache/zookeeper/KeeperException.java:318:24:unexpected token: Code
   [clover] /home/jenkins/jenkins-slave/workspace/ZooKeeper-trunk/trunk/src/java/main/org/apache/zookeeper/KeeperException.java:318:24:unexpected token: Code
   [clover] ** Error(s) occurred and the instrumentation process can't continue.

BUILD FAILED
/home/jenkins/jenkins-slave/workspace/ZooKeeper-trunk/trunk/build.xml:1422: The following error occurred while executing this line:
/home/jenkins/jenkins-slave/workspace/ZooKeeper-trunk/trunk/build.xml:432: com.cenqua.clover.CloverException: /home/jenkins/jenkins-slave/workspace/ZooKeeper-trunk/trunk/src/java/main/org/apache/zookeeper/KeeperException.java:318:24:unexpected token: Code
	at com.cenqua.clover.instr.Instrumenter.instrument(Instrumenter.java:155)
	at org.apache.tools.ant.taskdefs.CloverCompilerAdapter.setJavac(CloverCompilerAdapter.java:339)
	at org.apache.tools.ant.taskdefs.Javac.compile(Javac.java:1156)
	at org.apache.tools.ant.taskdefs.Javac.execute(Javac.java:935)
	at org.apache.tools.ant.UnknownElement.execute(UnknownElement.java:292)
	at sun.reflect.GeneratedMethodAccessor4.invoke(Unknown Source)
	at sun.reflect.DelegatingMethodAccessorImpl.invoke(DelegatingMethodAccessorImpl.java:43)
	at java.lang.reflect.Method.invoke(Method.java:601)
	at org.apache.tools.ant.dispatch.DispatchUtils.execute(DispatchUtils.java:106)
	at org.apache.tools.ant.Task.perform(Task.java:348)
	at org.apache.tools.ant.Target.execute(Target.java:435)
	at org.apache.tools.ant.Target.performTasks(Target.java:456)
	at org.apache.tools.ant.Project.executeSortedTargets(Project.java:1393)
	at org.apache.tools.ant.helper.SingleCheckExecutor.executeTargets(SingleCheckExecutor.java:38)
	at org.apache.tools.ant.Project.executeTargets(Project.java:1248)
	at org.apache.tools.ant.taskdefs.Ant.execute(Ant.java:441)
	at org.apache.tools.ant.taskdefs.CallTarget.execute(CallTarget.java:105)
	at org.apache.tools.ant.UnknownElement.execute(UnknownElement.java:292)
	at sun.reflect.GeneratedMethodAccessor4.invoke(Unknown Source)
	at sun.reflect.DelegatingMethodAccessorImpl.invoke(DelegatingMethodAccessorImpl.java:43)
	at java.lang.reflect.Method.invoke(Method.java:601)
	at org.apache.tools.ant.dispatch.DispatchUtils.execute(DispatchUtils.java:106)
	at org.apache.tools.ant.Task.perform(Task.java:348)
	at org.apache.tools.ant.Target.execute(Target.java:435)
	at org.apache.tools.ant.Target.performTasks(Target.java:456)
	at org.apache.tools.ant.Project.executeSortedTargets(Project.java:1393)
	at org.apache.tools.ant.Project.executeTarget(Project.java:1364)
	at org.apache.tools.ant.helper.DefaultExecutor.executeTargets(DefaultExecutor.java:41)
	at org.apache.tools.ant.Project.executeTargets(Project.java:1248)
	at org.apache.tools.ant.Main.runBuild(Main.java:851)
	at org.apache.tools.ant.Main.startAnt(Main.java:235)
	at org.apache.tools.ant.launch.Launcher.run(Launcher.java:280)
	at org.apache.tools.ant.launch.Launcher.main(Launcher.java:109)

Total time: 5 seconds
Build step 'Execute shell' marked build as failure
[FINDBUGS] Skipping publisher since build result is FAILURE
[WARNINGS] Skipping publisher since build result is FAILURE
Archiving artifacts
Sending artifact delta relative to ZooKeeper-trunk #2531
Archived 3 artifacts
Archive block size is 32768
Received 0 blocks and 18055534 bytes
Compression is 0.0%
Took 4.8 sec
Recording fingerprints
Recording test results
Publishing Javadoc
Email was triggered for: Failure
Sending email for trigger: Failure



###################################################################################
############################## FAILED TESTS (if any) ##############################
No tests ran.

ZooKeeper-trunk - Build # 2554 - Still Failing

Posted by Apache Jenkins Server <je...@builds.apache.org>.
See https://builds.apache.org/job/ZooKeeper-trunk/2554/

###################################################################################
########################## LAST 60 LINES OF THE CONSOLE ###########################
[...truncated 2963 lines...]
   [clover] Updating existing database at '/home/jenkins/jenkins-slave/workspace/ZooKeeper-trunk/trunk/build/test/clover/db/zookeeper_coverage.db'.
   [clover] Processing files at 1.3 source level.
   [clover] /home/jenkins/jenkins-slave/workspace/ZooKeeper-trunk/trunk/src/java/main/org/apache/zookeeper/KeeperException.java:318:24:unexpected token: Code
   [clover] /home/jenkins/jenkins-slave/workspace/ZooKeeper-trunk/trunk/src/java/main/org/apache/zookeeper/KeeperException.java:318:24:unexpected token: Code
   [clover] ** Error(s) occurred and the instrumentation process can't continue.

BUILD FAILED
/home/jenkins/jenkins-slave/workspace/ZooKeeper-trunk/trunk/build.xml:1422: The following error occurred while executing this line:
/home/jenkins/jenkins-slave/workspace/ZooKeeper-trunk/trunk/build.xml:432: com.cenqua.clover.CloverException: /home/jenkins/jenkins-slave/workspace/ZooKeeper-trunk/trunk/src/java/main/org/apache/zookeeper/KeeperException.java:318:24:unexpected token: Code
	at com.cenqua.clover.instr.Instrumenter.instrument(Instrumenter.java:155)
	at org.apache.tools.ant.taskdefs.CloverCompilerAdapter.setJavac(CloverCompilerAdapter.java:339)
	at org.apache.tools.ant.taskdefs.Javac.compile(Javac.java:1156)
	at org.apache.tools.ant.taskdefs.Javac.execute(Javac.java:935)
	at org.apache.tools.ant.UnknownElement.execute(UnknownElement.java:292)
	at sun.reflect.GeneratedMethodAccessor4.invoke(Unknown Source)
	at sun.reflect.DelegatingMethodAccessorImpl.invoke(DelegatingMethodAccessorImpl.java:43)
	at java.lang.reflect.Method.invoke(Method.java:601)
	at org.apache.tools.ant.dispatch.DispatchUtils.execute(DispatchUtils.java:106)
	at org.apache.tools.ant.Task.perform(Task.java:348)
	at org.apache.tools.ant.Target.execute(Target.java:435)
	at org.apache.tools.ant.Target.performTasks(Target.java:456)
	at org.apache.tools.ant.Project.executeSortedTargets(Project.java:1393)
	at org.apache.tools.ant.helper.SingleCheckExecutor.executeTargets(SingleCheckExecutor.java:38)
	at org.apache.tools.ant.Project.executeTargets(Project.java:1248)
	at org.apache.tools.ant.taskdefs.Ant.execute(Ant.java:441)
	at org.apache.tools.ant.taskdefs.CallTarget.execute(CallTarget.java:105)
	at org.apache.tools.ant.UnknownElement.execute(UnknownElement.java:292)
	at sun.reflect.GeneratedMethodAccessor4.invoke(Unknown Source)
	at sun.reflect.DelegatingMethodAccessorImpl.invoke(DelegatingMethodAccessorImpl.java:43)
	at java.lang.reflect.Method.invoke(Method.java:601)
	at org.apache.tools.ant.dispatch.DispatchUtils.execute(DispatchUtils.java:106)
	at org.apache.tools.ant.Task.perform(Task.java:348)
	at org.apache.tools.ant.Target.execute(Target.java:435)
	at org.apache.tools.ant.Target.performTasks(Target.java:456)
	at org.apache.tools.ant.Project.executeSortedTargets(Project.java:1393)
	at org.apache.tools.ant.Project.executeTarget(Project.java:1364)
	at org.apache.tools.ant.helper.DefaultExecutor.executeTargets(DefaultExecutor.java:41)
	at org.apache.tools.ant.Project.executeTargets(Project.java:1248)
	at org.apache.tools.ant.Main.runBuild(Main.java:851)
	at org.apache.tools.ant.Main.startAnt(Main.java:235)
	at org.apache.tools.ant.launch.Launcher.run(Launcher.java:280)
	at org.apache.tools.ant.launch.Launcher.main(Launcher.java:109)

Total time: 5 seconds
Build step 'Execute shell' marked build as failure
[FINDBUGS] Skipping publisher since build result is FAILURE
[WARNINGS] Skipping publisher since build result is FAILURE
Archiving artifacts
Sending artifact delta relative to ZooKeeper-trunk #2531
Archived 3 artifacts
Archive block size is 32768
Received 0 blocks and 18055878 bytes
Compression is 0.0%
Took 4.6 sec
Recording fingerprints
Recording test results
Publishing Javadoc
Email was triggered for: Failure
Sending email for trigger: Failure



###################################################################################
############################## FAILED TESTS (if any) ##############################
No tests ran.

ZooKeeper-trunk - Build # 2553 - Still Failing

Posted by Apache Jenkins Server <je...@builds.apache.org>.
See https://builds.apache.org/job/ZooKeeper-trunk/2553/

###################################################################################
########################## LAST 60 LINES OF THE CONSOLE ###########################
[...truncated 2963 lines...]
   [clover] Updating existing database at '/home/jenkins/jenkins-slave/workspace/ZooKeeper-trunk/trunk/build/test/clover/db/zookeeper_coverage.db'.
   [clover] Processing files at 1.3 source level.
   [clover] /home/jenkins/jenkins-slave/workspace/ZooKeeper-trunk/trunk/src/java/main/org/apache/zookeeper/KeeperException.java:318:24:unexpected token: Code
   [clover] /home/jenkins/jenkins-slave/workspace/ZooKeeper-trunk/trunk/src/java/main/org/apache/zookeeper/KeeperException.java:318:24:unexpected token: Code
   [clover] ** Error(s) occurred and the instrumentation process can't continue.

BUILD FAILED
/home/jenkins/jenkins-slave/workspace/ZooKeeper-trunk/trunk/build.xml:1422: The following error occurred while executing this line:
/home/jenkins/jenkins-slave/workspace/ZooKeeper-trunk/trunk/build.xml:432: com.cenqua.clover.CloverException: /home/jenkins/jenkins-slave/workspace/ZooKeeper-trunk/trunk/src/java/main/org/apache/zookeeper/KeeperException.java:318:24:unexpected token: Code
	at com.cenqua.clover.instr.Instrumenter.instrument(Instrumenter.java:155)
	at org.apache.tools.ant.taskdefs.CloverCompilerAdapter.setJavac(CloverCompilerAdapter.java:339)
	at org.apache.tools.ant.taskdefs.Javac.compile(Javac.java:1156)
	at org.apache.tools.ant.taskdefs.Javac.execute(Javac.java:935)
	at org.apache.tools.ant.UnknownElement.execute(UnknownElement.java:292)
	at sun.reflect.GeneratedMethodAccessor4.invoke(Unknown Source)
	at sun.reflect.DelegatingMethodAccessorImpl.invoke(DelegatingMethodAccessorImpl.java:43)
	at java.lang.reflect.Method.invoke(Method.java:601)
	at org.apache.tools.ant.dispatch.DispatchUtils.execute(DispatchUtils.java:106)
	at org.apache.tools.ant.Task.perform(Task.java:348)
	at org.apache.tools.ant.Target.execute(Target.java:435)
	at org.apache.tools.ant.Target.performTasks(Target.java:456)
	at org.apache.tools.ant.Project.executeSortedTargets(Project.java:1393)
	at org.apache.tools.ant.helper.SingleCheckExecutor.executeTargets(SingleCheckExecutor.java:38)
	at org.apache.tools.ant.Project.executeTargets(Project.java:1248)
	at org.apache.tools.ant.taskdefs.Ant.execute(Ant.java:441)
	at org.apache.tools.ant.taskdefs.CallTarget.execute(CallTarget.java:105)
	at org.apache.tools.ant.UnknownElement.execute(UnknownElement.java:292)
	at sun.reflect.GeneratedMethodAccessor4.invoke(Unknown Source)
	at sun.reflect.DelegatingMethodAccessorImpl.invoke(DelegatingMethodAccessorImpl.java:43)
	at java.lang.reflect.Method.invoke(Method.java:601)
	at org.apache.tools.ant.dispatch.DispatchUtils.execute(DispatchUtils.java:106)
	at org.apache.tools.ant.Task.perform(Task.java:348)
	at org.apache.tools.ant.Target.execute(Target.java:435)
	at org.apache.tools.ant.Target.performTasks(Target.java:456)
	at org.apache.tools.ant.Project.executeSortedTargets(Project.java:1393)
	at org.apache.tools.ant.Project.executeTarget(Project.java:1364)
	at org.apache.tools.ant.helper.DefaultExecutor.executeTargets(DefaultExecutor.java:41)
	at org.apache.tools.ant.Project.executeTargets(Project.java:1248)
	at org.apache.tools.ant.Main.runBuild(Main.java:851)
	at org.apache.tools.ant.Main.startAnt(Main.java:235)
	at org.apache.tools.ant.launch.Launcher.run(Launcher.java:280)
	at org.apache.tools.ant.launch.Launcher.main(Launcher.java:109)

Total time: 5 seconds
Build step 'Execute shell' marked build as failure
[FINDBUGS] Skipping publisher since build result is FAILURE
[WARNINGS] Skipping publisher since build result is FAILURE
Archiving artifacts
Sending artifact delta relative to ZooKeeper-trunk #2531
Archived 3 artifacts
Archive block size is 32768
Received 0 blocks and 18057132 bytes
Compression is 0.0%
Took 4.8 sec
Recording fingerprints
Recording test results
Publishing Javadoc
Email was triggered for: Failure
Sending email for trigger: Failure



###################################################################################
############################## FAILED TESTS (if any) ##############################
No tests ran.

ZooKeeper-trunk - Build # 2552 - Still Failing

Posted by Apache Jenkins Server <je...@builds.apache.org>.
See https://builds.apache.org/job/ZooKeeper-trunk/2552/

###################################################################################
########################## LAST 60 LINES OF THE CONSOLE ###########################
[...truncated 2963 lines...]
   [clover] Updating existing database at '/home/jenkins/jenkins-slave/workspace/ZooKeeper-trunk/trunk/build/test/clover/db/zookeeper_coverage.db'.
   [clover] Processing files at 1.3 source level.
   [clover] /home/jenkins/jenkins-slave/workspace/ZooKeeper-trunk/trunk/src/java/main/org/apache/zookeeper/KeeperException.java:318:24:unexpected token: Code
   [clover] /home/jenkins/jenkins-slave/workspace/ZooKeeper-trunk/trunk/src/java/main/org/apache/zookeeper/KeeperException.java:318:24:unexpected token: Code
   [clover] ** Error(s) occurred and the instrumentation process can't continue.

BUILD FAILED
/home/jenkins/jenkins-slave/workspace/ZooKeeper-trunk/trunk/build.xml:1422: The following error occurred while executing this line:
/home/jenkins/jenkins-slave/workspace/ZooKeeper-trunk/trunk/build.xml:432: com.cenqua.clover.CloverException: /home/jenkins/jenkins-slave/workspace/ZooKeeper-trunk/trunk/src/java/main/org/apache/zookeeper/KeeperException.java:318:24:unexpected token: Code
	at com.cenqua.clover.instr.Instrumenter.instrument(Instrumenter.java:155)
	at org.apache.tools.ant.taskdefs.CloverCompilerAdapter.setJavac(CloverCompilerAdapter.java:339)
	at org.apache.tools.ant.taskdefs.Javac.compile(Javac.java:1156)
	at org.apache.tools.ant.taskdefs.Javac.execute(Javac.java:935)
	at org.apache.tools.ant.UnknownElement.execute(UnknownElement.java:292)
	at sun.reflect.GeneratedMethodAccessor4.invoke(Unknown Source)
	at sun.reflect.DelegatingMethodAccessorImpl.invoke(DelegatingMethodAccessorImpl.java:43)
	at java.lang.reflect.Method.invoke(Method.java:601)
	at org.apache.tools.ant.dispatch.DispatchUtils.execute(DispatchUtils.java:106)
	at org.apache.tools.ant.Task.perform(Task.java:348)
	at org.apache.tools.ant.Target.execute(Target.java:435)
	at org.apache.tools.ant.Target.performTasks(Target.java:456)
	at org.apache.tools.ant.Project.executeSortedTargets(Project.java:1393)
	at org.apache.tools.ant.helper.SingleCheckExecutor.executeTargets(SingleCheckExecutor.java:38)
	at org.apache.tools.ant.Project.executeTargets(Project.java:1248)
	at org.apache.tools.ant.taskdefs.Ant.execute(Ant.java:441)
	at org.apache.tools.ant.taskdefs.CallTarget.execute(CallTarget.java:105)
	at org.apache.tools.ant.UnknownElement.execute(UnknownElement.java:292)
	at sun.reflect.GeneratedMethodAccessor4.invoke(Unknown Source)
	at sun.reflect.DelegatingMethodAccessorImpl.invoke(DelegatingMethodAccessorImpl.java:43)
	at java.lang.reflect.Method.invoke(Method.java:601)
	at org.apache.tools.ant.dispatch.DispatchUtils.execute(DispatchUtils.java:106)
	at org.apache.tools.ant.Task.perform(Task.java:348)
	at org.apache.tools.ant.Target.execute(Target.java:435)
	at org.apache.tools.ant.Target.performTasks(Target.java:456)
	at org.apache.tools.ant.Project.executeSortedTargets(Project.java:1393)
	at org.apache.tools.ant.Project.executeTarget(Project.java:1364)
	at org.apache.tools.ant.helper.DefaultExecutor.executeTargets(DefaultExecutor.java:41)
	at org.apache.tools.ant.Project.executeTargets(Project.java:1248)
	at org.apache.tools.ant.Main.runBuild(Main.java:851)
	at org.apache.tools.ant.Main.startAnt(Main.java:235)
	at org.apache.tools.ant.launch.Launcher.run(Launcher.java:280)
	at org.apache.tools.ant.launch.Launcher.main(Launcher.java:109)

Total time: 5 seconds
Build step 'Execute shell' marked build as failure
[FINDBUGS] Skipping publisher since build result is FAILURE
[WARNINGS] Skipping publisher since build result is FAILURE
Archiving artifacts
Sending artifact delta relative to ZooKeeper-trunk #2531
Archived 3 artifacts
Archive block size is 32768
Received 0 blocks and 18058042 bytes
Compression is 0.0%
Took 4.8 sec
Recording fingerprints
Recording test results
Publishing Javadoc
Email was triggered for: Failure
Sending email for trigger: Failure



###################################################################################
############################## FAILED TESTS (if any) ##############################
No tests ran.

ZooKeeper-trunk - Build # 2551 - Still Failing

Posted by Apache Jenkins Server <je...@builds.apache.org>.
See https://builds.apache.org/job/ZooKeeper-trunk/2551/

###################################################################################
########################## LAST 60 LINES OF THE CONSOLE ###########################
[...truncated 2963 lines...]
   [clover] Updating existing database at '/home/jenkins/jenkins-slave/workspace/ZooKeeper-trunk/trunk/build/test/clover/db/zookeeper_coverage.db'.
   [clover] Processing files at 1.3 source level.
   [clover] /home/jenkins/jenkins-slave/workspace/ZooKeeper-trunk/trunk/src/java/main/org/apache/zookeeper/KeeperException.java:318:24:unexpected token: Code
   [clover] /home/jenkins/jenkins-slave/workspace/ZooKeeper-trunk/trunk/src/java/main/org/apache/zookeeper/KeeperException.java:318:24:unexpected token: Code
   [clover] ** Error(s) occurred and the instrumentation process can't continue.

BUILD FAILED
/home/jenkins/jenkins-slave/workspace/ZooKeeper-trunk/trunk/build.xml:1422: The following error occurred while executing this line:
/home/jenkins/jenkins-slave/workspace/ZooKeeper-trunk/trunk/build.xml:432: com.cenqua.clover.CloverException: /home/jenkins/jenkins-slave/workspace/ZooKeeper-trunk/trunk/src/java/main/org/apache/zookeeper/KeeperException.java:318:24:unexpected token: Code
	at com.cenqua.clover.instr.Instrumenter.instrument(Instrumenter.java:155)
	at org.apache.tools.ant.taskdefs.CloverCompilerAdapter.setJavac(CloverCompilerAdapter.java:339)
	at org.apache.tools.ant.taskdefs.Javac.compile(Javac.java:1156)
	at org.apache.tools.ant.taskdefs.Javac.execute(Javac.java:935)
	at org.apache.tools.ant.UnknownElement.execute(UnknownElement.java:292)
	at sun.reflect.GeneratedMethodAccessor4.invoke(Unknown Source)
	at sun.reflect.DelegatingMethodAccessorImpl.invoke(DelegatingMethodAccessorImpl.java:43)
	at java.lang.reflect.Method.invoke(Method.java:601)
	at org.apache.tools.ant.dispatch.DispatchUtils.execute(DispatchUtils.java:106)
	at org.apache.tools.ant.Task.perform(Task.java:348)
	at org.apache.tools.ant.Target.execute(Target.java:435)
	at org.apache.tools.ant.Target.performTasks(Target.java:456)
	at org.apache.tools.ant.Project.executeSortedTargets(Project.java:1393)
	at org.apache.tools.ant.helper.SingleCheckExecutor.executeTargets(SingleCheckExecutor.java:38)
	at org.apache.tools.ant.Project.executeTargets(Project.java:1248)
	at org.apache.tools.ant.taskdefs.Ant.execute(Ant.java:441)
	at org.apache.tools.ant.taskdefs.CallTarget.execute(CallTarget.java:105)
	at org.apache.tools.ant.UnknownElement.execute(UnknownElement.java:292)
	at sun.reflect.GeneratedMethodAccessor4.invoke(Unknown Source)
	at sun.reflect.DelegatingMethodAccessorImpl.invoke(DelegatingMethodAccessorImpl.java:43)
	at java.lang.reflect.Method.invoke(Method.java:601)
	at org.apache.tools.ant.dispatch.DispatchUtils.execute(DispatchUtils.java:106)
	at org.apache.tools.ant.Task.perform(Task.java:348)
	at org.apache.tools.ant.Target.execute(Target.java:435)
	at org.apache.tools.ant.Target.performTasks(Target.java:456)
	at org.apache.tools.ant.Project.executeSortedTargets(Project.java:1393)
	at org.apache.tools.ant.Project.executeTarget(Project.java:1364)
	at org.apache.tools.ant.helper.DefaultExecutor.executeTargets(DefaultExecutor.java:41)
	at org.apache.tools.ant.Project.executeTargets(Project.java:1248)
	at org.apache.tools.ant.Main.runBuild(Main.java:851)
	at org.apache.tools.ant.Main.startAnt(Main.java:235)
	at org.apache.tools.ant.launch.Launcher.run(Launcher.java:280)
	at org.apache.tools.ant.launch.Launcher.main(Launcher.java:109)

Total time: 5 seconds
Build step 'Execute shell' marked build as failure
[FINDBUGS] Skipping publisher since build result is FAILURE
[WARNINGS] Skipping publisher since build result is FAILURE
Archiving artifacts
Sending artifact delta relative to ZooKeeper-trunk #2531
Archived 3 artifacts
Archive block size is 32768
Received 0 blocks and 18057508 bytes
Compression is 0.0%
Took 5.1 sec
Recording fingerprints
Recording test results
Publishing Javadoc
Email was triggered for: Failure
Sending email for trigger: Failure



###################################################################################
############################## FAILED TESTS (if any) ##############################
No tests ran.

ZooKeeper-trunk - Build # 2550 - Still Failing

Posted by Apache Jenkins Server <je...@builds.apache.org>.
See https://builds.apache.org/job/ZooKeeper-trunk/2550/

###################################################################################
########################## LAST 60 LINES OF THE CONSOLE ###########################
[...truncated 2963 lines...]
   [clover] Updating existing database at '/home/jenkins/jenkins-slave/workspace/ZooKeeper-trunk/trunk/build/test/clover/db/zookeeper_coverage.db'.
   [clover] Processing files at 1.3 source level.
   [clover] /home/jenkins/jenkins-slave/workspace/ZooKeeper-trunk/trunk/src/java/main/org/apache/zookeeper/KeeperException.java:318:24:unexpected token: Code
   [clover] /home/jenkins/jenkins-slave/workspace/ZooKeeper-trunk/trunk/src/java/main/org/apache/zookeeper/KeeperException.java:318:24:unexpected token: Code
   [clover] ** Error(s) occurred and the instrumentation process can't continue.

BUILD FAILED
/home/jenkins/jenkins-slave/workspace/ZooKeeper-trunk/trunk/build.xml:1422: The following error occurred while executing this line:
/home/jenkins/jenkins-slave/workspace/ZooKeeper-trunk/trunk/build.xml:432: com.cenqua.clover.CloverException: /home/jenkins/jenkins-slave/workspace/ZooKeeper-trunk/trunk/src/java/main/org/apache/zookeeper/KeeperException.java:318:24:unexpected token: Code
	at com.cenqua.clover.instr.Instrumenter.instrument(Instrumenter.java:155)
	at org.apache.tools.ant.taskdefs.CloverCompilerAdapter.setJavac(CloverCompilerAdapter.java:339)
	at org.apache.tools.ant.taskdefs.Javac.compile(Javac.java:1156)
	at org.apache.tools.ant.taskdefs.Javac.execute(Javac.java:935)
	at org.apache.tools.ant.UnknownElement.execute(UnknownElement.java:292)
	at sun.reflect.GeneratedMethodAccessor4.invoke(Unknown Source)
	at sun.reflect.DelegatingMethodAccessorImpl.invoke(DelegatingMethodAccessorImpl.java:43)
	at java.lang.reflect.Method.invoke(Method.java:601)
	at org.apache.tools.ant.dispatch.DispatchUtils.execute(DispatchUtils.java:106)
	at org.apache.tools.ant.Task.perform(Task.java:348)
	at org.apache.tools.ant.Target.execute(Target.java:435)
	at org.apache.tools.ant.Target.performTasks(Target.java:456)
	at org.apache.tools.ant.Project.executeSortedTargets(Project.java:1393)
	at org.apache.tools.ant.helper.SingleCheckExecutor.executeTargets(SingleCheckExecutor.java:38)
	at org.apache.tools.ant.Project.executeTargets(Project.java:1248)
	at org.apache.tools.ant.taskdefs.Ant.execute(Ant.java:441)
	at org.apache.tools.ant.taskdefs.CallTarget.execute(CallTarget.java:105)
	at org.apache.tools.ant.UnknownElement.execute(UnknownElement.java:292)
	at sun.reflect.GeneratedMethodAccessor4.invoke(Unknown Source)
	at sun.reflect.DelegatingMethodAccessorImpl.invoke(DelegatingMethodAccessorImpl.java:43)
	at java.lang.reflect.Method.invoke(Method.java:601)
	at org.apache.tools.ant.dispatch.DispatchUtils.execute(DispatchUtils.java:106)
	at org.apache.tools.ant.Task.perform(Task.java:348)
	at org.apache.tools.ant.Target.execute(Target.java:435)
	at org.apache.tools.ant.Target.performTasks(Target.java:456)
	at org.apache.tools.ant.Project.executeSortedTargets(Project.java:1393)
	at org.apache.tools.ant.Project.executeTarget(Project.java:1364)
	at org.apache.tools.ant.helper.DefaultExecutor.executeTargets(DefaultExecutor.java:41)
	at org.apache.tools.ant.Project.executeTargets(Project.java:1248)
	at org.apache.tools.ant.Main.runBuild(Main.java:851)
	at org.apache.tools.ant.Main.startAnt(Main.java:235)
	at org.apache.tools.ant.launch.Launcher.run(Launcher.java:280)
	at org.apache.tools.ant.launch.Launcher.main(Launcher.java:109)

Total time: 5 seconds
Build step 'Execute shell' marked build as failure
[FINDBUGS] Skipping publisher since build result is FAILURE
[WARNINGS] Skipping publisher since build result is FAILURE
Archiving artifacts
Sending artifact delta relative to ZooKeeper-trunk #2531
Archived 3 artifacts
Archive block size is 32768
Received 0 blocks and 18056986 bytes
Compression is 0.0%
Took 4.7 sec
Recording fingerprints
Recording test results
Publishing Javadoc
Email was triggered for: Failure
Sending email for trigger: Failure



###################################################################################
############################## FAILED TESTS (if any) ##############################
No tests ran.

ZooKeeper-trunk - Build # 2549 - Still Failing

Posted by Apache Jenkins Server <je...@builds.apache.org>.
See https://builds.apache.org/job/ZooKeeper-trunk/2549/

###################################################################################
########################## LAST 60 LINES OF THE CONSOLE ###########################
[...truncated 2963 lines...]
   [clover] Updating existing database at '/home/jenkins/jenkins-slave/workspace/ZooKeeper-trunk/trunk/build/test/clover/db/zookeeper_coverage.db'.
   [clover] Processing files at 1.3 source level.
   [clover] /home/jenkins/jenkins-slave/workspace/ZooKeeper-trunk/trunk/src/java/main/org/apache/zookeeper/KeeperException.java:318:24:unexpected token: Code
   [clover] /home/jenkins/jenkins-slave/workspace/ZooKeeper-trunk/trunk/src/java/main/org/apache/zookeeper/KeeperException.java:318:24:unexpected token: Code
   [clover] ** Error(s) occurred and the instrumentation process can't continue.

BUILD FAILED
/home/jenkins/jenkins-slave/workspace/ZooKeeper-trunk/trunk/build.xml:1422: The following error occurred while executing this line:
/home/jenkins/jenkins-slave/workspace/ZooKeeper-trunk/trunk/build.xml:432: com.cenqua.clover.CloverException: /home/jenkins/jenkins-slave/workspace/ZooKeeper-trunk/trunk/src/java/main/org/apache/zookeeper/KeeperException.java:318:24:unexpected token: Code
	at com.cenqua.clover.instr.Instrumenter.instrument(Instrumenter.java:155)
	at org.apache.tools.ant.taskdefs.CloverCompilerAdapter.setJavac(CloverCompilerAdapter.java:339)
	at org.apache.tools.ant.taskdefs.Javac.compile(Javac.java:1156)
	at org.apache.tools.ant.taskdefs.Javac.execute(Javac.java:935)
	at org.apache.tools.ant.UnknownElement.execute(UnknownElement.java:292)
	at sun.reflect.GeneratedMethodAccessor4.invoke(Unknown Source)
	at sun.reflect.DelegatingMethodAccessorImpl.invoke(DelegatingMethodAccessorImpl.java:43)
	at java.lang.reflect.Method.invoke(Method.java:601)
	at org.apache.tools.ant.dispatch.DispatchUtils.execute(DispatchUtils.java:106)
	at org.apache.tools.ant.Task.perform(Task.java:348)
	at org.apache.tools.ant.Target.execute(Target.java:435)
	at org.apache.tools.ant.Target.performTasks(Target.java:456)
	at org.apache.tools.ant.Project.executeSortedTargets(Project.java:1393)
	at org.apache.tools.ant.helper.SingleCheckExecutor.executeTargets(SingleCheckExecutor.java:38)
	at org.apache.tools.ant.Project.executeTargets(Project.java:1248)
	at org.apache.tools.ant.taskdefs.Ant.execute(Ant.java:441)
	at org.apache.tools.ant.taskdefs.CallTarget.execute(CallTarget.java:105)
	at org.apache.tools.ant.UnknownElement.execute(UnknownElement.java:292)
	at sun.reflect.GeneratedMethodAccessor4.invoke(Unknown Source)
	at sun.reflect.DelegatingMethodAccessorImpl.invoke(DelegatingMethodAccessorImpl.java:43)
	at java.lang.reflect.Method.invoke(Method.java:601)
	at org.apache.tools.ant.dispatch.DispatchUtils.execute(DispatchUtils.java:106)
	at org.apache.tools.ant.Task.perform(Task.java:348)
	at org.apache.tools.ant.Target.execute(Target.java:435)
	at org.apache.tools.ant.Target.performTasks(Target.java:456)
	at org.apache.tools.ant.Project.executeSortedTargets(Project.java:1393)
	at org.apache.tools.ant.Project.executeTarget(Project.java:1364)
	at org.apache.tools.ant.helper.DefaultExecutor.executeTargets(DefaultExecutor.java:41)
	at org.apache.tools.ant.Project.executeTargets(Project.java:1248)
	at org.apache.tools.ant.Main.runBuild(Main.java:851)
	at org.apache.tools.ant.Main.startAnt(Main.java:235)
	at org.apache.tools.ant.launch.Launcher.run(Launcher.java:280)
	at org.apache.tools.ant.launch.Launcher.main(Launcher.java:109)

Total time: 5 seconds
Build step 'Execute shell' marked build as failure
[FINDBUGS] Skipping publisher since build result is FAILURE
[WARNINGS] Skipping publisher since build result is FAILURE
Archiving artifacts
Sending artifact delta relative to ZooKeeper-trunk #2531
Archived 3 artifacts
Archive block size is 32768
Received 0 blocks and 18056375 bytes
Compression is 0.0%
Took 5.2 sec
Recording fingerprints
Recording test results
Publishing Javadoc
Email was triggered for: Failure
Sending email for trigger: Failure



###################################################################################
############################## FAILED TESTS (if any) ##############################
No tests ran.

ZooKeeper-trunk - Build # 2548 - Still Failing

Posted by Apache Jenkins Server <je...@builds.apache.org>.
See https://builds.apache.org/job/ZooKeeper-trunk/2548/

###################################################################################
########################## LAST 60 LINES OF THE CONSOLE ###########################
[...truncated 2963 lines...]
   [clover] Updating existing database at '/home/jenkins/jenkins-slave/workspace/ZooKeeper-trunk/trunk/build/test/clover/db/zookeeper_coverage.db'.
   [clover] Processing files at 1.3 source level.
   [clover] /home/jenkins/jenkins-slave/workspace/ZooKeeper-trunk/trunk/src/java/main/org/apache/zookeeper/KeeperException.java:318:24:unexpected token: Code
   [clover] /home/jenkins/jenkins-slave/workspace/ZooKeeper-trunk/trunk/src/java/main/org/apache/zookeeper/KeeperException.java:318:24:unexpected token: Code
   [clover] ** Error(s) occurred and the instrumentation process can't continue.

BUILD FAILED
/home/jenkins/jenkins-slave/workspace/ZooKeeper-trunk/trunk/build.xml:1422: The following error occurred while executing this line:
/home/jenkins/jenkins-slave/workspace/ZooKeeper-trunk/trunk/build.xml:432: com.cenqua.clover.CloverException: /home/jenkins/jenkins-slave/workspace/ZooKeeper-trunk/trunk/src/java/main/org/apache/zookeeper/KeeperException.java:318:24:unexpected token: Code
	at com.cenqua.clover.instr.Instrumenter.instrument(Instrumenter.java:155)
	at org.apache.tools.ant.taskdefs.CloverCompilerAdapter.setJavac(CloverCompilerAdapter.java:339)
	at org.apache.tools.ant.taskdefs.Javac.compile(Javac.java:1156)
	at org.apache.tools.ant.taskdefs.Javac.execute(Javac.java:935)
	at org.apache.tools.ant.UnknownElement.execute(UnknownElement.java:292)
	at sun.reflect.GeneratedMethodAccessor4.invoke(Unknown Source)
	at sun.reflect.DelegatingMethodAccessorImpl.invoke(DelegatingMethodAccessorImpl.java:43)
	at java.lang.reflect.Method.invoke(Method.java:601)
	at org.apache.tools.ant.dispatch.DispatchUtils.execute(DispatchUtils.java:106)
	at org.apache.tools.ant.Task.perform(Task.java:348)
	at org.apache.tools.ant.Target.execute(Target.java:435)
	at org.apache.tools.ant.Target.performTasks(Target.java:456)
	at org.apache.tools.ant.Project.executeSortedTargets(Project.java:1393)
	at org.apache.tools.ant.helper.SingleCheckExecutor.executeTargets(SingleCheckExecutor.java:38)
	at org.apache.tools.ant.Project.executeTargets(Project.java:1248)
	at org.apache.tools.ant.taskdefs.Ant.execute(Ant.java:441)
	at org.apache.tools.ant.taskdefs.CallTarget.execute(CallTarget.java:105)
	at org.apache.tools.ant.UnknownElement.execute(UnknownElement.java:292)
	at sun.reflect.GeneratedMethodAccessor4.invoke(Unknown Source)
	at sun.reflect.DelegatingMethodAccessorImpl.invoke(DelegatingMethodAccessorImpl.java:43)
	at java.lang.reflect.Method.invoke(Method.java:601)
	at org.apache.tools.ant.dispatch.DispatchUtils.execute(DispatchUtils.java:106)
	at org.apache.tools.ant.Task.perform(Task.java:348)
	at org.apache.tools.ant.Target.execute(Target.java:435)
	at org.apache.tools.ant.Target.performTasks(Target.java:456)
	at org.apache.tools.ant.Project.executeSortedTargets(Project.java:1393)
	at org.apache.tools.ant.Project.executeTarget(Project.java:1364)
	at org.apache.tools.ant.helper.DefaultExecutor.executeTargets(DefaultExecutor.java:41)
	at org.apache.tools.ant.Project.executeTargets(Project.java:1248)
	at org.apache.tools.ant.Main.runBuild(Main.java:851)
	at org.apache.tools.ant.Main.startAnt(Main.java:235)
	at org.apache.tools.ant.launch.Launcher.run(Launcher.java:280)
	at org.apache.tools.ant.launch.Launcher.main(Launcher.java:109)

Total time: 5 seconds
Build step 'Execute shell' marked build as failure
[FINDBUGS] Skipping publisher since build result is FAILURE
[WARNINGS] Skipping publisher since build result is FAILURE
Archiving artifacts
Sending artifact delta relative to ZooKeeper-trunk #2531
Archived 3 artifacts
Archive block size is 32768
Received 0 blocks and 18053392 bytes
Compression is 0.0%
Took 4.9 sec
Recording fingerprints
Recording test results
Publishing Javadoc
Email was triggered for: Failure
Sending email for trigger: Failure



###################################################################################
############################## FAILED TESTS (if any) ##############################
No tests ran.

ZooKeeper-trunk - Build # 2547 - Still Failing

Posted by Apache Jenkins Server <je...@builds.apache.org>.
See https://builds.apache.org/job/ZooKeeper-trunk/2547/

###################################################################################
########################## LAST 60 LINES OF THE CONSOLE ###########################
[...truncated 2963 lines...]
   [clover] Updating existing database at '/home/jenkins/jenkins-slave/workspace/ZooKeeper-trunk/trunk/build/test/clover/db/zookeeper_coverage.db'.
   [clover] Processing files at 1.3 source level.
   [clover] /home/jenkins/jenkins-slave/workspace/ZooKeeper-trunk/trunk/src/java/main/org/apache/zookeeper/KeeperException.java:318:24:unexpected token: Code
   [clover] /home/jenkins/jenkins-slave/workspace/ZooKeeper-trunk/trunk/src/java/main/org/apache/zookeeper/KeeperException.java:318:24:unexpected token: Code
   [clover] ** Error(s) occurred and the instrumentation process can't continue.

BUILD FAILED
/home/jenkins/jenkins-slave/workspace/ZooKeeper-trunk/trunk/build.xml:1422: The following error occurred while executing this line:
/home/jenkins/jenkins-slave/workspace/ZooKeeper-trunk/trunk/build.xml:432: com.cenqua.clover.CloverException: /home/jenkins/jenkins-slave/workspace/ZooKeeper-trunk/trunk/src/java/main/org/apache/zookeeper/KeeperException.java:318:24:unexpected token: Code
	at com.cenqua.clover.instr.Instrumenter.instrument(Instrumenter.java:155)
	at org.apache.tools.ant.taskdefs.CloverCompilerAdapter.setJavac(CloverCompilerAdapter.java:339)
	at org.apache.tools.ant.taskdefs.Javac.compile(Javac.java:1156)
	at org.apache.tools.ant.taskdefs.Javac.execute(Javac.java:935)
	at org.apache.tools.ant.UnknownElement.execute(UnknownElement.java:292)
	at sun.reflect.GeneratedMethodAccessor4.invoke(Unknown Source)
	at sun.reflect.DelegatingMethodAccessorImpl.invoke(DelegatingMethodAccessorImpl.java:43)
	at java.lang.reflect.Method.invoke(Method.java:601)
	at org.apache.tools.ant.dispatch.DispatchUtils.execute(DispatchUtils.java:106)
	at org.apache.tools.ant.Task.perform(Task.java:348)
	at org.apache.tools.ant.Target.execute(Target.java:435)
	at org.apache.tools.ant.Target.performTasks(Target.java:456)
	at org.apache.tools.ant.Project.executeSortedTargets(Project.java:1393)
	at org.apache.tools.ant.helper.SingleCheckExecutor.executeTargets(SingleCheckExecutor.java:38)
	at org.apache.tools.ant.Project.executeTargets(Project.java:1248)
	at org.apache.tools.ant.taskdefs.Ant.execute(Ant.java:441)
	at org.apache.tools.ant.taskdefs.CallTarget.execute(CallTarget.java:105)
	at org.apache.tools.ant.UnknownElement.execute(UnknownElement.java:292)
	at sun.reflect.GeneratedMethodAccessor4.invoke(Unknown Source)
	at sun.reflect.DelegatingMethodAccessorImpl.invoke(DelegatingMethodAccessorImpl.java:43)
	at java.lang.reflect.Method.invoke(Method.java:601)
	at org.apache.tools.ant.dispatch.DispatchUtils.execute(DispatchUtils.java:106)
	at org.apache.tools.ant.Task.perform(Task.java:348)
	at org.apache.tools.ant.Target.execute(Target.java:435)
	at org.apache.tools.ant.Target.performTasks(Target.java:456)
	at org.apache.tools.ant.Project.executeSortedTargets(Project.java:1393)
	at org.apache.tools.ant.Project.executeTarget(Project.java:1364)
	at org.apache.tools.ant.helper.DefaultExecutor.executeTargets(DefaultExecutor.java:41)
	at org.apache.tools.ant.Project.executeTargets(Project.java:1248)
	at org.apache.tools.ant.Main.runBuild(Main.java:851)
	at org.apache.tools.ant.Main.startAnt(Main.java:235)
	at org.apache.tools.ant.launch.Launcher.run(Launcher.java:280)
	at org.apache.tools.ant.launch.Launcher.main(Launcher.java:109)

Total time: 5 seconds
Build step 'Execute shell' marked build as failure
[FINDBUGS] Skipping publisher since build result is FAILURE
[WARNINGS] Skipping publisher since build result is FAILURE
Archiving artifacts
Sending artifact delta relative to ZooKeeper-trunk #2531
Archived 3 artifacts
Archive block size is 32768
Received 0 blocks and 18058075 bytes
Compression is 0.0%
Took 4.9 sec
Recording fingerprints
Recording test results
Publishing Javadoc
Email was triggered for: Failure
Sending email for trigger: Failure



###################################################################################
############################## FAILED TESTS (if any) ##############################
No tests ran.

ZooKeeper-trunk - Build # 2546 - Still Failing

Posted by Apache Jenkins Server <je...@builds.apache.org>.
See https://builds.apache.org/job/ZooKeeper-trunk/2546/

###################################################################################
########################## LAST 60 LINES OF THE CONSOLE ###########################
[...truncated 2963 lines...]
   [clover] Updating existing database at '/home/jenkins/jenkins-slave/workspace/ZooKeeper-trunk/trunk/build/test/clover/db/zookeeper_coverage.db'.
   [clover] Processing files at 1.3 source level.
   [clover] /home/jenkins/jenkins-slave/workspace/ZooKeeper-trunk/trunk/src/java/main/org/apache/zookeeper/KeeperException.java:318:24:unexpected token: Code
   [clover] /home/jenkins/jenkins-slave/workspace/ZooKeeper-trunk/trunk/src/java/main/org/apache/zookeeper/KeeperException.java:318:24:unexpected token: Code
   [clover] ** Error(s) occurred and the instrumentation process can't continue.

BUILD FAILED
/home/jenkins/jenkins-slave/workspace/ZooKeeper-trunk/trunk/build.xml:1422: The following error occurred while executing this line:
/home/jenkins/jenkins-slave/workspace/ZooKeeper-trunk/trunk/build.xml:432: com.cenqua.clover.CloverException: /home/jenkins/jenkins-slave/workspace/ZooKeeper-trunk/trunk/src/java/main/org/apache/zookeeper/KeeperException.java:318:24:unexpected token: Code
	at com.cenqua.clover.instr.Instrumenter.instrument(Instrumenter.java:155)
	at org.apache.tools.ant.taskdefs.CloverCompilerAdapter.setJavac(CloverCompilerAdapter.java:339)
	at org.apache.tools.ant.taskdefs.Javac.compile(Javac.java:1156)
	at org.apache.tools.ant.taskdefs.Javac.execute(Javac.java:935)
	at org.apache.tools.ant.UnknownElement.execute(UnknownElement.java:292)
	at sun.reflect.GeneratedMethodAccessor4.invoke(Unknown Source)
	at sun.reflect.DelegatingMethodAccessorImpl.invoke(DelegatingMethodAccessorImpl.java:43)
	at java.lang.reflect.Method.invoke(Method.java:601)
	at org.apache.tools.ant.dispatch.DispatchUtils.execute(DispatchUtils.java:106)
	at org.apache.tools.ant.Task.perform(Task.java:348)
	at org.apache.tools.ant.Target.execute(Target.java:435)
	at org.apache.tools.ant.Target.performTasks(Target.java:456)
	at org.apache.tools.ant.Project.executeSortedTargets(Project.java:1393)
	at org.apache.tools.ant.helper.SingleCheckExecutor.executeTargets(SingleCheckExecutor.java:38)
	at org.apache.tools.ant.Project.executeTargets(Project.java:1248)
	at org.apache.tools.ant.taskdefs.Ant.execute(Ant.java:441)
	at org.apache.tools.ant.taskdefs.CallTarget.execute(CallTarget.java:105)
	at org.apache.tools.ant.UnknownElement.execute(UnknownElement.java:292)
	at sun.reflect.GeneratedMethodAccessor4.invoke(Unknown Source)
	at sun.reflect.DelegatingMethodAccessorImpl.invoke(DelegatingMethodAccessorImpl.java:43)
	at java.lang.reflect.Method.invoke(Method.java:601)
	at org.apache.tools.ant.dispatch.DispatchUtils.execute(DispatchUtils.java:106)
	at org.apache.tools.ant.Task.perform(Task.java:348)
	at org.apache.tools.ant.Target.execute(Target.java:435)
	at org.apache.tools.ant.Target.performTasks(Target.java:456)
	at org.apache.tools.ant.Project.executeSortedTargets(Project.java:1393)
	at org.apache.tools.ant.Project.executeTarget(Project.java:1364)
	at org.apache.tools.ant.helper.DefaultExecutor.executeTargets(DefaultExecutor.java:41)
	at org.apache.tools.ant.Project.executeTargets(Project.java:1248)
	at org.apache.tools.ant.Main.runBuild(Main.java:851)
	at org.apache.tools.ant.Main.startAnt(Main.java:235)
	at org.apache.tools.ant.launch.Launcher.run(Launcher.java:280)
	at org.apache.tools.ant.launch.Launcher.main(Launcher.java:109)

Total time: 5 seconds
Build step 'Execute shell' marked build as failure
[FINDBUGS] Skipping publisher since build result is FAILURE
[WARNINGS] Skipping publisher since build result is FAILURE
Archiving artifacts
Sending artifact delta relative to ZooKeeper-trunk #2531
Archived 3 artifacts
Archive block size is 32768
Received 0 blocks and 18058823 bytes
Compression is 0.0%
Took 4.7 sec
Recording fingerprints
Recording test results
Publishing Javadoc
Email was triggered for: Failure
Sending email for trigger: Failure



###################################################################################
############################## FAILED TESTS (if any) ##############################
No tests ran.

ZooKeeper-trunk - Build # 2545 - Still Failing

Posted by Apache Jenkins Server <je...@builds.apache.org>.
See https://builds.apache.org/job/ZooKeeper-trunk/2545/

###################################################################################
########################## LAST 60 LINES OF THE CONSOLE ###########################
[...truncated 2963 lines...]
   [clover] Updating existing database at '/home/jenkins/jenkins-slave/workspace/ZooKeeper-trunk/trunk/build/test/clover/db/zookeeper_coverage.db'.
   [clover] Processing files at 1.3 source level.
   [clover] /home/jenkins/jenkins-slave/workspace/ZooKeeper-trunk/trunk/src/java/main/org/apache/zookeeper/KeeperException.java:318:24:unexpected token: Code
   [clover] /home/jenkins/jenkins-slave/workspace/ZooKeeper-trunk/trunk/src/java/main/org/apache/zookeeper/KeeperException.java:318:24:unexpected token: Code
   [clover] ** Error(s) occurred and the instrumentation process can't continue.

BUILD FAILED
/home/jenkins/jenkins-slave/workspace/ZooKeeper-trunk/trunk/build.xml:1422: The following error occurred while executing this line:
/home/jenkins/jenkins-slave/workspace/ZooKeeper-trunk/trunk/build.xml:432: com.cenqua.clover.CloverException: /home/jenkins/jenkins-slave/workspace/ZooKeeper-trunk/trunk/src/java/main/org/apache/zookeeper/KeeperException.java:318:24:unexpected token: Code
	at com.cenqua.clover.instr.Instrumenter.instrument(Instrumenter.java:155)
	at org.apache.tools.ant.taskdefs.CloverCompilerAdapter.setJavac(CloverCompilerAdapter.java:339)
	at org.apache.tools.ant.taskdefs.Javac.compile(Javac.java:1156)
	at org.apache.tools.ant.taskdefs.Javac.execute(Javac.java:935)
	at org.apache.tools.ant.UnknownElement.execute(UnknownElement.java:292)
	at sun.reflect.GeneratedMethodAccessor4.invoke(Unknown Source)
	at sun.reflect.DelegatingMethodAccessorImpl.invoke(DelegatingMethodAccessorImpl.java:43)
	at java.lang.reflect.Method.invoke(Method.java:601)
	at org.apache.tools.ant.dispatch.DispatchUtils.execute(DispatchUtils.java:106)
	at org.apache.tools.ant.Task.perform(Task.java:348)
	at org.apache.tools.ant.Target.execute(Target.java:435)
	at org.apache.tools.ant.Target.performTasks(Target.java:456)
	at org.apache.tools.ant.Project.executeSortedTargets(Project.java:1393)
	at org.apache.tools.ant.helper.SingleCheckExecutor.executeTargets(SingleCheckExecutor.java:38)
	at org.apache.tools.ant.Project.executeTargets(Project.java:1248)
	at org.apache.tools.ant.taskdefs.Ant.execute(Ant.java:441)
	at org.apache.tools.ant.taskdefs.CallTarget.execute(CallTarget.java:105)
	at org.apache.tools.ant.UnknownElement.execute(UnknownElement.java:292)
	at sun.reflect.GeneratedMethodAccessor4.invoke(Unknown Source)
	at sun.reflect.DelegatingMethodAccessorImpl.invoke(DelegatingMethodAccessorImpl.java:43)
	at java.lang.reflect.Method.invoke(Method.java:601)
	at org.apache.tools.ant.dispatch.DispatchUtils.execute(DispatchUtils.java:106)
	at org.apache.tools.ant.Task.perform(Task.java:348)
	at org.apache.tools.ant.Target.execute(Target.java:435)
	at org.apache.tools.ant.Target.performTasks(Target.java:456)
	at org.apache.tools.ant.Project.executeSortedTargets(Project.java:1393)
	at org.apache.tools.ant.Project.executeTarget(Project.java:1364)
	at org.apache.tools.ant.helper.DefaultExecutor.executeTargets(DefaultExecutor.java:41)
	at org.apache.tools.ant.Project.executeTargets(Project.java:1248)
	at org.apache.tools.ant.Main.runBuild(Main.java:851)
	at org.apache.tools.ant.Main.startAnt(Main.java:235)
	at org.apache.tools.ant.launch.Launcher.run(Launcher.java:280)
	at org.apache.tools.ant.launch.Launcher.main(Launcher.java:109)

Total time: 5 seconds
Build step 'Execute shell' marked build as failure
[FINDBUGS] Skipping publisher since build result is FAILURE
[WARNINGS] Skipping publisher since build result is FAILURE
Archiving artifacts
Sending artifact delta relative to ZooKeeper-trunk #2531
Archived 3 artifacts
Archive block size is 32768
Received 0 blocks and 18053501 bytes
Compression is 0.0%
Took 4.9 sec
Recording fingerprints
Recording test results
Publishing Javadoc
Email was triggered for: Failure
Sending email for trigger: Failure



###################################################################################
############################## FAILED TESTS (if any) ##############################
No tests ran.

ZooKeeper-trunk - Build # 2544 - Still Failing

Posted by Apache Jenkins Server <je...@builds.apache.org>.
See https://builds.apache.org/job/ZooKeeper-trunk/2544/

###################################################################################
########################## LAST 60 LINES OF THE CONSOLE ###########################
[...truncated 2963 lines...]
   [clover] Updating existing database at '/home/jenkins/jenkins-slave/workspace/ZooKeeper-trunk/trunk/build/test/clover/db/zookeeper_coverage.db'.
   [clover] Processing files at 1.3 source level.
   [clover] /home/jenkins/jenkins-slave/workspace/ZooKeeper-trunk/trunk/src/java/main/org/apache/zookeeper/KeeperException.java:318:24:unexpected token: Code
   [clover] /home/jenkins/jenkins-slave/workspace/ZooKeeper-trunk/trunk/src/java/main/org/apache/zookeeper/KeeperException.java:318:24:unexpected token: Code
   [clover] ** Error(s) occurred and the instrumentation process can't continue.

BUILD FAILED
/home/jenkins/jenkins-slave/workspace/ZooKeeper-trunk/trunk/build.xml:1422: The following error occurred while executing this line:
/home/jenkins/jenkins-slave/workspace/ZooKeeper-trunk/trunk/build.xml:432: com.cenqua.clover.CloverException: /home/jenkins/jenkins-slave/workspace/ZooKeeper-trunk/trunk/src/java/main/org/apache/zookeeper/KeeperException.java:318:24:unexpected token: Code
	at com.cenqua.clover.instr.Instrumenter.instrument(Instrumenter.java:155)
	at org.apache.tools.ant.taskdefs.CloverCompilerAdapter.setJavac(CloverCompilerAdapter.java:339)
	at org.apache.tools.ant.taskdefs.Javac.compile(Javac.java:1156)
	at org.apache.tools.ant.taskdefs.Javac.execute(Javac.java:935)
	at org.apache.tools.ant.UnknownElement.execute(UnknownElement.java:292)
	at sun.reflect.GeneratedMethodAccessor4.invoke(Unknown Source)
	at sun.reflect.DelegatingMethodAccessorImpl.invoke(DelegatingMethodAccessorImpl.java:43)
	at java.lang.reflect.Method.invoke(Method.java:601)
	at org.apache.tools.ant.dispatch.DispatchUtils.execute(DispatchUtils.java:106)
	at org.apache.tools.ant.Task.perform(Task.java:348)
	at org.apache.tools.ant.Target.execute(Target.java:435)
	at org.apache.tools.ant.Target.performTasks(Target.java:456)
	at org.apache.tools.ant.Project.executeSortedTargets(Project.java:1393)
	at org.apache.tools.ant.helper.SingleCheckExecutor.executeTargets(SingleCheckExecutor.java:38)
	at org.apache.tools.ant.Project.executeTargets(Project.java:1248)
	at org.apache.tools.ant.taskdefs.Ant.execute(Ant.java:441)
	at org.apache.tools.ant.taskdefs.CallTarget.execute(CallTarget.java:105)
	at org.apache.tools.ant.UnknownElement.execute(UnknownElement.java:292)
	at sun.reflect.GeneratedMethodAccessor4.invoke(Unknown Source)
	at sun.reflect.DelegatingMethodAccessorImpl.invoke(DelegatingMethodAccessorImpl.java:43)
	at java.lang.reflect.Method.invoke(Method.java:601)
	at org.apache.tools.ant.dispatch.DispatchUtils.execute(DispatchUtils.java:106)
	at org.apache.tools.ant.Task.perform(Task.java:348)
	at org.apache.tools.ant.Target.execute(Target.java:435)
	at org.apache.tools.ant.Target.performTasks(Target.java:456)
	at org.apache.tools.ant.Project.executeSortedTargets(Project.java:1393)
	at org.apache.tools.ant.Project.executeTarget(Project.java:1364)
	at org.apache.tools.ant.helper.DefaultExecutor.executeTargets(DefaultExecutor.java:41)
	at org.apache.tools.ant.Project.executeTargets(Project.java:1248)
	at org.apache.tools.ant.Main.runBuild(Main.java:851)
	at org.apache.tools.ant.Main.startAnt(Main.java:235)
	at org.apache.tools.ant.launch.Launcher.run(Launcher.java:280)
	at org.apache.tools.ant.launch.Launcher.main(Launcher.java:109)

Total time: 5 seconds
Build step 'Execute shell' marked build as failure
[FINDBUGS] Skipping publisher since build result is FAILURE
[WARNINGS] Skipping publisher since build result is FAILURE
Archiving artifacts
Sending artifact delta relative to ZooKeeper-trunk #2531
Archived 3 artifacts
Archive block size is 32768
Received 0 blocks and 18056161 bytes
Compression is 0.0%
Took 4.6 sec
Recording fingerprints
Recording test results
Publishing Javadoc
Email was triggered for: Failure
Sending email for trigger: Failure



###################################################################################
############################## FAILED TESTS (if any) ##############################
No tests ran.

ZooKeeper-trunk - Build # 2543 - Still Failing

Posted by Apache Jenkins Server <je...@builds.apache.org>.
See https://builds.apache.org/job/ZooKeeper-trunk/2543/

###################################################################################
########################## LAST 60 LINES OF THE CONSOLE ###########################
[...truncated 2963 lines...]
   [clover] Updating existing database at '/home/jenkins/jenkins-slave/workspace/ZooKeeper-trunk/trunk/build/test/clover/db/zookeeper_coverage.db'.
   [clover] Processing files at 1.3 source level.
   [clover] /home/jenkins/jenkins-slave/workspace/ZooKeeper-trunk/trunk/src/java/main/org/apache/zookeeper/KeeperException.java:318:24:unexpected token: Code
   [clover] /home/jenkins/jenkins-slave/workspace/ZooKeeper-trunk/trunk/src/java/main/org/apache/zookeeper/KeeperException.java:318:24:unexpected token: Code
   [clover] ** Error(s) occurred and the instrumentation process can't continue.

BUILD FAILED
/home/jenkins/jenkins-slave/workspace/ZooKeeper-trunk/trunk/build.xml:1422: The following error occurred while executing this line:
/home/jenkins/jenkins-slave/workspace/ZooKeeper-trunk/trunk/build.xml:432: com.cenqua.clover.CloverException: /home/jenkins/jenkins-slave/workspace/ZooKeeper-trunk/trunk/src/java/main/org/apache/zookeeper/KeeperException.java:318:24:unexpected token: Code
	at com.cenqua.clover.instr.Instrumenter.instrument(Instrumenter.java:155)
	at org.apache.tools.ant.taskdefs.CloverCompilerAdapter.setJavac(CloverCompilerAdapter.java:339)
	at org.apache.tools.ant.taskdefs.Javac.compile(Javac.java:1156)
	at org.apache.tools.ant.taskdefs.Javac.execute(Javac.java:935)
	at org.apache.tools.ant.UnknownElement.execute(UnknownElement.java:292)
	at sun.reflect.GeneratedMethodAccessor4.invoke(Unknown Source)
	at sun.reflect.DelegatingMethodAccessorImpl.invoke(DelegatingMethodAccessorImpl.java:43)
	at java.lang.reflect.Method.invoke(Method.java:601)
	at org.apache.tools.ant.dispatch.DispatchUtils.execute(DispatchUtils.java:106)
	at org.apache.tools.ant.Task.perform(Task.java:348)
	at org.apache.tools.ant.Target.execute(Target.java:435)
	at org.apache.tools.ant.Target.performTasks(Target.java:456)
	at org.apache.tools.ant.Project.executeSortedTargets(Project.java:1393)
	at org.apache.tools.ant.helper.SingleCheckExecutor.executeTargets(SingleCheckExecutor.java:38)
	at org.apache.tools.ant.Project.executeTargets(Project.java:1248)
	at org.apache.tools.ant.taskdefs.Ant.execute(Ant.java:441)
	at org.apache.tools.ant.taskdefs.CallTarget.execute(CallTarget.java:105)
	at org.apache.tools.ant.UnknownElement.execute(UnknownElement.java:292)
	at sun.reflect.GeneratedMethodAccessor4.invoke(Unknown Source)
	at sun.reflect.DelegatingMethodAccessorImpl.invoke(DelegatingMethodAccessorImpl.java:43)
	at java.lang.reflect.Method.invoke(Method.java:601)
	at org.apache.tools.ant.dispatch.DispatchUtils.execute(DispatchUtils.java:106)
	at org.apache.tools.ant.Task.perform(Task.java:348)
	at org.apache.tools.ant.Target.execute(Target.java:435)
	at org.apache.tools.ant.Target.performTasks(Target.java:456)
	at org.apache.tools.ant.Project.executeSortedTargets(Project.java:1393)
	at org.apache.tools.ant.Project.executeTarget(Project.java:1364)
	at org.apache.tools.ant.helper.DefaultExecutor.executeTargets(DefaultExecutor.java:41)
	at org.apache.tools.ant.Project.executeTargets(Project.java:1248)
	at org.apache.tools.ant.Main.runBuild(Main.java:851)
	at org.apache.tools.ant.Main.startAnt(Main.java:235)
	at org.apache.tools.ant.launch.Launcher.run(Launcher.java:280)
	at org.apache.tools.ant.launch.Launcher.main(Launcher.java:109)

Total time: 5 seconds
Build step 'Execute shell' marked build as failure
[FINDBUGS] Skipping publisher since build result is FAILURE
[WARNINGS] Skipping publisher since build result is FAILURE
Archiving artifacts
Sending artifact delta relative to ZooKeeper-trunk #2531
Archived 3 artifacts
Archive block size is 32768
Received 0 blocks and 18056462 bytes
Compression is 0.0%
Took 4.7 sec
Recording fingerprints
Recording test results
Publishing Javadoc
Email was triggered for: Failure
Sending email for trigger: Failure



###################################################################################
############################## FAILED TESTS (if any) ##############################
No tests ran.

ZooKeeper-trunk - Build # 2542 - Still Failing

Posted by Apache Jenkins Server <je...@builds.apache.org>.
See https://builds.apache.org/job/ZooKeeper-trunk/2542/

###################################################################################
########################## LAST 60 LINES OF THE CONSOLE ###########################
[...truncated 2963 lines...]
   [clover] Updating existing database at '/home/jenkins/jenkins-slave/workspace/ZooKeeper-trunk/trunk/build/test/clover/db/zookeeper_coverage.db'.
   [clover] Processing files at 1.3 source level.
   [clover] /home/jenkins/jenkins-slave/workspace/ZooKeeper-trunk/trunk/src/java/main/org/apache/zookeeper/KeeperException.java:318:24:unexpected token: Code
   [clover] /home/jenkins/jenkins-slave/workspace/ZooKeeper-trunk/trunk/src/java/main/org/apache/zookeeper/KeeperException.java:318:24:unexpected token: Code
   [clover] ** Error(s) occurred and the instrumentation process can't continue.

BUILD FAILED
/home/jenkins/jenkins-slave/workspace/ZooKeeper-trunk/trunk/build.xml:1422: The following error occurred while executing this line:
/home/jenkins/jenkins-slave/workspace/ZooKeeper-trunk/trunk/build.xml:432: com.cenqua.clover.CloverException: /home/jenkins/jenkins-slave/workspace/ZooKeeper-trunk/trunk/src/java/main/org/apache/zookeeper/KeeperException.java:318:24:unexpected token: Code
	at com.cenqua.clover.instr.Instrumenter.instrument(Instrumenter.java:155)
	at org.apache.tools.ant.taskdefs.CloverCompilerAdapter.setJavac(CloverCompilerAdapter.java:339)
	at org.apache.tools.ant.taskdefs.Javac.compile(Javac.java:1156)
	at org.apache.tools.ant.taskdefs.Javac.execute(Javac.java:935)
	at org.apache.tools.ant.UnknownElement.execute(UnknownElement.java:292)
	at sun.reflect.GeneratedMethodAccessor4.invoke(Unknown Source)
	at sun.reflect.DelegatingMethodAccessorImpl.invoke(DelegatingMethodAccessorImpl.java:43)
	at java.lang.reflect.Method.invoke(Method.java:601)
	at org.apache.tools.ant.dispatch.DispatchUtils.execute(DispatchUtils.java:106)
	at org.apache.tools.ant.Task.perform(Task.java:348)
	at org.apache.tools.ant.Target.execute(Target.java:435)
	at org.apache.tools.ant.Target.performTasks(Target.java:456)
	at org.apache.tools.ant.Project.executeSortedTargets(Project.java:1393)
	at org.apache.tools.ant.helper.SingleCheckExecutor.executeTargets(SingleCheckExecutor.java:38)
	at org.apache.tools.ant.Project.executeTargets(Project.java:1248)
	at org.apache.tools.ant.taskdefs.Ant.execute(Ant.java:441)
	at org.apache.tools.ant.taskdefs.CallTarget.execute(CallTarget.java:105)
	at org.apache.tools.ant.UnknownElement.execute(UnknownElement.java:292)
	at sun.reflect.GeneratedMethodAccessor4.invoke(Unknown Source)
	at sun.reflect.DelegatingMethodAccessorImpl.invoke(DelegatingMethodAccessorImpl.java:43)
	at java.lang.reflect.Method.invoke(Method.java:601)
	at org.apache.tools.ant.dispatch.DispatchUtils.execute(DispatchUtils.java:106)
	at org.apache.tools.ant.Task.perform(Task.java:348)
	at org.apache.tools.ant.Target.execute(Target.java:435)
	at org.apache.tools.ant.Target.performTasks(Target.java:456)
	at org.apache.tools.ant.Project.executeSortedTargets(Project.java:1393)
	at org.apache.tools.ant.Project.executeTarget(Project.java:1364)
	at org.apache.tools.ant.helper.DefaultExecutor.executeTargets(DefaultExecutor.java:41)
	at org.apache.tools.ant.Project.executeTargets(Project.java:1248)
	at org.apache.tools.ant.Main.runBuild(Main.java:851)
	at org.apache.tools.ant.Main.startAnt(Main.java:235)
	at org.apache.tools.ant.launch.Launcher.run(Launcher.java:280)
	at org.apache.tools.ant.launch.Launcher.main(Launcher.java:109)

Total time: 5 seconds
Build step 'Execute shell' marked build as failure
[FINDBUGS] Skipping publisher since build result is FAILURE
[WARNINGS] Skipping publisher since build result is FAILURE
Archiving artifacts
Sending artifact delta relative to ZooKeeper-trunk #2531
Archived 3 artifacts
Archive block size is 32768
Received 0 blocks and 18056599 bytes
Compression is 0.0%
Took 1 min 42 sec
Recording fingerprints
Recording test results
Publishing Javadoc
Email was triggered for: Failure
Sending email for trigger: Failure



###################################################################################
############################## FAILED TESTS (if any) ##############################
No tests ran.

ZooKeeper-trunk - Build # 2541 - Still Failing

Posted by Apache Jenkins Server <je...@builds.apache.org>.
See https://builds.apache.org/job/ZooKeeper-trunk/2541/

###################################################################################
########################## LAST 60 LINES OF THE CONSOLE ###########################
[...truncated 2963 lines...]
   [clover] Updating existing database at '/home/jenkins/jenkins-slave/workspace/ZooKeeper-trunk/trunk/build/test/clover/db/zookeeper_coverage.db'.
   [clover] Processing files at 1.3 source level.
   [clover] /home/jenkins/jenkins-slave/workspace/ZooKeeper-trunk/trunk/src/java/main/org/apache/zookeeper/KeeperException.java:318:24:unexpected token: Code
   [clover] /home/jenkins/jenkins-slave/workspace/ZooKeeper-trunk/trunk/src/java/main/org/apache/zookeeper/KeeperException.java:318:24:unexpected token: Code
   [clover] ** Error(s) occurred and the instrumentation process can't continue.

BUILD FAILED
/home/jenkins/jenkins-slave/workspace/ZooKeeper-trunk/trunk/build.xml:1422: The following error occurred while executing this line:
/home/jenkins/jenkins-slave/workspace/ZooKeeper-trunk/trunk/build.xml:432: com.cenqua.clover.CloverException: /home/jenkins/jenkins-slave/workspace/ZooKeeper-trunk/trunk/src/java/main/org/apache/zookeeper/KeeperException.java:318:24:unexpected token: Code
	at com.cenqua.clover.instr.Instrumenter.instrument(Instrumenter.java:155)
	at org.apache.tools.ant.taskdefs.CloverCompilerAdapter.setJavac(CloverCompilerAdapter.java:339)
	at org.apache.tools.ant.taskdefs.Javac.compile(Javac.java:1156)
	at org.apache.tools.ant.taskdefs.Javac.execute(Javac.java:935)
	at org.apache.tools.ant.UnknownElement.execute(UnknownElement.java:292)
	at sun.reflect.GeneratedMethodAccessor4.invoke(Unknown Source)
	at sun.reflect.DelegatingMethodAccessorImpl.invoke(DelegatingMethodAccessorImpl.java:43)
	at java.lang.reflect.Method.invoke(Method.java:601)
	at org.apache.tools.ant.dispatch.DispatchUtils.execute(DispatchUtils.java:106)
	at org.apache.tools.ant.Task.perform(Task.java:348)
	at org.apache.tools.ant.Target.execute(Target.java:435)
	at org.apache.tools.ant.Target.performTasks(Target.java:456)
	at org.apache.tools.ant.Project.executeSortedTargets(Project.java:1393)
	at org.apache.tools.ant.helper.SingleCheckExecutor.executeTargets(SingleCheckExecutor.java:38)
	at org.apache.tools.ant.Project.executeTargets(Project.java:1248)
	at org.apache.tools.ant.taskdefs.Ant.execute(Ant.java:441)
	at org.apache.tools.ant.taskdefs.CallTarget.execute(CallTarget.java:105)
	at org.apache.tools.ant.UnknownElement.execute(UnknownElement.java:292)
	at sun.reflect.GeneratedMethodAccessor4.invoke(Unknown Source)
	at sun.reflect.DelegatingMethodAccessorImpl.invoke(DelegatingMethodAccessorImpl.java:43)
	at java.lang.reflect.Method.invoke(Method.java:601)
	at org.apache.tools.ant.dispatch.DispatchUtils.execute(DispatchUtils.java:106)
	at org.apache.tools.ant.Task.perform(Task.java:348)
	at org.apache.tools.ant.Target.execute(Target.java:435)
	at org.apache.tools.ant.Target.performTasks(Target.java:456)
	at org.apache.tools.ant.Project.executeSortedTargets(Project.java:1393)
	at org.apache.tools.ant.Project.executeTarget(Project.java:1364)
	at org.apache.tools.ant.helper.DefaultExecutor.executeTargets(DefaultExecutor.java:41)
	at org.apache.tools.ant.Project.executeTargets(Project.java:1248)
	at org.apache.tools.ant.Main.runBuild(Main.java:851)
	at org.apache.tools.ant.Main.startAnt(Main.java:235)
	at org.apache.tools.ant.launch.Launcher.run(Launcher.java:280)
	at org.apache.tools.ant.launch.Launcher.main(Launcher.java:109)

Total time: 5 seconds
Build step 'Execute shell' marked build as failure
[FINDBUGS] Skipping publisher since build result is FAILURE
[WARNINGS] Skipping publisher since build result is FAILURE
Archiving artifacts
Sending artifact delta relative to ZooKeeper-trunk #2531
Archived 3 artifacts
Archive block size is 32768
Received 0 blocks and 18056862 bytes
Compression is 0.0%
Took 5.3 sec
Recording fingerprints
Recording test results
Publishing Javadoc
Email was triggered for: Failure
Sending email for trigger: Failure



###################################################################################
############################## FAILED TESTS (if any) ##############################
No tests ran.

ZooKeeper-trunk - Build # 2540 - Still Failing

Posted by Apache Jenkins Server <je...@builds.apache.org>.
See https://builds.apache.org/job/ZooKeeper-trunk/2540/

###################################################################################
########################## LAST 60 LINES OF THE CONSOLE ###########################
[...truncated 2963 lines...]
   [clover] Updating existing database at '/home/jenkins/jenkins-slave/workspace/ZooKeeper-trunk/trunk/build/test/clover/db/zookeeper_coverage.db'.
   [clover] Processing files at 1.3 source level.
   [clover] /home/jenkins/jenkins-slave/workspace/ZooKeeper-trunk/trunk/src/java/main/org/apache/zookeeper/KeeperException.java:318:24:unexpected token: Code
   [clover] /home/jenkins/jenkins-slave/workspace/ZooKeeper-trunk/trunk/src/java/main/org/apache/zookeeper/KeeperException.java:318:24:unexpected token: Code
   [clover] ** Error(s) occurred and the instrumentation process can't continue.

BUILD FAILED
/home/jenkins/jenkins-slave/workspace/ZooKeeper-trunk/trunk/build.xml:1422: The following error occurred while executing this line:
/home/jenkins/jenkins-slave/workspace/ZooKeeper-trunk/trunk/build.xml:432: com.cenqua.clover.CloverException: /home/jenkins/jenkins-slave/workspace/ZooKeeper-trunk/trunk/src/java/main/org/apache/zookeeper/KeeperException.java:318:24:unexpected token: Code
	at com.cenqua.clover.instr.Instrumenter.instrument(Instrumenter.java:155)
	at org.apache.tools.ant.taskdefs.CloverCompilerAdapter.setJavac(CloverCompilerAdapter.java:339)
	at org.apache.tools.ant.taskdefs.Javac.compile(Javac.java:1156)
	at org.apache.tools.ant.taskdefs.Javac.execute(Javac.java:935)
	at org.apache.tools.ant.UnknownElement.execute(UnknownElement.java:292)
	at sun.reflect.GeneratedMethodAccessor4.invoke(Unknown Source)
	at sun.reflect.DelegatingMethodAccessorImpl.invoke(DelegatingMethodAccessorImpl.java:43)
	at java.lang.reflect.Method.invoke(Method.java:601)
	at org.apache.tools.ant.dispatch.DispatchUtils.execute(DispatchUtils.java:106)
	at org.apache.tools.ant.Task.perform(Task.java:348)
	at org.apache.tools.ant.Target.execute(Target.java:435)
	at org.apache.tools.ant.Target.performTasks(Target.java:456)
	at org.apache.tools.ant.Project.executeSortedTargets(Project.java:1393)
	at org.apache.tools.ant.helper.SingleCheckExecutor.executeTargets(SingleCheckExecutor.java:38)
	at org.apache.tools.ant.Project.executeTargets(Project.java:1248)
	at org.apache.tools.ant.taskdefs.Ant.execute(Ant.java:441)
	at org.apache.tools.ant.taskdefs.CallTarget.execute(CallTarget.java:105)
	at org.apache.tools.ant.UnknownElement.execute(UnknownElement.java:292)
	at sun.reflect.GeneratedMethodAccessor4.invoke(Unknown Source)
	at sun.reflect.DelegatingMethodAccessorImpl.invoke(DelegatingMethodAccessorImpl.java:43)
	at java.lang.reflect.Method.invoke(Method.java:601)
	at org.apache.tools.ant.dispatch.DispatchUtils.execute(DispatchUtils.java:106)
	at org.apache.tools.ant.Task.perform(Task.java:348)
	at org.apache.tools.ant.Target.execute(Target.java:435)
	at org.apache.tools.ant.Target.performTasks(Target.java:456)
	at org.apache.tools.ant.Project.executeSortedTargets(Project.java:1393)
	at org.apache.tools.ant.Project.executeTarget(Project.java:1364)
	at org.apache.tools.ant.helper.DefaultExecutor.executeTargets(DefaultExecutor.java:41)
	at org.apache.tools.ant.Project.executeTargets(Project.java:1248)
	at org.apache.tools.ant.Main.runBuild(Main.java:851)
	at org.apache.tools.ant.Main.startAnt(Main.java:235)
	at org.apache.tools.ant.launch.Launcher.run(Launcher.java:280)
	at org.apache.tools.ant.launch.Launcher.main(Launcher.java:109)

Total time: 5 seconds
Build step 'Execute shell' marked build as failure
[FINDBUGS] Skipping publisher since build result is FAILURE
[WARNINGS] Skipping publisher since build result is FAILURE
Archiving artifacts
Sending artifact delta relative to ZooKeeper-trunk #2531
Archived 3 artifacts
Archive block size is 32768
Received 0 blocks and 18052933 bytes
Compression is 0.0%
Took 4.6 sec
Recording fingerprints
Recording test results
Publishing Javadoc
Email was triggered for: Failure
Sending email for trigger: Failure



###################################################################################
############################## FAILED TESTS (if any) ##############################
No tests ran.

ZooKeeper-trunk - Build # 2539 - Still Failing

Posted by Apache Jenkins Server <je...@builds.apache.org>.
See https://builds.apache.org/job/ZooKeeper-trunk/2539/

###################################################################################
########################## LAST 60 LINES OF THE CONSOLE ###########################
[...truncated 2963 lines...]
   [clover] Processing files at 1.3 source level.
   [clover] /home/jenkins/jenkins-slave/workspace/ZooKeeper-trunk/trunk/src/java/main/org/apache/zookeeper/KeeperException.java:318:24:unexpected token: Code
   [clover] /home/jenkins/jenkins-slave/workspace/ZooKeeper-trunk/trunk/src/java/main/org/apache/zookeeper/KeeperException.java:318:24:unexpected token: Code
   [clover] ** Error(s) occurred and the instrumentation process can't continue.

BUILD FAILED
/home/jenkins/jenkins-slave/workspace/ZooKeeper-trunk/trunk/build.xml:1422: The following error occurred while executing this line:
/home/jenkins/jenkins-slave/workspace/ZooKeeper-trunk/trunk/build.xml:432: com.cenqua.clover.CloverException: /home/jenkins/jenkins-slave/workspace/ZooKeeper-trunk/trunk/src/java/main/org/apache/zookeeper/KeeperException.java:318:24:unexpected token: Code
	at com.cenqua.clover.instr.Instrumenter.instrument(Instrumenter.java:155)
	at org.apache.tools.ant.taskdefs.CloverCompilerAdapter.setJavac(CloverCompilerAdapter.java:339)
	at org.apache.tools.ant.taskdefs.Javac.compile(Javac.java:1156)
	at org.apache.tools.ant.taskdefs.Javac.execute(Javac.java:935)
	at org.apache.tools.ant.UnknownElement.execute(UnknownElement.java:292)
	at sun.reflect.GeneratedMethodAccessor4.invoke(Unknown Source)
	at sun.reflect.DelegatingMethodAccessorImpl.invoke(DelegatingMethodAccessorImpl.java:43)
	at java.lang.reflect.Method.invoke(Method.java:601)
	at org.apache.tools.ant.dispatch.DispatchUtils.execute(DispatchUtils.java:106)
	at org.apache.tools.ant.Task.perform(Task.java:348)
	at org.apache.tools.ant.Target.execute(Target.java:435)
	at org.apache.tools.ant.Target.performTasks(Target.java:456)
	at org.apache.tools.ant.Project.executeSortedTargets(Project.java:1393)
	at org.apache.tools.ant.helper.SingleCheckExecutor.executeTargets(SingleCheckExecutor.java:38)
	at org.apache.tools.ant.Project.executeTargets(Project.java:1248)
	at org.apache.tools.ant.taskdefs.Ant.execute(Ant.java:441)
	at org.apache.tools.ant.taskdefs.CallTarget.execute(CallTarget.java:105)
	at org.apache.tools.ant.UnknownElement.execute(UnknownElement.java:292)
	at sun.reflect.GeneratedMethodAccessor4.invoke(Unknown Source)
	at sun.reflect.DelegatingMethodAccessorImpl.invoke(DelegatingMethodAccessorImpl.java:43)
	at java.lang.reflect.Method.invoke(Method.java:601)
	at org.apache.tools.ant.dispatch.DispatchUtils.execute(DispatchUtils.java:106)
	at org.apache.tools.ant.Task.perform(Task.java:348)
	at org.apache.tools.ant.Target.execute(Target.java:435)
	at org.apache.tools.ant.Target.performTasks(Target.java:456)
	at org.apache.tools.ant.Project.executeSortedTargets(Project.java:1393)
	at org.apache.tools.ant.Project.executeTarget(Project.java:1364)
	at org.apache.tools.ant.helper.DefaultExecutor.executeTargets(DefaultExecutor.java:41)
	at org.apache.tools.ant.Project.executeTargets(Project.java:1248)
	at org.apache.tools.ant.Main.runBuild(Main.java:851)
	at org.apache.tools.ant.Main.startAnt(Main.java:235)
	at org.apache.tools.ant.launch.Launcher.run(Launcher.java:280)
	at org.apache.tools.ant.launch.Launcher.main(Launcher.java:109)

Total time: 5 seconds
Build step 'Execute shell' marked build as failure
[FINDBUGS] Skipping publisher since build result is FAILURE
[WARNINGS] Skipping publisher since build result is FAILURE
Archiving artifacts
Sending artifact delta relative to ZooKeeper-trunk #2531
Archived 3 artifacts
Archive block size is 32768
Received 0 blocks and 18056989 bytes
Compression is 0.0%
Took 4.6 sec
Recording fingerprints
Updating ZOOKEEPER-2069
Recording test results
Publishing Javadoc
Email was triggered for: Failure
Sending email for trigger: Failure



###################################################################################
############################## FAILED TESTS (if any) ##############################
No tests ran.

ZooKeeper-trunk - Build # 2538 - Still Failing

Posted by Apache Jenkins Server <je...@builds.apache.org>.
See https://builds.apache.org/job/ZooKeeper-trunk/2538/

###################################################################################
########################## LAST 60 LINES OF THE CONSOLE ###########################
[...truncated 2959 lines...]
   [clover] Updating existing database at '/home/jenkins/jenkins-slave/workspace/ZooKeeper-trunk/trunk/build/test/clover/db/zookeeper_coverage.db'.
   [clover] Processing files at 1.3 source level.
   [clover] /home/jenkins/jenkins-slave/workspace/ZooKeeper-trunk/trunk/src/java/main/org/apache/zookeeper/KeeperException.java:318:24:unexpected token: Code
   [clover] /home/jenkins/jenkins-slave/workspace/ZooKeeper-trunk/trunk/src/java/main/org/apache/zookeeper/KeeperException.java:318:24:unexpected token: Code
   [clover] ** Error(s) occurred and the instrumentation process can't continue.

BUILD FAILED
/home/jenkins/jenkins-slave/workspace/ZooKeeper-trunk/trunk/build.xml:1422: The following error occurred while executing this line:
/home/jenkins/jenkins-slave/workspace/ZooKeeper-trunk/trunk/build.xml:432: com.cenqua.clover.CloverException: /home/jenkins/jenkins-slave/workspace/ZooKeeper-trunk/trunk/src/java/main/org/apache/zookeeper/KeeperException.java:318:24:unexpected token: Code
	at com.cenqua.clover.instr.Instrumenter.instrument(Instrumenter.java:155)
	at org.apache.tools.ant.taskdefs.CloverCompilerAdapter.setJavac(CloverCompilerAdapter.java:339)
	at org.apache.tools.ant.taskdefs.Javac.compile(Javac.java:1156)
	at org.apache.tools.ant.taskdefs.Javac.execute(Javac.java:935)
	at org.apache.tools.ant.UnknownElement.execute(UnknownElement.java:292)
	at sun.reflect.GeneratedMethodAccessor4.invoke(Unknown Source)
	at sun.reflect.DelegatingMethodAccessorImpl.invoke(DelegatingMethodAccessorImpl.java:43)
	at java.lang.reflect.Method.invoke(Method.java:601)
	at org.apache.tools.ant.dispatch.DispatchUtils.execute(DispatchUtils.java:106)
	at org.apache.tools.ant.Task.perform(Task.java:348)
	at org.apache.tools.ant.Target.execute(Target.java:435)
	at org.apache.tools.ant.Target.performTasks(Target.java:456)
	at org.apache.tools.ant.Project.executeSortedTargets(Project.java:1393)
	at org.apache.tools.ant.helper.SingleCheckExecutor.executeTargets(SingleCheckExecutor.java:38)
	at org.apache.tools.ant.Project.executeTargets(Project.java:1248)
	at org.apache.tools.ant.taskdefs.Ant.execute(Ant.java:441)
	at org.apache.tools.ant.taskdefs.CallTarget.execute(CallTarget.java:105)
	at org.apache.tools.ant.UnknownElement.execute(UnknownElement.java:292)
	at sun.reflect.GeneratedMethodAccessor4.invoke(Unknown Source)
	at sun.reflect.DelegatingMethodAccessorImpl.invoke(DelegatingMethodAccessorImpl.java:43)
	at java.lang.reflect.Method.invoke(Method.java:601)
	at org.apache.tools.ant.dispatch.DispatchUtils.execute(DispatchUtils.java:106)
	at org.apache.tools.ant.Task.perform(Task.java:348)
	at org.apache.tools.ant.Target.execute(Target.java:435)
	at org.apache.tools.ant.Target.performTasks(Target.java:456)
	at org.apache.tools.ant.Project.executeSortedTargets(Project.java:1393)
	at org.apache.tools.ant.Project.executeTarget(Project.java:1364)
	at org.apache.tools.ant.helper.DefaultExecutor.executeTargets(DefaultExecutor.java:41)
	at org.apache.tools.ant.Project.executeTargets(Project.java:1248)
	at org.apache.tools.ant.Main.runBuild(Main.java:851)
	at org.apache.tools.ant.Main.startAnt(Main.java:235)
	at org.apache.tools.ant.launch.Launcher.run(Launcher.java:280)
	at org.apache.tools.ant.launch.Launcher.main(Launcher.java:109)

Total time: 5 seconds
Build step 'Execute shell' marked build as failure
[FINDBUGS] Skipping publisher since build result is FAILURE
[WARNINGS] Skipping publisher since build result is FAILURE
Archiving artifacts
Sending artifact delta relative to ZooKeeper-trunk #2531
Archived 3 artifacts
Archive block size is 32768
Received 0 blocks and 18024255 bytes
Compression is 0.0%
Took 4.6 sec
Recording fingerprints
Recording test results
Publishing Javadoc
Email was triggered for: Failure
Sending email for trigger: Failure



###################################################################################
############################## FAILED TESTS (if any) ##############################
No tests ran.

ZooKeeper-trunk - Build # 2537 - Still Failing

Posted by Apache Jenkins Server <je...@builds.apache.org>.
See https://builds.apache.org/job/ZooKeeper-trunk/2537/

###################################################################################
########################## LAST 60 LINES OF THE CONSOLE ###########################
[...truncated 2959 lines...]
   [clover] Updating existing database at '/home/jenkins/jenkins-slave/workspace/ZooKeeper-trunk/trunk/build/test/clover/db/zookeeper_coverage.db'.
   [clover] Processing files at 1.3 source level.
   [clover] /home/jenkins/jenkins-slave/workspace/ZooKeeper-trunk/trunk/src/java/main/org/apache/zookeeper/KeeperException.java:318:24:unexpected token: Code
   [clover] /home/jenkins/jenkins-slave/workspace/ZooKeeper-trunk/trunk/src/java/main/org/apache/zookeeper/KeeperException.java:318:24:unexpected token: Code
   [clover] ** Error(s) occurred and the instrumentation process can't continue.

BUILD FAILED
/home/jenkins/jenkins-slave/workspace/ZooKeeper-trunk/trunk/build.xml:1422: The following error occurred while executing this line:
/home/jenkins/jenkins-slave/workspace/ZooKeeper-trunk/trunk/build.xml:432: com.cenqua.clover.CloverException: /home/jenkins/jenkins-slave/workspace/ZooKeeper-trunk/trunk/src/java/main/org/apache/zookeeper/KeeperException.java:318:24:unexpected token: Code
	at com.cenqua.clover.instr.Instrumenter.instrument(Instrumenter.java:155)
	at org.apache.tools.ant.taskdefs.CloverCompilerAdapter.setJavac(CloverCompilerAdapter.java:339)
	at org.apache.tools.ant.taskdefs.Javac.compile(Javac.java:1156)
	at org.apache.tools.ant.taskdefs.Javac.execute(Javac.java:935)
	at org.apache.tools.ant.UnknownElement.execute(UnknownElement.java:292)
	at sun.reflect.GeneratedMethodAccessor4.invoke(Unknown Source)
	at sun.reflect.DelegatingMethodAccessorImpl.invoke(DelegatingMethodAccessorImpl.java:43)
	at java.lang.reflect.Method.invoke(Method.java:601)
	at org.apache.tools.ant.dispatch.DispatchUtils.execute(DispatchUtils.java:106)
	at org.apache.tools.ant.Task.perform(Task.java:348)
	at org.apache.tools.ant.Target.execute(Target.java:435)
	at org.apache.tools.ant.Target.performTasks(Target.java:456)
	at org.apache.tools.ant.Project.executeSortedTargets(Project.java:1393)
	at org.apache.tools.ant.helper.SingleCheckExecutor.executeTargets(SingleCheckExecutor.java:38)
	at org.apache.tools.ant.Project.executeTargets(Project.java:1248)
	at org.apache.tools.ant.taskdefs.Ant.execute(Ant.java:441)
	at org.apache.tools.ant.taskdefs.CallTarget.execute(CallTarget.java:105)
	at org.apache.tools.ant.UnknownElement.execute(UnknownElement.java:292)
	at sun.reflect.GeneratedMethodAccessor4.invoke(Unknown Source)
	at sun.reflect.DelegatingMethodAccessorImpl.invoke(DelegatingMethodAccessorImpl.java:43)
	at java.lang.reflect.Method.invoke(Method.java:601)
	at org.apache.tools.ant.dispatch.DispatchUtils.execute(DispatchUtils.java:106)
	at org.apache.tools.ant.Task.perform(Task.java:348)
	at org.apache.tools.ant.Target.execute(Target.java:435)
	at org.apache.tools.ant.Target.performTasks(Target.java:456)
	at org.apache.tools.ant.Project.executeSortedTargets(Project.java:1393)
	at org.apache.tools.ant.Project.executeTarget(Project.java:1364)
	at org.apache.tools.ant.helper.DefaultExecutor.executeTargets(DefaultExecutor.java:41)
	at org.apache.tools.ant.Project.executeTargets(Project.java:1248)
	at org.apache.tools.ant.Main.runBuild(Main.java:851)
	at org.apache.tools.ant.Main.startAnt(Main.java:235)
	at org.apache.tools.ant.launch.Launcher.run(Launcher.java:280)
	at org.apache.tools.ant.launch.Launcher.main(Launcher.java:109)

Total time: 5 seconds
Build step 'Execute shell' marked build as failure
[FINDBUGS] Skipping publisher since build result is FAILURE
[WARNINGS] Skipping publisher since build result is FAILURE
Archiving artifacts
Sending artifact delta relative to ZooKeeper-trunk #2531
Archived 3 artifacts
Archive block size is 32768
Received 0 blocks and 18024590 bytes
Compression is 0.0%
Took 4.7 sec
Recording fingerprints
Recording test results
Publishing Javadoc
Email was triggered for: Failure
Sending email for trigger: Failure



###################################################################################
############################## FAILED TESTS (if any) ##############################
No tests ran.

ZooKeeper-trunk - Build # 2536 - Still Failing

Posted by Apache Jenkins Server <je...@builds.apache.org>.
See https://builds.apache.org/job/ZooKeeper-trunk/2536/

###################################################################################
########################## LAST 60 LINES OF THE CONSOLE ###########################
[...truncated 2959 lines...]
   [clover] Processing files at 1.3 source level.
   [clover] /home/jenkins/jenkins-slave/workspace/ZooKeeper-trunk/trunk/src/java/main/org/apache/zookeeper/KeeperException.java:318:24:unexpected token: Code
   [clover] /home/jenkins/jenkins-slave/workspace/ZooKeeper-trunk/trunk/src/java/main/org/apache/zookeeper/KeeperException.java:318:24:unexpected token: Code
   [clover] ** Error(s) occurred and the instrumentation process can't continue.

BUILD FAILED
/home/jenkins/jenkins-slave/workspace/ZooKeeper-trunk/trunk/build.xml:1422: The following error occurred while executing this line:
/home/jenkins/jenkins-slave/workspace/ZooKeeper-trunk/trunk/build.xml:432: com.cenqua.clover.CloverException: /home/jenkins/jenkins-slave/workspace/ZooKeeper-trunk/trunk/src/java/main/org/apache/zookeeper/KeeperException.java:318:24:unexpected token: Code
	at com.cenqua.clover.instr.Instrumenter.instrument(Instrumenter.java:155)
	at org.apache.tools.ant.taskdefs.CloverCompilerAdapter.setJavac(CloverCompilerAdapter.java:339)
	at org.apache.tools.ant.taskdefs.Javac.compile(Javac.java:1156)
	at org.apache.tools.ant.taskdefs.Javac.execute(Javac.java:935)
	at org.apache.tools.ant.UnknownElement.execute(UnknownElement.java:292)
	at sun.reflect.GeneratedMethodAccessor4.invoke(Unknown Source)
	at sun.reflect.DelegatingMethodAccessorImpl.invoke(DelegatingMethodAccessorImpl.java:43)
	at java.lang.reflect.Method.invoke(Method.java:601)
	at org.apache.tools.ant.dispatch.DispatchUtils.execute(DispatchUtils.java:106)
	at org.apache.tools.ant.Task.perform(Task.java:348)
	at org.apache.tools.ant.Target.execute(Target.java:435)
	at org.apache.tools.ant.Target.performTasks(Target.java:456)
	at org.apache.tools.ant.Project.executeSortedTargets(Project.java:1393)
	at org.apache.tools.ant.helper.SingleCheckExecutor.executeTargets(SingleCheckExecutor.java:38)
	at org.apache.tools.ant.Project.executeTargets(Project.java:1248)
	at org.apache.tools.ant.taskdefs.Ant.execute(Ant.java:441)
	at org.apache.tools.ant.taskdefs.CallTarget.execute(CallTarget.java:105)
	at org.apache.tools.ant.UnknownElement.execute(UnknownElement.java:292)
	at sun.reflect.GeneratedMethodAccessor4.invoke(Unknown Source)
	at sun.reflect.DelegatingMethodAccessorImpl.invoke(DelegatingMethodAccessorImpl.java:43)
	at java.lang.reflect.Method.invoke(Method.java:601)
	at org.apache.tools.ant.dispatch.DispatchUtils.execute(DispatchUtils.java:106)
	at org.apache.tools.ant.Task.perform(Task.java:348)
	at org.apache.tools.ant.Target.execute(Target.java:435)
	at org.apache.tools.ant.Target.performTasks(Target.java:456)
	at org.apache.tools.ant.Project.executeSortedTargets(Project.java:1393)
	at org.apache.tools.ant.Project.executeTarget(Project.java:1364)
	at org.apache.tools.ant.helper.DefaultExecutor.executeTargets(DefaultExecutor.java:41)
	at org.apache.tools.ant.Project.executeTargets(Project.java:1248)
	at org.apache.tools.ant.Main.runBuild(Main.java:851)
	at org.apache.tools.ant.Main.startAnt(Main.java:235)
	at org.apache.tools.ant.launch.Launcher.run(Launcher.java:280)
	at org.apache.tools.ant.launch.Launcher.main(Launcher.java:109)

Total time: 5 seconds
Build step 'Execute shell' marked build as failure
[FINDBUGS] Skipping publisher since build result is FAILURE
[WARNINGS] Skipping publisher since build result is FAILURE
Archiving artifacts
Sending artifact delta relative to ZooKeeper-trunk #2531
Archived 3 artifacts
Archive block size is 32768
Received 0 blocks and 18023410 bytes
Compression is 0.0%
Took 4.6 sec
Recording fingerprints
Updating ZOOKEEPER-1963
Recording test results
Publishing Javadoc
Email was triggered for: Failure
Sending email for trigger: Failure



###################################################################################
############################## FAILED TESTS (if any) ##############################
No tests ran.

ZooKeeper-trunk - Build # 2535 - Still Failing

Posted by Apache Jenkins Server <je...@builds.apache.org>.
See https://builds.apache.org/job/ZooKeeper-trunk/2535/

###################################################################################
########################## LAST 60 LINES OF THE CONSOLE ###########################
[...truncated 333138 lines...]
    [junit] 2014-12-17 11:09:18,955 [myid:] - INFO  [main:FileTxnSnapLog@298] - Snapshotting: 0xb to /home/jenkins/jenkins-slave/workspace/ZooKeeper-trunk/trunk/build/test/tmp/test5052185040422843591.junit.dir/version-2/snapshot.b
    [junit] 2014-12-17 11:09:18,957 [myid:] - INFO  [main:FourLetterWordMain@43] - connecting to 127.0.0.1 11221
    [junit] 2014-12-17 11:09:18,957 [myid:] - INFO  [NIOServerCxnFactory.AcceptThread:0.0.0.0/0.0.0.0:11221:NIOServerCnxnFactory$AcceptThread@296] - Accepted socket connection from /127.0.0.1:49159
    [junit] 2014-12-17 11:09:18,959 [myid:] - INFO  [NIOWorkerThread-1:NIOServerCnxn@835] - Processing stat command from /127.0.0.1:49159
    [junit] 2014-12-17 11:09:18,959 [myid:] - INFO  [NIOWorkerThread-1:NIOServerCnxn$StatCommand@684] - Stat command output
    [junit] 2014-12-17 11:09:18,959 [myid:] - INFO  [NIOWorkerThread-1:NIOServerCnxn@1006] - Closed socket connection for client /127.0.0.1:49159 (no session established for client)
    [junit] 2014-12-17 11:09:18,960 [myid:] - INFO  [main:JMXEnv@224] - ensureParent:[InMemoryDataTree, StandaloneServer_port]
    [junit] 2014-12-17 11:09:18,961 [myid:] - INFO  [main:JMXEnv@241] - expect:InMemoryDataTree
    [junit] 2014-12-17 11:09:18,962 [myid:] - INFO  [main:JMXEnv@245] - found:InMemoryDataTree org.apache.ZooKeeperService:name0=StandaloneServer_port11221,name1=InMemoryDataTree
    [junit] 2014-12-17 11:09:18,962 [myid:] - INFO  [main:JMXEnv@241] - expect:StandaloneServer_port
    [junit] 2014-12-17 11:09:18,962 [myid:] - INFO  [main:JMXEnv@245] - found:StandaloneServer_port org.apache.ZooKeeperService:name0=StandaloneServer_port11221
    [junit] 2014-12-17 11:09:18,962 [myid:] - INFO  [main:JUnit4ZKTestRunner$LoggedInvokeMethod@55] - Memory used 85503
    [junit] 2014-12-17 11:09:18,962 [myid:] - INFO  [main:JUnit4ZKTestRunner$LoggedInvokeMethod@60] - Number of threads 24
    [junit] 2014-12-17 11:09:18,963 [myid:] - INFO  [main:JUnit4ZKTestRunner$LoggedInvokeMethod@65] - FINISHED TEST METHOD testQuota
    [junit] 2014-12-17 11:09:18,963 [myid:] - INFO  [main:ClientBase@520] - tearDown starting
    [junit] 2014-12-17 11:09:19,021 [myid:] - INFO  [main:ZooKeeper@968] - Session: 0x14a57f011e40000 closed
    [junit] 2014-12-17 11:09:19,021 [myid:] - INFO  [main:ClientBase@490] - STOPPING server
    [junit] 2014-12-17 11:09:19,021 [myid:] - INFO  [main-EventThread:ClientCnxn$EventThread@529] - EventThread shut down
    [junit] 2014-12-17 11:09:19,021 [myid:] - INFO  [ConnnectionExpirer:NIOServerCnxnFactory$ConnectionExpirerThread@583] - ConnnectionExpirerThread interrupted
    [junit] 2014-12-17 11:09:19,021 [myid:] - INFO  [NIOServerCxnFactory.AcceptThread:0.0.0.0/0.0.0.0:11221:NIOServerCnxnFactory$AcceptThread@219] - accept thread exitted run method
    [junit] 2014-12-17 11:09:19,022 [myid:] - INFO  [NIOServerCxnFactory.SelectorThread-1:NIOServerCnxnFactory$SelectorThread@420] - selector thread exitted run method
    [junit] 2014-12-17 11:09:19,022 [myid:] - INFO  [NIOServerCxnFactory.SelectorThread-0:NIOServerCnxnFactory$SelectorThread@420] - selector thread exitted run method
    [junit] 2014-12-17 11:09:19,022 [myid:] - INFO  [main:ZooKeeperServer@443] - shutting down
    [junit] 2014-12-17 11:09:19,022 [myid:] - INFO  [main:SessionTrackerImpl@231] - Shutting down
    [junit] 2014-12-17 11:09:19,023 [myid:] - INFO  [main:PrepRequestProcessor@971] - Shutting down
    [junit] 2014-12-17 11:09:19,023 [myid:] - INFO  [main:SyncRequestProcessor@191] - Shutting down
    [junit] 2014-12-17 11:09:19,023 [myid:] - INFO  [ProcessThread(sid:0 cport:11221)::PrepRequestProcessor@155] - PrepRequestProcessor exited loop!
    [junit] 2014-12-17 11:09:19,024 [myid:] - INFO  [SyncThread:0:SyncRequestProcessor@169] - SyncRequestProcessor exited!
    [junit] 2014-12-17 11:09:19,024 [myid:] - INFO  [main:FinalRequestProcessor@476] - shutdown of request processor complete
    [junit] 2014-12-17 11:09:19,024 [myid:] - INFO  [main:MBeanRegistry@119] - Unregister MBean [org.apache.ZooKeeperService:name0=StandaloneServer_port11221,name1=InMemoryDataTree]
    [junit] 2014-12-17 11:09:19,025 [myid:] - INFO  [main:MBeanRegistry@119] - Unregister MBean [org.apache.ZooKeeperService:name0=StandaloneServer_port11221]
    [junit] 2014-12-17 11:09:19,025 [myid:] - INFO  [main:FourLetterWordMain@43] - connecting to 127.0.0.1 11221
    [junit] 2014-12-17 11:09:19,026 [myid:] - INFO  [main:JMXEnv@142] - ensureOnly:[]
    [junit] 2014-12-17 11:09:19,030 [myid:] - INFO  [main:ClientBase@545] - fdcount after test is: 46 at start it was 34
    [junit] 2014-12-17 11:09:19,030 [myid:] - INFO  [main:ClientBase@547] - sleeping for 20 secs
    [junit] 2014-12-17 11:09:19,031 [myid:] - INFO  [main:ZKTestCase$1@65] - SUCCEEDED testQuota
    [junit] 2014-12-17 11:09:19,031 [myid:] - INFO  [main:ZKTestCase$1@60] - FINISHED testQuota
    [junit] Tests run: 1, Failures: 0, Errors: 0, Skipped: 0, Time elapsed: 0.658 sec

BUILD FAILED
/home/jenkins/jenkins-slave/workspace/ZooKeeper-trunk/trunk/build.xml:1422: The following error occurred while executing this line:
/home/jenkins/jenkins-slave/workspace/ZooKeeper-trunk/trunk/build.xml:1333: Tests failed!

Total time: 37 minutes 35 seconds
Build step 'Execute shell' marked build as failure
[FINDBUGS] Skipping publisher since build result is FAILURE
[WARNINGS] Skipping publisher since build result is FAILURE
Archiving artifacts
Sending artifact delta relative to ZooKeeper-trunk #2531
Archived 3 artifacts
Archive block size is 32768
Received 0 blocks and 17922999 bytes
Compression is 0.0%
Took 4.7 sec
Recording fingerprints
Recording test results
Publishing Javadoc
Email was triggered for: Failure
Sending email for trigger: Failure



###################################################################################
############################## FAILED TESTS (if any) ##############################
1 tests failed.
FAILED:  org.apache.zookeeper.test.ReconfigTest.testPortChange

Error Message:
expected:<test[1]> but was:<test[0]>

Stack Trace:
junit.framework.AssertionFailedError: expected:<test[1]> but was:<test[0]>
	at org.apache.zookeeper.test.ReconfigTest.testNormalOperation(ReconfigTest.java:151)
	at org.apache.zookeeper.test.ReconfigTest.testPortChange(ReconfigTest.java:600)
	at org.apache.zookeeper.JUnit4ZKTestRunner$LoggedInvokeMethod.evaluate(JUnit4ZKTestRunner.java:52)



ZooKeeper-trunk - Build # 2534 - Still Failing

Posted by Apache Jenkins Server <je...@builds.apache.org>.
See https://builds.apache.org/job/ZooKeeper-trunk/2534/

###################################################################################
########################## LAST 60 LINES OF THE CONSOLE ###########################
[...truncated 333021 lines...]
    [junit] 2014-12-16 21:17:37,642 [myid:] - INFO  [main:FileTxnSnapLog@298] - Snapshotting: 0xb to /home/jenkins/jenkins-slave/workspace/ZooKeeper-trunk/trunk/build/test/tmp/test8116891698816824719.junit.dir/version-2/snapshot.b
    [junit] 2014-12-16 21:17:37,644 [myid:] - INFO  [main:FourLetterWordMain@43] - connecting to 127.0.0.1 11221
    [junit] 2014-12-16 21:17:37,645 [myid:] - INFO  [NIOServerCxnFactory.AcceptThread:0.0.0.0/0.0.0.0:11221:NIOServerCnxnFactory$AcceptThread@296] - Accepted socket connection from /127.0.0.1:36998
    [junit] 2014-12-16 21:17:37,646 [myid:] - INFO  [NIOWorkerThread-1:NIOServerCnxn@835] - Processing stat command from /127.0.0.1:36998
    [junit] 2014-12-16 21:17:37,646 [myid:] - INFO  [NIOWorkerThread-1:NIOServerCnxn$StatCommand@684] - Stat command output
    [junit] 2014-12-16 21:17:37,647 [myid:] - INFO  [NIOWorkerThread-1:NIOServerCnxn@1006] - Closed socket connection for client /127.0.0.1:36998 (no session established for client)
    [junit] 2014-12-16 21:17:37,647 [myid:] - INFO  [main:JMXEnv@224] - ensureParent:[InMemoryDataTree, StandaloneServer_port]
    [junit] 2014-12-16 21:17:37,649 [myid:] - INFO  [main:JMXEnv@241] - expect:InMemoryDataTree
    [junit] 2014-12-16 21:17:37,649 [myid:] - INFO  [main:JMXEnv@245] - found:InMemoryDataTree org.apache.ZooKeeperService:name0=StandaloneServer_port11221,name1=InMemoryDataTree
    [junit] 2014-12-16 21:17:37,649 [myid:] - INFO  [main:JMXEnv@241] - expect:StandaloneServer_port
    [junit] 2014-12-16 21:17:37,650 [myid:] - INFO  [main:JMXEnv@245] - found:StandaloneServer_port org.apache.ZooKeeperService:name0=StandaloneServer_port11221
    [junit] 2014-12-16 21:17:37,650 [myid:] - INFO  [main:JUnit4ZKTestRunner$LoggedInvokeMethod@55] - Memory used 85504
    [junit] 2014-12-16 21:17:37,650 [myid:] - INFO  [main:JUnit4ZKTestRunner$LoggedInvokeMethod@60] - Number of threads 24
    [junit] 2014-12-16 21:17:37,650 [myid:] - INFO  [main:JUnit4ZKTestRunner$LoggedInvokeMethod@65] - FINISHED TEST METHOD testQuota
    [junit] 2014-12-16 21:17:37,650 [myid:] - INFO  [main:ClientBase@520] - tearDown starting
    [junit] 2014-12-16 21:17:37,707 [myid:] - INFO  [main:ZooKeeper@968] - Session: 0x14a54f6a2e60000 closed
    [junit] 2014-12-16 21:17:37,707 [myid:] - INFO  [main:ClientBase@490] - STOPPING server
    [junit] 2014-12-16 21:17:37,707 [myid:] - INFO  [main-EventThread:ClientCnxn$EventThread@529] - EventThread shut down
    [junit] 2014-12-16 21:17:37,708 [myid:] - INFO  [NIOServerCxnFactory.SelectorThread-1:NIOServerCnxnFactory$SelectorThread@420] - selector thread exitted run method
    [junit] 2014-12-16 21:17:37,707 [myid:] - INFO  [ConnnectionExpirer:NIOServerCnxnFactory$ConnectionExpirerThread@583] - ConnnectionExpirerThread interrupted
    [junit] 2014-12-16 21:17:37,708 [myid:] - INFO  [NIOServerCxnFactory.SelectorThread-0:NIOServerCnxnFactory$SelectorThread@420] - selector thread exitted run method
    [junit] 2014-12-16 21:17:37,708 [myid:] - INFO  [NIOServerCxnFactory.AcceptThread:0.0.0.0/0.0.0.0:11221:NIOServerCnxnFactory$AcceptThread@219] - accept thread exitted run method
    [junit] 2014-12-16 21:17:37,709 [myid:] - INFO  [main:ZooKeeperServer@443] - shutting down
    [junit] 2014-12-16 21:17:37,709 [myid:] - INFO  [main:SessionTrackerImpl@231] - Shutting down
    [junit] 2014-12-16 21:17:37,709 [myid:] - INFO  [main:PrepRequestProcessor@971] - Shutting down
    [junit] 2014-12-16 21:17:37,709 [myid:] - INFO  [main:SyncRequestProcessor@191] - Shutting down
    [junit] 2014-12-16 21:17:37,709 [myid:] - INFO  [ProcessThread(sid:0 cport:11221)::PrepRequestProcessor@155] - PrepRequestProcessor exited loop!
    [junit] 2014-12-16 21:17:37,710 [myid:] - INFO  [SyncThread:0:SyncRequestProcessor@169] - SyncRequestProcessor exited!
    [junit] 2014-12-16 21:17:37,710 [myid:] - INFO  [main:FinalRequestProcessor@476] - shutdown of request processor complete
    [junit] 2014-12-16 21:17:37,711 [myid:] - INFO  [main:MBeanRegistry@119] - Unregister MBean [org.apache.ZooKeeperService:name0=StandaloneServer_port11221,name1=InMemoryDataTree]
    [junit] 2014-12-16 21:17:37,711 [myid:] - INFO  [main:MBeanRegistry@119] - Unregister MBean [org.apache.ZooKeeperService:name0=StandaloneServer_port11221]
    [junit] 2014-12-16 21:17:37,711 [myid:] - INFO  [main:FourLetterWordMain@43] - connecting to 127.0.0.1 11221
    [junit] 2014-12-16 21:17:37,712 [myid:] - INFO  [main:JMXEnv@142] - ensureOnly:[]
    [junit] 2014-12-16 21:17:37,716 [myid:] - INFO  [main:ClientBase@545] - fdcount after test is: 46 at start it was 34
    [junit] 2014-12-16 21:17:37,716 [myid:] - INFO  [main:ClientBase@547] - sleeping for 20 secs
    [junit] 2014-12-16 21:17:37,718 [myid:] - INFO  [main:ZKTestCase$1@65] - SUCCEEDED testQuota
    [junit] 2014-12-16 21:17:37,718 [myid:] - INFO  [main:ZKTestCase$1@60] - FINISHED testQuota
    [junit] Tests run: 1, Failures: 0, Errors: 0, Skipped: 0, Time elapsed: 0.657 sec

BUILD FAILED
/home/jenkins/jenkins-slave/workspace/ZooKeeper-trunk/trunk/build.xml:1422: The following error occurred while executing this line:
/home/jenkins/jenkins-slave/workspace/ZooKeeper-trunk/trunk/build.xml:1333: Tests failed!

Total time: 38 minutes 5 seconds
Build step 'Execute shell' marked build as failure
[FINDBUGS] Skipping publisher since build result is FAILURE
[WARNINGS] Skipping publisher since build result is FAILURE
Archiving artifacts
Sending artifact delta relative to ZooKeeper-trunk #2531
Archived 3 artifacts
Archive block size is 32768
Received 0 blocks and 17925104 bytes
Compression is 0.0%
Took 4.8 sec
Recording fingerprints
Recording test results
Publishing Javadoc
Email was triggered for: Failure
Sending email for trigger: Failure



###################################################################################
############################## FAILED TESTS (if any) ##############################
1 tests failed.
REGRESSION:  org.apache.zookeeper.test.ReconfigTest.testPortChange

Error Message:
expected:<test[1]> but was:<test[0]>

Stack Trace:
junit.framework.AssertionFailedError: expected:<test[1]> but was:<test[0]>
	at org.apache.zookeeper.test.ReconfigTest.testNormalOperation(ReconfigTest.java:151)
	at org.apache.zookeeper.test.ReconfigTest.testPortChange(ReconfigTest.java:600)
	at org.apache.zookeeper.JUnit4ZKTestRunner$LoggedInvokeMethod.evaluate(JUnit4ZKTestRunner.java:52)