You are viewing a plain text version of this content. The canonical link for it is here.
Posted to dev@nuttx.apache.org by Apache Jenkins Server <je...@builds.apache.org> on 2020/04/25 06:12:01 UTC

Build failed in Jenkins: NuttX-Nightly-Build #106

See <https://builds.apache.org/job/NuttX-Nightly-Build/106/display/redirect>

Changes:


------------------------------------------
[...truncated 4.52 MB...]
	sched/pthread_setaffinity.d
	sched/pthread_setschedparam.d
	sched/pthread_setschedprio.d
	sched/pthread_setspecific.d
	sched/pthread_sigmask.d
	sched/sched_addblocked.d
	sched/sched_addprioritized.d
	sched/sched_addreadytorun.d
	sched/sched_cpupause.d
	sched/sched_cpuselect.d
	sched/sched_foreach.d
	sched/sched_getaffinity.d
	sched/sched_getcpu.d
	sched/sched_getfiles.d
	sched/sched_getparam.d
	sched/sched_getscheduler.d
	sched/sched_getsockets.d
	sched/sched_getstreams.d
	sched/sched_gettcb.d
	sched/sched_idletask.d
	sched/sched_lock.d
	sched/sched_lockcount.d
	sched/sched_mergepending.d
	sched/sched_mergeprioritized.d
	sched/sched_note.d
	sched/sched_processtimer.d
	sched/sched_releasetcb.d
	sched/sched_removeblocked.d
	sched/sched_removereadytorun.d
	sched/sched_resumescheduler.d
	sched/sched_roundrobin.d
	sched/sched_rrgetinterval.d
	sched/sched_self.d
	sched/sched_setaffinity.d
	sched/sched_setparam.d
	sched/sched_setpriority.d
	sched/sched_setscheduler.d
	sched/sched_suspendscheduler.d
	sched/sched_tasklistlock.d
	sched/sched_thistask.d
	sched/sched_unlock.d
	sched/sched_verifytcb.d
	sched/sched_waitpid.d
	sched/sched_yield.d
	sched/sem_destroy.d
	sched/sem_post.d
	sched/sem_recover.d
	sched/sem_reset.d
	sched/sem_tickwait.d
	sched/sem_timedwait.d
	sched/sem_timeout.d
	sched/sem_trywait.d
	sched/sem_wait.d
	sched/sem_waitirq.d
	sched/sig_action.d
	sched/sig_allocpendingsigaction.d
	sched/sig_cleanup.d
	sched/sig_deliver.d
	sched/sig_dispatch.d
	sched/sig_findaction.d
	sched/sig_initialize.d
	sched/sig_kill.d
	sched/sig_lowest.d
	sched/sig_nanosleep.d
	sched/sig_notification.d
	sched/sig_pause.d
	sched/sig_pending.d
	sched/sig_ppoll.d
	sched/sig_procmask.d
	sched/sig_pselect.d
	sched/sig_queue.d
	sched/sig_releasependingsigaction.d
	sched/sig_releasependingsignal.d
	sched/sig_removependingsignal.d
	sched/sig_sleep.d
	sched/sig_suspend.d
	sched/sig_timedwait.d
	sched/sig_unmaskpendingsignal.d
	sched/sig_usleep.d
	sched/sig_waitinfo.d
	sched/spinlock.d
	sched/task_activate.d
	sched/task_create.d
	sched/task_delete.d
	sched/task_exit.d
	sched/task_exithook.d
	sched/task_getgroup.d
	sched/task_getpid.d
	sched/task_init.d
	sched/task_prctl.d
	sched/task_recover.d
	sched/task_restart.d
	sched/task_setcancelstate.d
	sched/task_setup.d
	sched/task_spawn.d
	sched/task_spawnparms.d
	sched/task_start.d
	sched/task_terminate.d
	sched/timer_create.d
	sched/timer_delete.d
	sched/timer_getitimer.d
	sched/timer_getoverrun.d
	sched/timer_gettime.d
	sched/timer_initialize.d
	sched/timer_release.d
	sched/timer_setitimer.d
	sched/timer_settime.d
	sched/wd_cancel.d
	sched/wd_create.d
	sched/wd_delete.d
	sched/wd_gettime.d
	sched/wd_initialize.d
	sched/wd_recover.d
	sched/wd_start.d
	tools/pic32/mkpichex
	uImage

nothing to commit, working tree clean
On branch master
Your branch is up to date with 'origin/master'.

Ignored files:
  (use "git add -f <file>..." to include in what will be committed)

	builtin/builtin_list.d
	builtin/builtin_list.home.jenkins.jenkins-slave.workspace.NuttX-Nightly-Build.apps.builtin.d
	builtin/exec_builtin.d
	builtin/exec_builtin.home.jenkins.jenkins-slave.workspace.NuttX-Nightly-Build.apps.builtin.d
	examples/hello/hello_main.d
	examples/hello/hello_main.home.jenkins.jenkins-slave.workspace.NuttX-Nightly-Build.apps.examples.hello.d
	examples/romfs/testdir/
	examples/unionfs/romfs_atestdir.h
	examples/unionfs/romfs_btestdir.h
	nshlib/nsh_builtin.d
	nshlib/nsh_builtin.home.jenkins.jenkins-slave.workspace.NuttX-Nightly-Build.apps.nshlib.d
	nshlib/nsh_command.d
	nshlib/nsh_command.home.jenkins.jenkins-slave.workspace.NuttX-Nightly-Build.apps.nshlib.d
	nshlib/nsh_console.d
	nshlib/nsh_console.home.jenkins.jenkins-slave.workspace.NuttX-Nightly-Build.apps.nshlib.d
	nshlib/nsh_consolemain.d
	nshlib/nsh_consolemain.home.jenkins.jenkins-slave.workspace.NuttX-Nightly-Build.apps.nshlib.d
	nshlib/nsh_dbgcmds.d
	nshlib/nsh_dbgcmds.home.jenkins.jenkins-slave.workspace.NuttX-Nightly-Build.apps.nshlib.d
	nshlib/nsh_ddcmd.d
	nshlib/nsh_ddcmd.home.jenkins.jenkins-slave.workspace.NuttX-Nightly-Build.apps.nshlib.d
	nshlib/nsh_envcmds.d
	nshlib/nsh_envcmds.home.jenkins.jenkins-slave.workspace.NuttX-Nightly-Build.apps.nshlib.d
	nshlib/nsh_fscmds.d
	nshlib/nsh_fscmds.home.jenkins.jenkins-slave.workspace.NuttX-Nightly-Build.apps.nshlib.d
	nshlib/nsh_fsutils.d
	nshlib/nsh_fsutils.home.jenkins.jenkins-slave.workspace.NuttX-Nightly-Build.apps.nshlib.d
	nshlib/nsh_init.d
	nshlib/nsh_init.home.jenkins.jenkins-slave.workspace.NuttX-Nightly-Build.apps.nshlib.d
	nshlib/nsh_mmcmds.d
	nshlib/nsh_mmcmds.home.jenkins.jenkins-slave.workspace.NuttX-Nightly-Build.apps.nshlib.d
	nshlib/nsh_mntcmds.d
	nshlib/nsh_mntcmds.home.jenkins.jenkins-slave.workspace.NuttX-Nightly-Build.apps.nshlib.d
	nshlib/nsh_parse.d
	nshlib/nsh_parse.home.jenkins.jenkins-slave.workspace.NuttX-Nightly-Build.apps.nshlib.d
	nshlib/nsh_proccmds.d
	nshlib/nsh_proccmds.home.jenkins.jenkins-slave.workspace.NuttX-Nightly-Build.apps.nshlib.d
	nshlib/nsh_script.d
	nshlib/nsh_script.home.jenkins.jenkins-slave.workspace.NuttX-Nightly-Build.apps.nshlib.d
	nshlib/nsh_session.d
	nshlib/nsh_session.home.jenkins.jenkins-slave.workspace.NuttX-Nightly-Build.apps.nshlib.d
	nshlib/nsh_syscmds.d
	nshlib/nsh_syscmds.home.jenkins.jenkins-slave.workspace.NuttX-Nightly-Build.apps.nshlib.d
	nshlib/nsh_system.d
	nshlib/nsh_system.home.jenkins.jenkins-slave.workspace.NuttX-Nightly-Build.apps.nshlib.d
	nshlib/nsh_test.d
	nshlib/nsh_test.home.jenkins.jenkins-slave.workspace.NuttX-Nightly-Build.apps.nshlib.d
	nshlib/nsh_timcmds.d
	nshlib/nsh_timcmds.home.jenkins.jenkins-slave.workspace.NuttX-Nightly-Build.apps.nshlib.d
	platform/dummy.d
	platform/dummy.home.jenkins.jenkins-slave.workspace.NuttX-Nightly-Build.apps.platform.d
	platform/gnu_cxxinitialize.d
	platform/gnu_cxxinitialize.home.jenkins.jenkins-slave.workspace.NuttX-Nightly-Build.apps.platform.d
	system/nsh/nsh_main.d
	system/nsh/nsh_main.home.jenkins.jenkins-slave.workspace.NuttX-Nightly-Build.apps.system.nsh.d
	system/nsh/sh_main.d
	system/nsh/sh_main.home.jenkins.jenkins-slave.workspace.NuttX-Nightly-Build.apps.system.nsh.d
	system/readline/readline.d
	system/readline/readline.home.jenkins.jenkins-slave.workspace.NuttX-Nightly-Build.apps.system.readline.d
	system/readline/readline_common.d
	system/readline/readline_common.home.jenkins.jenkins-slave.workspace.NuttX-Nightly-Build.apps.system.readline.d
	system/system/system.d
	system/system/system.home.jenkins.jenkins-slave.workspace.NuttX-Nightly-Build.apps.system.system.d
	system/taskset/taskset.d
	system/taskset/taskset.home.jenkins.jenkins-slave.workspace.NuttX-Nightly-Build.apps.system.taskset.d
	testing/ostest/barrier.d
	testing/ostest/barrier.home.jenkins.jenkins-slave.workspace.NuttX-Nightly-Build.apps.testing.ostest.d
	testing/ostest/cancel.d
	testing/ostest/cancel.home.jenkins.jenkins-slave.workspace.NuttX-Nightly-Build.apps.testing.ostest.d
	testing/ostest/cond.d
	testing/ostest/cond.home.jenkins.jenkins-slave.workspace.NuttX-Nightly-Build.apps.testing.ostest.d
	testing/ostest/dev_null.d
	testing/ostest/dev_null.home.jenkins.jenkins-slave.workspace.NuttX-Nightly-Build.apps.testing.ostest.d
	testing/ostest/mqueue.d
	testing/ostest/mqueue.home.jenkins.jenkins-slave.workspace.NuttX-Nightly-Build.apps.testing.ostest.d
	testing/ostest/mutex.d
	testing/ostest/mutex.home.jenkins.jenkins-slave.workspace.NuttX-Nightly-Build.apps.testing.ostest.d
	testing/ostest/ostest_main.d
	testing/ostest/ostest_main.home.jenkins.jenkins-slave.workspace.NuttX-Nightly-Build.apps.testing.ostest.d
	testing/ostest/posixtimer.d
	testing/ostest/posixtimer.home.jenkins.jenkins-slave.workspace.NuttX-Nightly-Build.apps.testing.ostest.d
	testing/ostest/pthread_rwlock.d
	testing/ostest/pthread_rwlock.home.jenkins.jenkins-slave.workspace.NuttX-Nightly-Build.apps.testing.ostest.d
	testing/ostest/pthread_rwlock_cancel.d
	testing/ostest/pthread_rwlock_cancel.home.jenkins.jenkins-slave.workspace.NuttX-Nightly-Build.apps.testing.ostest.d
	testing/ostest/restart.d
	testing/ostest/restart.home.jenkins.jenkins-slave.workspace.NuttX-Nightly-Build.apps.testing.ostest.d
	testing/ostest/robust.d
	testing/ostest/robust.home.jenkins.jenkins-slave.workspace.NuttX-Nightly-Build.apps.testing.ostest.d
	testing/ostest/roundrobin.d
	testing/ostest/roundrobin.home.jenkins.jenkins-slave.workspace.NuttX-Nightly-Build.apps.testing.ostest.d
	testing/ostest/sem.d
	testing/ostest/sem.home.jenkins.jenkins-slave.workspace.NuttX-Nightly-Build.apps.testing.ostest.d
	testing/ostest/semtimed.d
	testing/ostest/semtimed.home.jenkins.jenkins-slave.workspace.NuttX-Nightly-Build.apps.testing.ostest.d
	testing/ostest/setvbuf.d
	testing/ostest/setvbuf.home.jenkins.jenkins-slave.workspace.NuttX-Nightly-Build.apps.testing.ostest.d
	testing/ostest/sighand.d
	testing/ostest/sighand.home.jenkins.jenkins-slave.workspace.NuttX-Nightly-Build.apps.testing.ostest.d
	testing/ostest/signest.d
	testing/ostest/signest.home.jenkins.jenkins-slave.workspace.NuttX-Nightly-Build.apps.testing.ostest.d
	testing/ostest/sigprocmask.d
	testing/ostest/sigprocmask.home.jenkins.jenkins-slave.workspace.NuttX-Nightly-Build.apps.testing.ostest.d
	testing/ostest/specific.d
	testing/ostest/specific.home.jenkins.jenkins-slave.workspace.NuttX-Nightly-Build.apps.testing.ostest.d
	testing/ostest/timedmqueue.d
	testing/ostest/timedmqueue.home.jenkins.jenkins-slave.workspace.NuttX-Nightly-Build.apps.testing.ostest.d
	testing/ostest/timedmutex.d
	testing/ostest/timedmutex.home.jenkins.jenkins-slave.workspace.NuttX-Nightly-Build.apps.testing.ostest.d
	testing/ostest/timedwait.d
	testing/ostest/timedwait.home.jenkins.jenkins-slave.workspace.NuttX-Nightly-Build.apps.testing.ostest.d
	testing/ostest/waitpid.d
	testing/ostest/waitpid.home.jenkins.jenkins-slave.workspace.NuttX-Nightly-Build.apps.testing.ostest.d
	testing/smp/smp_main.d
	testing/smp/smp_main.home.jenkins.jenkins-slave.workspace.NuttX-Nightly-Build.apps.testing.smp.d

nothing to commit, working tree clean
  Configuring...
  Copy files
  Select CONFIG_HOST_LINUX=y
  Refreshing...
  Building NuttX...
  Normalize esp32-core/ostest
====================================================================================
Build step 'Execute shell' marked build as failure

Build failed in Jenkins: NuttX-Nightly-Build #124

Posted by Apache Jenkins Server <je...@builds.apache.org>.
See <https://builds.apache.org/job/NuttX-Nightly-Build/124/display/redirect>

Changes:


------------------------------------------
Started by user btashton
Running as SYSTEM
[EnvInject] - Loading node environment variables.
Building remotely on H27 (ubuntu) in workspace <https://builds.apache.org/job/NuttX-Nightly-Build/ws/>
Pull Docker image docker.pkg.github.com/apache/incubator-nuttx-testing/nuttx-ci-linux:latest from repository ...
$ docker pull docker.pkg.github.com/apache/incubator-nuttx-testing/nuttx-ci-linux:latest
Failed to pull Docker image docker.pkg.github.com/apache/incubator-nuttx-testing/nuttx-ci-linux:latest
FATAL: Failed to pull Docker image docker.pkg.github.com/apache/incubator-nuttx-testing/nuttx-ci-linux:latest
java.io.IOException: Failed to pull Docker image docker.pkg.github.com/apache/incubator-nuttx-testing/nuttx-ci-linux:latest
	at com.cloudbees.jenkins.plugins.docker_build_env.PullDockerImageSelector.prepareDockerImage(PullDockerImageSelector.java:34)
	at com.cloudbees.jenkins.plugins.docker_build_env.DockerBuildWrapper.setUp(DockerBuildWrapper.java:179)
	at hudson.model.Build$BuildExecution.doRun(Build.java:157)
	at hudson.model.AbstractBuild$AbstractBuildExecution.run(AbstractBuild.java:504)
	at hudson.model.Run.execute(Run.java:1815)
	at hudson.model.FreeStyleBuild.run(FreeStyleBuild.java:43)
	at hudson.model.ResourceController.execute(ResourceController.java:97)
	at hudson.model.Executor.run(Executor.java:429)

Build failed in Jenkins: NuttX-Nightly-Build #123

Posted by Apache Jenkins Server <je...@builds.apache.org>.
See <https://builds.apache.org/job/NuttX-Nightly-Build/123/display/redirect>

Changes:


------------------------------------------
Started by timer
Started by user btashton
Rebuilds build #122
Running as SYSTEM
[EnvInject] - Loading node environment variables.
Building remotely on H27 (ubuntu) in workspace <https://builds.apache.org/job/NuttX-Nightly-Build/ws/>
Pull Docker image docker.pkg.github.com/apache/incubator-nuttx-testing/nuttx-ci-linux:latest from repository ...
$ docker -H " https://docker.pkg.github.com" pull docker.pkg.github.com/apache/incubator-nuttx-testing/nuttx-ci-linux:latest
Failed to pull Docker image docker.pkg.github.com/apache/incubator-nuttx-testing/nuttx-ci-linux:latest
FATAL: Failed to pull Docker image docker.pkg.github.com/apache/incubator-nuttx-testing/nuttx-ci-linux:latest
java.io.IOException: Failed to pull Docker image docker.pkg.github.com/apache/incubator-nuttx-testing/nuttx-ci-linux:latest
	at com.cloudbees.jenkins.plugins.docker_build_env.PullDockerImageSelector.prepareDockerImage(PullDockerImageSelector.java:34)
	at com.cloudbees.jenkins.plugins.docker_build_env.DockerBuildWrapper.setUp(DockerBuildWrapper.java:179)
	at hudson.model.Build$BuildExecution.doRun(Build.java:157)
	at hudson.model.AbstractBuild$AbstractBuildExecution.run(AbstractBuild.java:504)
	at hudson.model.Run.execute(Run.java:1815)
	at hudson.model.FreeStyleBuild.run(FreeStyleBuild.java:43)
	at hudson.model.ResourceController.execute(ResourceController.java:97)
	at hudson.model.Executor.run(Executor.java:429)

Build failed in Jenkins: NuttX-Nightly-Build #122

Posted by Apache Jenkins Server <je...@builds.apache.org>.
See <https://builds.apache.org/job/NuttX-Nightly-Build/122/display/redirect>

Changes:


------------------------------------------
Started by timer
Running as SYSTEM
[EnvInject] - Loading node environment variables.
Building remotely on H27 (ubuntu) in workspace <https://builds.apache.org/job/NuttX-Nightly-Build/ws/>
[NuttX-Nightly-Build] $ /bin/bash -xe /tmp/jenkins3389641105628844578.sh
+ '[' -d testing ']'
+ rm -rf testing
+ '[' -d nuttx ']'
+ '[' -d apps ']'
+ git clone https://github.com/apache/incubator-nuttx-testing testing
Cloning into 'testing'...
+ cd testing
+ ./cibuild.sh -i -s ./testlist/all.dat
~/jenkins-slave/workspace/NuttX-Nightly-Build/testing ~/jenkins-slave/workspace/NuttX-Nightly-Build/testing
arm-none-eabi-gcc (GNU Tools for Arm Embedded Processors 9-2019-q4-major) 9.2.1 20191025 (release) [ARM/arm-9-branch revision 277599]
Copyright (C) 2019 Free Software Foundation, Inc.
This is free software; see the source for copying conditions.  There is NO
warranty; not even for MERCHANTABILITY or FITNESS FOR A PARTICULAR PURPOSE.

p32-gcc (GCC) 4.9.2
Copyright (C) 2014 Free Software Foundation, Inc.
This is free software; see the source for copying conditions.  There is NO
warranty; not even for MERCHANTABILITY or FITNESS FOR A PARTICULAR PURPOSE.

riscv64-unknown-elf-gcc (SiFive GCC 8.3.0-2019.08.0) 8.3.0
Copyright (C) 2018 Free Software Foundation, Inc.
This is free software; see the source for copying conditions.  There is NO
warranty; not even for MERCHANTABILITY or FITNESS FOR A PARTICULAR PURPOSE.

xtensa-esp32-elf-gcc (crosstool-NG esp32-2019r1-rc2) 8.2.0
Copyright (C) 2018 Free Software Foundation, Inc.
This is free software; see the source for copying conditions.  There is NO
warranty; not even for MERCHANTABILITY or FITNESS FOR A PARTICULAR PURPOSE.

./cibuild.sh: line 214: pip3: command not found
Build step 'Execute shell' marked build as failure

Build failed in Jenkins: NuttX-Nightly-Build #121

Posted by Apache Jenkins Server <je...@builds.apache.org>.
See <https://builds.apache.org/job/NuttX-Nightly-Build/121/display/redirect>

Changes:


------------------------------------------
Started by timer
Running as SYSTEM
[EnvInject] - Loading node environment variables.
Building remotely on H27 (ubuntu) in workspace <https://builds.apache.org/job/NuttX-Nightly-Build/ws/>
[NuttX-Nightly-Build] $ /bin/bash -xe /tmp/jenkins4504112303803909551.sh
+ '[' -d testing ']'
+ rm -rf testing
+ '[' -d nuttx ']'
+ '[' -d apps ']'
+ git clone https://github.com/apache/incubator-nuttx-testing testing
Cloning into 'testing'...
+ cd testing
+ ./cibuild.sh -i -s ./testlist/all.dat
~/jenkins-slave/workspace/NuttX-Nightly-Build/testing ~/jenkins-slave/workspace/NuttX-Nightly-Build/testing
arm-none-eabi-gcc (GNU Tools for Arm Embedded Processors 9-2019-q4-major) 9.2.1 20191025 (release) [ARM/arm-9-branch revision 277599]
Copyright (C) 2019 Free Software Foundation, Inc.
This is free software; see the source for copying conditions.  There is NO
warranty; not even for MERCHANTABILITY or FITNESS FOR A PARTICULAR PURPOSE.

p32-gcc (GCC) 4.9.2
Copyright (C) 2014 Free Software Foundation, Inc.
This is free software; see the source for copying conditions.  There is NO
warranty; not even for MERCHANTABILITY or FITNESS FOR A PARTICULAR PURPOSE.

riscv64-unknown-elf-gcc (SiFive GCC 8.3.0-2019.08.0) 8.3.0
Copyright (C) 2018 Free Software Foundation, Inc.
This is free software; see the source for copying conditions.  There is NO
warranty; not even for MERCHANTABILITY or FITNESS FOR A PARTICULAR PURPOSE.

xtensa-esp32-elf-gcc (crosstool-NG esp32-2019r1-rc2) 8.2.0
Copyright (C) 2018 Free Software Foundation, Inc.
This is free software; see the source for copying conditions.  There is NO
warranty; not even for MERCHANTABILITY or FITNESS FOR A PARTICULAR PURPOSE.

./cibuild.sh: line 214: pip3: command not found
Build step 'Execute shell' marked build as failure

Build failed in Jenkins: NuttX-Nightly-Build #120

Posted by Apache Jenkins Server <je...@builds.apache.org>.
See <https://builds.apache.org/job/NuttX-Nightly-Build/120/display/redirect>

Changes:


------------------------------------------
Started by timer
Running as SYSTEM
[EnvInject] - Loading node environment variables.
Building remotely on H27 (ubuntu) in workspace <https://builds.apache.org/job/NuttX-Nightly-Build/ws/>
[NuttX-Nightly-Build] $ /bin/bash -xe /tmp/jenkins6820874902526054546.sh
+ '[' -d testing ']'
+ rm -rf testing
+ '[' -d nuttx ']'
+ '[' -d apps ']'
+ git clone https://github.com/apache/incubator-nuttx-testing testing
Cloning into 'testing'...
+ cd testing
+ ./cibuild.sh -i -s ./testlist/all.dat
~/jenkins-slave/workspace/NuttX-Nightly-Build/testing ~/jenkins-slave/workspace/NuttX-Nightly-Build/testing
arm-none-eabi-gcc (GNU Tools for Arm Embedded Processors 9-2019-q4-major) 9.2.1 20191025 (release) [ARM/arm-9-branch revision 277599]
Copyright (C) 2019 Free Software Foundation, Inc.
This is free software; see the source for copying conditions.  There is NO
warranty; not even for MERCHANTABILITY or FITNESS FOR A PARTICULAR PURPOSE.

p32-gcc (GCC) 4.9.2
Copyright (C) 2014 Free Software Foundation, Inc.
This is free software; see the source for copying conditions.  There is NO
warranty; not even for MERCHANTABILITY or FITNESS FOR A PARTICULAR PURPOSE.

riscv64-unknown-elf-gcc (SiFive GCC 8.3.0-2019.08.0) 8.3.0
Copyright (C) 2018 Free Software Foundation, Inc.
This is free software; see the source for copying conditions.  There is NO
warranty; not even for MERCHANTABILITY or FITNESS FOR A PARTICULAR PURPOSE.

xtensa-esp32-elf-gcc (crosstool-NG esp32-2019r1-rc2) 8.2.0
Copyright (C) 2018 Free Software Foundation, Inc.
This is free software; see the source for copying conditions.  There is NO
warranty; not even for MERCHANTABILITY or FITNESS FOR A PARTICULAR PURPOSE.

./cibuild.sh: line 214: pip3: command not found
Build step 'Execute shell' marked build as failure

Re: RE: Hi,anybody build nuttx that use openamp on board STM32H747I-disco

Posted by Xiang Xiao <xi...@gmail.com>.
On Sat, May 9, 2020 at 10:47 AM steelen@163.com <st...@163.com> wrote:
>
> Thanks a lot
> I make it work
>
> But there is some other bugs
> First
> in file
> /incubator-nuttx/include/metal/cpu.h
> line 15    # include <metal/processor//cpu.h>  should be  # include <metal/processor/cpu.h>
>
> Second
> There is no  "processor " directory under  /incubator-nuttx/include/metal
> I don't understand the rules  of makefile ,I just copy the directory  from /incubator-nuttx/openamp/libmetal/lib/processor    under  /incubator-nuttx/include/metal
> and copy cpu.h and atomic.h  from   /incubator-nuttx/openamp/libmetal/lib/processor/arm  to    /incubator-nuttx/openamp/libmetal/lib/processor and it works.
> Perhaps this is a stupid way to do so ,forgive me .
>
> I examiming the code ,perhaps make a link is the right way.

We can't use the link here directly, because the header files need do
some process to remove the special marker, like @PROJECT_SYSTEM@:
/*
 * Copyright (c) 2015, Xilinx Inc. and Contributors. All rights reserved.
 *
 * SPDX-License-Identifier: BSD-3-Clause
 */

/*
 * @file mutex.h
 * @brief Mutex primitives for libmetal.
 */

#ifndef __METAL_MUTEX__H__
#define __METAL_MUTEX__H__

#ifdef __cplusplus
extern "C" {
#endif

/** \defgroup mutex Mutex Interfaces
 *  @{
 */

The snippet in openamp/libmetal.defs use sed to replace these mark
with the real value:
#include <metal/system/@PROJECT_SYSTEM@/mutex.h>


LIBMETAL_HDRS_SEDEXP := \
"s/@PROJECT_VER_MAJOR@/0/g; \
s/@PROJECT_VER_MINOR@/1/g; \
s/@PROJECT_VER_PATCH@/0/g; \
s/@PROJECT_VER@/0.1.0/g; \
s/@PROJECT_SYSTEM@/nuttx/g; \
s/@PROJECT_PROCESSOR@/$(LIBMETAL_ARCH)/g; \
s/@PROJECT_MACHINE@/$(CONFIG_ARCH_CHIP)/g; \
s/@PROJECT_SYSTEM_UPPER@/nuttx/g; \
s/@PROJECT_PROCESSOR_UPPER@/$(LIBMETAL_ARCH)/g; \
s/@PROJECT_MACHINE_UPPER@/$(CONFIG_ARCH_CHIP)/g; \
s/cmakedefine/undef/g"

libmetal.zip:
$(Q) wget https://github.com/OpenAMP/libmetal/archive/v$(VERSION).zip
-O libmetal.zip
$(Q) unzip -o libmetal.zip
$(Q) mv libmetal-$(VERSION) libmetal
$(Q) patch -p0 < 0001-nuttx-change-sched_kfree-to-metal_free_memory.patch

.libmetal_headers: libmetal.zip
$(eval headers := $(wildcard libmetal/lib/compiler/gcc/*.h))
$(eval headers += $(wildcard libmetal/lib/processor/$(LIBMETAL_ARCH)/*.h))
$(eval headers += $(wildcard libmetal/lib/system/nuttx/*.h))
$(eval headers += $(wildcard libmetal/lib/*.h))
$(foreach header,$(headers), \
$(eval hobj := $(patsubst
libmetal$(DELIM)lib$(DELIM)%,$(TOPDIR)$(DELIM)include$(DELIM)metal$(DELIM)%,$(header)))
\
$(shell if [ ! -d $(dir $(hobj)) ];then mkdir -p $(dir $(hobj)); fi) \
$(shell sed $(LIBMETAL_HDRS_SEDEXP) $(header) > $(hobj)) \

So you don't need do anything special action after apply my patch.
it's enough to run:
make distclean
./tools/configure.sh xxx:yyy
make

>
>
>
>
>
>
>
> steelen@163.com
>
> 发件人: Xiang Xiao
> 发送时间: 2020-05-08 17:21
> 收件人: dev@nuttx.apache.org
> 主题: RE: Hi,anybody build nuttx that use openamp on board STM32H747I-disco
> Please try this patch:
> https://github.com/apache/incubator-nuttx/pull/1003
> The openamp/libmetal.defs fail to handle arch other than x86-64 and risc-v correctly.
>
> Thanks
> Xiang
>
> -----Original Message-----
> From: steelen@163.com <st...@163.com>
> Sent: Friday, May 8, 2020 3:25 PM
> To: dev <de...@nuttx.apache.org>
> Subject: Hi,anybody build nuttx that use openamp on board STM32H747I-disco
>
> Hi
> Anybody build nuttx that use openamp on board stm32h747i-disco?
> I turn on the openamp opion ,but give errors like
>
> make[1]: Entering directory '/home/steelen/nuttx/nuttx/openamp'
> make[1]: *** No rule to make target 'libmetal/lib/system/nuttx/condition.c', needed by '.depend'.  Stop.
> make[1]: Leaving directory '/home/steelen/nuttx/nuttx/openamp'
> tools/Makefile.unix:504: recipe for target 'pass2dep' failed
> make: *** [pass2dep] Error 2
>
> I also download the incubator-nuttx version , when make it download a lot files and also erros
>
> make[1]: Entering directory '/home/steelen/nuttx/incubator-nuttx/openamp'
> In file included from /home/steelen/nuttx/incubator-nuttx/include/metal/io.h:23:0,
>                  from /home/steelen/nuttx/incubator-nuttx/include/metal/device.h:16,
>                  from ./libmetal/lib/system/nuttx/device.c:12:
> /home/steelen/nuttx/incubator-nuttx/include/metal/cpu.h:15:35: fatal error: metal/processor//cpu.h: No such file or directory  # include <metal/processor//cpu.h>
>                                    ^
> compilation terminated.
> ERROR: arm-none-eabi-gcc failed: 1
>        command: arm-none-eabi-gcc -M -fno-builtin -Wall -Wstrict-prototypes -Wshadow -Wundef -g -mcpu=cortex-m7 -mthumb -mfpu=fpv5-d16 -mfloat-abi=hard -I. -isystem /home/steelen/nuttx/incubator-nuttx/include -D__KERNEL__ -pipe -DMETAL_INTERNAL ./libmetal/lib/system/nuttx/device.c
> Makefile:72: recipe for target '.depend' failed
> make[1]: *** [.depend] Error 1
> make[1]: Leaving directory '/home/steelen/nuttx/incubator-nuttx/openamp'
> tools/Makefile.unix:498: recipe for target 'pass2dep' failed
> make: *** [pass2dep] Error 2
>
> I modify   # include <metal/processor//cpu.h>  to  # include <metal/processor/cpu.h>
> also  erros
>
>
>
>
>
> steelen@163.com

Re: Re: Hi,anybody build nuttx that use openamp on board STM32H747I-disco

Posted by "steelen@163.com" <st...@163.com>.
ok, I find a good way to solve the problem

modify 
/incubator-nuttx/include/metal/cpu.h
line 15    # include <metal/processor//cpu.h>  
to 
# include <openamp/libmetal/lib/cpu.h>




steelen@163.com
 
发件人: steelen@163.com
发送时间: 2020-05-09 10:47
收件人: dev
主题: Re: RE: Hi,anybody build nuttx that use openamp on board STM32H747I-disco
Thanks a lot
I make it work 
 
But there is some other bugs
First
in file 
/incubator-nuttx/include/metal/cpu.h 
line 15    # include <metal/processor//cpu.h>  should be  # include <metal/processor/cpu.h>
 
Second
There is no  "processor " directory under  /incubator-nuttx/include/metal 
I don't understand the rules  of makefile ,I just copy the directory  from /incubator-nuttx/openamp/libmetal/lib/processor    under  /incubator-nuttx/include/metal 
and copy cpu.h and atomic.h  from   /incubator-nuttx/openamp/libmetal/lib/processor/arm  to    /incubator-nuttx/openamp/libmetal/lib/processor and it works. 
Perhaps this is a stupid way to do so ,forgive me .
 
I examiming the code ,perhaps make a link is the right way.
 
 
 
 
 
 
 
steelen@163.com
发件人: Xiang Xiao
发送时间: 2020-05-08 17:21
收件人: dev@nuttx.apache.org
主题: RE: Hi,anybody build nuttx that use openamp on board STM32H747I-disco
Please try this patch:
https://github.com/apache/incubator-nuttx/pull/1003
The openamp/libmetal.defs fail to handle arch other than x86-64 and risc-v correctly.
Thanks
Xiang
-----Original Message-----
From: steelen@163.com <st...@163.com> 
Sent: Friday, May 8, 2020 3:25 PM
To: dev <de...@nuttx.apache.org>
Subject: Hi,anybody build nuttx that use openamp on board STM32H747I-disco
Hi
Anybody build nuttx that use openamp on board stm32h747i-disco?
I turn on the openamp opion ,but give errors like 
make[1]: Entering directory '/home/steelen/nuttx/nuttx/openamp'
make[1]: *** No rule to make target 'libmetal/lib/system/nuttx/condition.c', needed by '.depend'.  Stop.
make[1]: Leaving directory '/home/steelen/nuttx/nuttx/openamp'
tools/Makefile.unix:504: recipe for target 'pass2dep' failed
make: *** [pass2dep] Error 2
I also download the incubator-nuttx version , when make it download a lot files and also erros
make[1]: Entering directory '/home/steelen/nuttx/incubator-nuttx/openamp'
In file included from /home/steelen/nuttx/incubator-nuttx/include/metal/io.h:23:0,
                 from /home/steelen/nuttx/incubator-nuttx/include/metal/device.h:16,
                 from ./libmetal/lib/system/nuttx/device.c:12:
/home/steelen/nuttx/incubator-nuttx/include/metal/cpu.h:15:35: fatal error: metal/processor//cpu.h: No such file or directory  # include <metal/processor//cpu.h>
                                   ^
compilation terminated.
ERROR: arm-none-eabi-gcc failed: 1
       command: arm-none-eabi-gcc -M -fno-builtin -Wall -Wstrict-prototypes -Wshadow -Wundef -g -mcpu=cortex-m7 -mthumb -mfpu=fpv5-d16 -mfloat-abi=hard -I. -isystem /home/steelen/nuttx/incubator-nuttx/include -D__KERNEL__ -pipe -DMETAL_INTERNAL ./libmetal/lib/system/nuttx/device.c
Makefile:72: recipe for target '.depend' failed
make[1]: *** [.depend] Error 1
make[1]: Leaving directory '/home/steelen/nuttx/incubator-nuttx/openamp'
tools/Makefile.unix:498: recipe for target 'pass2dep' failed
make: *** [pass2dep] Error 2
I modify   # include <metal/processor//cpu.h>  to  # include <metal/processor/cpu.h>
also  erros 
steelen@163.com

Re: RE: Hi,anybody build nuttx that use openamp on board STM32H747I-disco

Posted by "steelen@163.com" <st...@163.com>.
Thanks a lot
I make it work 

But there is some other bugs
First
in file 
/incubator-nuttx/include/metal/cpu.h 
line 15    # include <metal/processor//cpu.h>  should be  # include <metal/processor/cpu.h>

Second
There is no  "processor " directory under  /incubator-nuttx/include/metal 
I don't understand the rules  of makefile ,I just copy the directory  from /incubator-nuttx/openamp/libmetal/lib/processor    under  /incubator-nuttx/include/metal 
and copy cpu.h and atomic.h  from   /incubator-nuttx/openamp/libmetal/lib/processor/arm  to    /incubator-nuttx/openamp/libmetal/lib/processor and it works. 
Perhaps this is a stupid way to do so ,forgive me .

I examiming the code ,perhaps make a link is the right way.







steelen@163.com
 
发件人: Xiang Xiao
发送时间: 2020-05-08 17:21
收件人: dev@nuttx.apache.org
主题: RE: Hi,anybody build nuttx that use openamp on board STM32H747I-disco
Please try this patch:
https://github.com/apache/incubator-nuttx/pull/1003
The openamp/libmetal.defs fail to handle arch other than x86-64 and risc-v correctly.
 
Thanks
Xiang
 
-----Original Message-----
From: steelen@163.com <st...@163.com> 
Sent: Friday, May 8, 2020 3:25 PM
To: dev <de...@nuttx.apache.org>
Subject: Hi,anybody build nuttx that use openamp on board STM32H747I-disco
 
Hi
Anybody build nuttx that use openamp on board stm32h747i-disco?
I turn on the openamp opion ,but give errors like 
 
make[1]: Entering directory '/home/steelen/nuttx/nuttx/openamp'
make[1]: *** No rule to make target 'libmetal/lib/system/nuttx/condition.c', needed by '.depend'.  Stop.
make[1]: Leaving directory '/home/steelen/nuttx/nuttx/openamp'
tools/Makefile.unix:504: recipe for target 'pass2dep' failed
make: *** [pass2dep] Error 2
 
I also download the incubator-nuttx version , when make it download a lot files and also erros
 
make[1]: Entering directory '/home/steelen/nuttx/incubator-nuttx/openamp'
In file included from /home/steelen/nuttx/incubator-nuttx/include/metal/io.h:23:0,
                 from /home/steelen/nuttx/incubator-nuttx/include/metal/device.h:16,
                 from ./libmetal/lib/system/nuttx/device.c:12:
/home/steelen/nuttx/incubator-nuttx/include/metal/cpu.h:15:35: fatal error: metal/processor//cpu.h: No such file or directory  # include <metal/processor//cpu.h>
                                   ^
compilation terminated.
ERROR: arm-none-eabi-gcc failed: 1
       command: arm-none-eabi-gcc -M -fno-builtin -Wall -Wstrict-prototypes -Wshadow -Wundef -g -mcpu=cortex-m7 -mthumb -mfpu=fpv5-d16 -mfloat-abi=hard -I. -isystem /home/steelen/nuttx/incubator-nuttx/include -D__KERNEL__ -pipe -DMETAL_INTERNAL ./libmetal/lib/system/nuttx/device.c
Makefile:72: recipe for target '.depend' failed
make[1]: *** [.depend] Error 1
make[1]: Leaving directory '/home/steelen/nuttx/incubator-nuttx/openamp'
tools/Makefile.unix:498: recipe for target 'pass2dep' failed
make: *** [pass2dep] Error 2
 
I modify   # include <metal/processor//cpu.h>  to  # include <metal/processor/cpu.h>
also  erros 
 
 
 
 
 
steelen@163.com

RE: Hi,anybody build nuttx that use openamp on board STM32H747I-disco

Posted by Xiang Xiao <xi...@gmail.com>.
Please try this patch:
https://github.com/apache/incubator-nuttx/pull/1003
The openamp/libmetal.defs fail to handle arch other than x86-64 and risc-v correctly.

Thanks
Xiang

-----Original Message-----
From: steelen@163.com <st...@163.com> 
Sent: Friday, May 8, 2020 3:25 PM
To: dev <de...@nuttx.apache.org>
Subject: Hi,anybody build nuttx that use openamp on board STM32H747I-disco

Hi
Anybody build nuttx that use openamp on board stm32h747i-disco?
I turn on the openamp opion ,but give errors like 

make[1]: Entering directory '/home/steelen/nuttx/nuttx/openamp'
make[1]: *** No rule to make target 'libmetal/lib/system/nuttx/condition.c', needed by '.depend'.  Stop.
make[1]: Leaving directory '/home/steelen/nuttx/nuttx/openamp'
tools/Makefile.unix:504: recipe for target 'pass2dep' failed
make: *** [pass2dep] Error 2

I also download the incubator-nuttx version , when make it download a lot files and also erros

make[1]: Entering directory '/home/steelen/nuttx/incubator-nuttx/openamp'
In file included from /home/steelen/nuttx/incubator-nuttx/include/metal/io.h:23:0,
                 from /home/steelen/nuttx/incubator-nuttx/include/metal/device.h:16,
                 from ./libmetal/lib/system/nuttx/device.c:12:
/home/steelen/nuttx/incubator-nuttx/include/metal/cpu.h:15:35: fatal error: metal/processor//cpu.h: No such file or directory  # include <metal/processor//cpu.h>
                                   ^
compilation terminated.
ERROR: arm-none-eabi-gcc failed: 1
       command: arm-none-eabi-gcc -M -fno-builtin -Wall -Wstrict-prototypes -Wshadow -Wundef -g -mcpu=cortex-m7 -mthumb -mfpu=fpv5-d16 -mfloat-abi=hard -I. -isystem /home/steelen/nuttx/incubator-nuttx/include -D__KERNEL__ -pipe -DMETAL_INTERNAL ./libmetal/lib/system/nuttx/device.c
Makefile:72: recipe for target '.depend' failed
make[1]: *** [.depend] Error 1
make[1]: Leaving directory '/home/steelen/nuttx/incubator-nuttx/openamp'
tools/Makefile.unix:498: recipe for target 'pass2dep' failed
make: *** [pass2dep] Error 2

I modify   # include <metal/processor//cpu.h>  to  # include <metal/processor/cpu.h>
also  erros 





steelen@163.com
 


Hi,anybody build nuttx that use openamp on board STM32H747I-disco

Posted by "steelen@163.com" <st...@163.com>.
Hi
Anybody build nuttx that use openamp on board stm32h747i-disco?
I turn on the openamp opion ,but give errors like 

make[1]: Entering directory '/home/steelen/nuttx/nuttx/openamp'
make[1]: *** No rule to make target 'libmetal/lib/system/nuttx/condition.c', needed by '.depend'.  Stop.
make[1]: Leaving directory '/home/steelen/nuttx/nuttx/openamp'
tools/Makefile.unix:504: recipe for target 'pass2dep' failed
make: *** [pass2dep] Error 2

I also download the incubator-nuttx version , when make it download a lot files 
and also erros

make[1]: Entering directory '/home/steelen/nuttx/incubator-nuttx/openamp'
In file included from /home/steelen/nuttx/incubator-nuttx/include/metal/io.h:23:0,
                 from /home/steelen/nuttx/incubator-nuttx/include/metal/device.h:16,
                 from ./libmetal/lib/system/nuttx/device.c:12:
/home/steelen/nuttx/incubator-nuttx/include/metal/cpu.h:15:35: fatal error: metal/processor//cpu.h: No such file or directory
 # include <metal/processor//cpu.h>
                                   ^
compilation terminated.
ERROR: arm-none-eabi-gcc failed: 1
       command: arm-none-eabi-gcc -M -fno-builtin -Wall -Wstrict-prototypes -Wshadow -Wundef -g -mcpu=cortex-m7 -mthumb -mfpu=fpv5-d16 -mfloat-abi=hard -I. -isystem /home/steelen/nuttx/incubator-nuttx/include -D__KERNEL__ -pipe -DMETAL_INTERNAL ./libmetal/lib/system/nuttx/device.c
Makefile:72: recipe for target '.depend' failed
make[1]: *** [.depend] Error 1
make[1]: Leaving directory '/home/steelen/nuttx/incubator-nuttx/openamp'
tools/Makefile.unix:498: recipe for target 'pass2dep' failed
make: *** [pass2dep] Error 2

I modify   # include <metal/processor//cpu.h>  to  # include <metal/processor/cpu.h>
also  erros 





steelen@163.com
 

Build failed in Jenkins: NuttX-Nightly-Build #119

Posted by Apache Jenkins Server <je...@builds.apache.org>.
See <https://builds.apache.org/job/NuttX-Nightly-Build/119/display/redirect>

Changes:


------------------------------------------
Started by timer
Running as SYSTEM
[EnvInject] - Loading node environment variables.
Building remotely on H27 (ubuntu) in workspace <https://builds.apache.org/job/NuttX-Nightly-Build/ws/>
[NuttX-Nightly-Build] $ /bin/bash -xe /tmp/jenkins2737426276634274783.sh
+ '[' -d testing ']'
+ rm -rf testing
+ '[' -d nuttx ']'
+ '[' -d apps ']'
+ git clone https://github.com/apache/incubator-nuttx-testing testing
Cloning into 'testing'...
+ cd testing
+ ./cibuild.sh -i -s ./testlist/all.dat
~/jenkins-slave/workspace/NuttX-Nightly-Build/testing ~/jenkins-slave/workspace/NuttX-Nightly-Build/testing
arm-none-eabi-gcc (GNU Tools for Arm Embedded Processors 9-2019-q4-major) 9.2.1 20191025 (release) [ARM/arm-9-branch revision 277599]
Copyright (C) 2019 Free Software Foundation, Inc.
This is free software; see the source for copying conditions.  There is NO
warranty; not even for MERCHANTABILITY or FITNESS FOR A PARTICULAR PURPOSE.

p32-gcc (GCC) 4.9.2
Copyright (C) 2014 Free Software Foundation, Inc.
This is free software; see the source for copying conditions.  There is NO
warranty; not even for MERCHANTABILITY or FITNESS FOR A PARTICULAR PURPOSE.

riscv64-unknown-elf-gcc (SiFive GCC 8.3.0-2019.08.0) 8.3.0
Copyright (C) 2018 Free Software Foundation, Inc.
This is free software; see the source for copying conditions.  There is NO
warranty; not even for MERCHANTABILITY or FITNESS FOR A PARTICULAR PURPOSE.

xtensa-esp32-elf-gcc (crosstool-NG esp32-2019r1-rc2) 8.2.0
Copyright (C) 2018 Free Software Foundation, Inc.
This is free software; see the source for copying conditions.  There is NO
warranty; not even for MERCHANTABILITY or FITNESS FOR A PARTICULAR PURPOSE.

./cibuild.sh: line 214: pip3: command not found
Build step 'Execute shell' marked build as failure

Build failed in Jenkins: NuttX-Nightly-Build #118

Posted by Apache Jenkins Server <je...@builds.apache.org>.
See <https://builds.apache.org/job/NuttX-Nightly-Build/118/display/redirect>

Changes:


------------------------------------------
Started by timer
Running as SYSTEM
[EnvInject] - Loading node environment variables.
Building remotely on H27 (ubuntu) in workspace <https://builds.apache.org/job/NuttX-Nightly-Build/ws/>
[NuttX-Nightly-Build] $ /bin/bash -xe /tmp/jenkins8702787645961715262.sh
+ '[' -d testing ']'
+ rm -rf testing
+ '[' -d nuttx ']'
+ '[' -d apps ']'
+ git clone https://github.com/apache/incubator-nuttx-testing testing
Cloning into 'testing'...
+ cd testing
+ ./cibuild.sh -i -s ./testlist/all.dat
~/jenkins-slave/workspace/NuttX-Nightly-Build/testing ~/jenkins-slave/workspace/NuttX-Nightly-Build/testing
arm-none-eabi-gcc (GNU Tools for Arm Embedded Processors 9-2019-q4-major) 9.2.1 20191025 (release) [ARM/arm-9-branch revision 277599]
Copyright (C) 2019 Free Software Foundation, Inc.
This is free software; see the source for copying conditions.  There is NO
warranty; not even for MERCHANTABILITY or FITNESS FOR A PARTICULAR PURPOSE.

p32-gcc (GCC) 4.9.2
Copyright (C) 2014 Free Software Foundation, Inc.
This is free software; see the source for copying conditions.  There is NO
warranty; not even for MERCHANTABILITY or FITNESS FOR A PARTICULAR PURPOSE.

riscv64-unknown-elf-gcc (SiFive GCC 8.3.0-2019.08.0) 8.3.0
Copyright (C) 2018 Free Software Foundation, Inc.
This is free software; see the source for copying conditions.  There is NO
warranty; not even for MERCHANTABILITY or FITNESS FOR A PARTICULAR PURPOSE.

xtensa-esp32-elf-gcc (crosstool-NG esp32-2019r1-rc2) 8.2.0
Copyright (C) 2018 Free Software Foundation, Inc.
This is free software; see the source for copying conditions.  There is NO
warranty; not even for MERCHANTABILITY or FITNESS FOR A PARTICULAR PURPOSE.

./cibuild.sh: line 214: pip3: command not found
Build step 'Execute shell' marked build as failure

Build failed in Jenkins: NuttX-Nightly-Build #117

Posted by Apache Jenkins Server <je...@builds.apache.org>.
See <https://builds.apache.org/job/NuttX-Nightly-Build/117/display/redirect>

Changes:


------------------------------------------
[...truncated 579.02 KB...]
 22450K .......... .......... .......... .......... .......... 65% 9.64M 3s
 22500K .......... .......... .......... .......... .......... 65% 10.6M 3s
 22550K .......... .......... .......... .......... .......... 65% 11.0M 3s
 22600K .......... .......... .......... .......... .......... 65% 6.57M 3s
 22650K .......... .......... .......... .......... .......... 66% 11.8M 3s
 22700K .......... .......... .......... .......... .......... 66% 11.5M 3s
 22750K .......... .......... .......... .......... .......... 66% 8.54M 3s
 22800K .......... .......... .......... .......... .......... 66% 10.6M 3s
 22850K .......... .......... .......... .......... .......... 66% 11.3M 3s
 22900K .......... .......... .......... .......... .......... 66% 11.1M 3s
 22950K .......... .......... .......... .......... .......... 66% 10.7M 3s
 23000K .......... .......... .......... .......... .......... 67% 11.4M 3s
 23050K .......... .......... .......... .......... .......... 67% 11.8M 3s
 23100K .......... .......... .......... .......... .......... 67%  599K 3s
 23150K .......... .......... .......... .......... .......... 67% 6.12M 3s
 23200K .......... .......... .......... .......... .......... 67% 8.58M 3s
 23250K .......... .......... .......... .......... .......... 67% 12.3M 3s
 23300K .......... .......... .......... .......... .......... 67% 10.8M 3s
 23350K .......... .......... .......... .......... .......... 68% 10.1M 3s
 23400K .......... .......... .......... .......... .......... 68% 11.2M 3s
 23450K .......... .......... .......... .......... .......... 68% 10.6M 3s
 23500K .......... .......... .......... .......... .......... 68% 7.13M 3s
 23550K .......... .......... .......... .......... .......... 68% 7.60M 3s
 23600K .......... .......... .......... .......... .......... 68% 11.8M 3s
 23650K .......... .......... .......... .......... .......... 68% 10.8M 3s
 23700K .......... .......... .......... .......... .......... 69% 11.2M 3s
 23750K .......... .......... .......... .......... .......... 69% 10.7M 2s
 23800K .......... .......... .......... .......... .......... 69% 12.0M 2s
 23850K .......... .......... .......... .......... .......... 69% 10.5M 2s
 23900K .......... .......... .......... .......... .......... 69% 10.9M 2s
 23950K .......... .......... .......... .......... .......... 69%  599K 2s
 24000K .......... .......... .......... .......... .......... 69% 9.23M 2s
 24050K .......... .......... .......... .......... .......... 70% 7.54M 2s
 24100K .......... .......... .......... .......... .......... 70% 8.51M 2s
 24150K .......... .......... .......... .......... .......... 70% 12.6M 2s
 24200K .......... .......... .......... .......... .......... 70% 11.0M 2s
 24250K .......... .......... .......... .......... .......... 70% 10.6M 2s
 24300K .......... .......... .......... .......... .......... 70% 11.6M 2s
 24350K .......... .......... .......... .......... .......... 71% 5.50M 2s
 24400K .......... .......... .......... .......... .......... 71% 11.0M 2s
 24450K .......... .......... .......... .......... .......... 71% 11.0M 2s
 24500K .......... .......... .......... .......... .......... 71% 11.2M 2s
 24550K .......... .......... .......... .......... .......... 71% 10.1M 2s
 24600K .......... .......... .......... .......... .......... 71% 11.8M 2s
 24650K .......... .......... .......... .......... .......... 71% 11.8M 2s
 24700K .......... .......... .......... .......... .......... 72% 11.0M 2s
 24750K .......... .......... .......... .......... .......... 72% 8.57M 2s
 24800K .......... .......... .......... .......... .......... 72% 10.2M 2s
 24850K .......... .......... .......... .......... .......... 72%  607K 2s
 24900K .......... .......... .......... .......... .......... 72% 7.38M 2s
 24950K .......... .......... .......... .......... .......... 72% 10.5M 2s
 25000K .......... .......... .......... .......... .......... 72% 8.61M 2s
 25050K .......... .......... .......... .......... .......... 73% 10.9M 2s
 25100K .......... .......... .......... .......... .......... 73% 11.2M 2s
 25150K .......... .......... .......... .......... .......... 73% 8.51M 2s
 25200K .......... .......... .......... .......... .......... 73% 12.0M 2s
 25250K .......... .......... .......... .......... .......... 73% 6.48M 2s
 25300K .......... .......... .......... .......... .......... 73% 12.3M 2s
 25350K .......... .......... .......... .......... .......... 73% 10.3M 2s
 25400K .......... .......... .......... .......... .......... 74% 10.2M 2s
 25450K .......... .......... .......... .......... .......... 74% 10.4M 2s
 25500K .......... .......... .......... .......... .......... 74% 12.0M 2s
 25550K .......... .......... .......... .......... .......... 74% 8.64M 2s
 25600K .......... .......... .......... .......... .......... 74% 10.7M 2s
 25650K .......... .......... .......... .......... .......... 74% 11.4M 2s
 25700K .......... .......... .......... .......... .......... 74% 11.1M 2s
 25750K .......... .......... .......... .......... .......... 75%  600K 2s
 25800K .......... .......... .......... .......... .......... 75% 8.76M 2s
 25850K .......... .......... .......... .......... .......... 75% 9.72M 2s
 25900K .......... .......... .......... .......... .......... 75% 9.51M 2s
 25950K .......... .......... .......... .......... .......... 75% 9.06M 2s
 26000K .......... .......... .......... .......... .......... 75% 10.3M 2s
 26050K .......... .......... .......... .......... .......... 75% 11.9M 2s
 26100K .......... .......... .......... .......... .......... 76% 11.0M 2s
 26150K .......... .......... .......... .......... .......... 76% 6.37M 2s
 26200K .......... .......... .......... .......... .......... 76% 11.2M 2s
 26250K .......... .......... .......... .......... .......... 76% 9.83M 2s
 26300K .......... .......... .......... .......... .......... 76% 10.3M 2s
 26350K .......... .......... .......... .......... .......... 76% 8.28M 2s
 26400K .......... .......... .......... .......... .......... 76% 11.7M 2s
 26450K .......... .......... .......... .......... .......... 77% 10.8M 2s
 26500K .......... .......... .......... .......... .......... 77% 10.2M 2s
 26550K .......... .......... .......... .......... .......... 77% 11.8M 2s
 26600K .......... .......... .......... .......... .......... 77% 12.0M 2s
 26650K .......... .......... .......... .......... .......... 77%  608K 2s
 26700K .......... .......... .......... .......... .......... 77% 8.35M 2s
 26750K .......... .......... .......... .......... .......... 78% 6.43M 2s
 26800K .......... .......... .......... .......... .......... 78% 11.5M 2s
 26850K .......... .......... .......... .......... .......... 78% 10.5M 2s
 26900K .......... .......... .......... .......... .......... 78% 12.0M 2s
 26950K .......... .......... .......... .......... .......... 78% 12.4M 2s
 27000K .......... .......... .......... .......... .......... 78% 9.95M 2s
 27050K .......... .......... .......... .......... .......... 78% 7.19M 2s
 27100K .......... .......... .......... .......... .......... 79% 10.5M 2s
 27150K .......... .......... .......... .......... .......... 79% 7.63M 2s
 27200K .......... .......... .......... .......... .......... 79% 10.7M 2s
 27250K .......... .......... .......... .......... .......... 79% 10.2M 2s
 27300K .......... .......... .......... .......... .......... 79% 11.8M 2s
 27350K .......... .......... .......... .......... .......... 79% 11.4M 2s
 27400K .......... .......... .......... .......... .......... 79% 10.5M 2s
 27450K .......... .......... .......... .......... .......... 80% 11.5M 2s
 27500K .......... .......... .......... .......... .......... 80% 1.20M 2s
 27550K .......... .......... .......... .......... .......... 80% 1019K 2s
 27600K .......... .......... .......... .......... .......... 80% 7.82M 2s
 27650K .......... .......... .......... .......... .......... 80% 10.6M 2s
 27700K .......... .......... .......... .......... .......... 80% 11.1M 2s
 27750K .......... .......... .......... .......... .......... 80% 11.0M 2s
 27800K .......... .......... .......... .......... .......... 81% 12.3M 2s
 27850K .......... .......... .......... .......... .......... 81% 10.7M 1s
 27900K .......... .......... .......... .......... .......... 81% 10.9M 1s
 27950K .......... .......... .......... .......... .......... 81% 6.07M 1s
 28000K .......... .......... .......... .......... .......... 81% 10.2M 1s
 28050K .......... .......... .......... .......... .......... 81% 10.7M 1s
 28100K .......... .......... .......... .......... .......... 81% 10.9M 1s
 28150K .......... .......... .......... .......... .......... 82% 10.5M 1s
 28200K .......... .......... .......... .......... .......... 82% 10.5M 1s
 28250K .......... .......... .......... .......... .......... 82% 11.1M 1s
 28300K .......... .......... .......... .......... .......... 82% 12.0M 1s
 28350K .......... .......... .......... .......... .......... 82% 8.23M 1s
 28400K .......... .......... .......... .......... .......... 82%  610K 1s
 28450K .......... .......... .......... .......... .......... 82% 7.42M 1s
 28500K .......... .......... .......... .......... .......... 83% 9.19M 1s
 28550K .......... .......... .......... .......... .......... 83% 9.78M 1s
 28600K .......... .......... .......... .......... .......... 83% 11.1M 1s
 28650K .......... .......... .......... .......... .......... 83% 11.4M 1s
 28700K .......... .......... .......... .......... .......... 83% 11.9M 1s
 28750K .......... .......... .......... .......... .......... 83% 8.42M 1s
 28800K .......... .......... .......... .......... .......... 83% 7.46M 1s
 28850K .......... .......... .......... .......... .......... 84% 11.2M 1s
 28900K .......... .......... .......... .......... .......... 84% 7.82M 1s
 28950K .......... .......... .......... .......... .......... 84% 9.94M 1s
 29000K .......... .......... .......... .......... .......... 84% 10.7M 1s
 29050K .......... .......... .......... .......... .......... 84% 12.6M 1s
 29100K .......... .......... .......... .......... .......... 84% 8.90M 1s
 29150K .......... .......... .......... .......... .......... 84% 7.44M 1s
 29200K .......... .......... .......... .......... .......... 85% 9.86M 1s
 29250K .......... .......... .......... .......... .......... 85% 10.3M 1s
 29300K .......... .......... .......... .......... .......... 85%  636K 1s
 29350K .......... .......... .......... .......... .......... 85% 8.42M 1s
 29400K .......... .......... .......... .......... .......... 85% 8.56M 1s
 29450K .......... .......... .......... .......... .......... 85% 10.3M 1s
 29500K .......... .......... .......... .......... .......... 86% 10.6M 1s
 29550K .......... .......... .......... .......... .......... 86% 8.41M 1s
 29600K .......... .......... .......... .......... .......... 86% 12.0M 1s
 29650K .......... .......... .......... .......... .......... 86% 10.3M 1s
 29700K .......... .......... .......... .......... .......... 86% 7.92M 1s
 29750K .......... .......... .......... .......... .......... 86% 10.1M 1s
 29800K .......... .......... .......... .......... .......... 86% 7.93M 1s
 29850K .......... .......... .......... .......... .......... 87% 11.0M 1s
 29900K .......... .......... .......... .......... .......... 87% 11.4M 1s
 29950K .......... .......... .......... .......... .......... 87% 8.13M 1s
 30000K .......... .......... .......... .......... .......... 87% 9.39M 1s
 30050K .......... .......... .......... .......... .......... 87% 9.99M 1s
 30100K .......... .......... .......... .......... .......... 87% 10.1M 1s
 30150K .......... .......... .......... .......... .......... 87% 9.75M 1s
 30200K .......... .......... .......... .......... .......... 88%  635K 1s
 30250K .......... .......... .......... .......... .......... 88% 9.10M 1s
 30300K .......... .......... .......... .......... .......... 88% 8.46M 1s
 30350K .......... .......... .......... .......... .......... 88% 7.87M 1s
 30400K .......... .......... .......... .......... .......... 88% 10.1M 1s
 30450K .......... .......... .......... .......... .......... 88% 11.1M 1s
 30500K .......... .......... .......... .......... .......... 88% 12.2M 1s
 30550K .......... .......... .......... .......... .......... 89% 10.4M 1s
 30600K .......... .......... .......... .......... .......... 89% 7.54M 1s
 30650K .......... .......... .......... .......... .......... 89% 10.9M 1s
 30700K .......... .......... .......... .......... .......... 89% 8.49M 1s
 30750K .......... .......... .......... .......... .......... 89% 8.02M 1s
 30800K .......... .......... .......... .......... .......... 89% 10.5M 1s
 30850K .......... .......... .......... .......... .......... 89% 11.2M 1s
 30900K .......... .......... .......... .......... .......... 90% 9.40M 1s
 30950K .......... .......... .......... .......... .......... 90% 10.1M 1s
 31000K .......... .......... .......... .......... .......... 90% 10.3M 1s
 31050K .......... .......... .......... .......... .......... 90% 8.78M 1s
 31100K .......... .......... .......... .......... .......... 90%  639K 1s
 31150K .......... .......... .......... .......... .......... 90% 5.87M 1s
 31200K .......... .......... .......... .......... .......... 90% 10.1M 1s
 31250K .......... .......... .......... .......... .......... 91% 10.9M 1s
 31300K .......... .......... .......... .......... .......... 91% 10.2M 1s
 31350K .......... .......... .......... .......... .......... 91% 11.9M 1s
 31400K .......... .......... .......... .......... .......... 91% 10.5M 1s
 31450K .......... .......... .......... .......... .......... 91% 11.3M 1s
 31500K .......... .......... .......... .......... .......... 91% 7.76M 1s
 31550K .......... .......... .......... .......... .......... 91% 7.91M 1s
 31600K .......... .......... .......... .......... .......... 92% 9.10M 1s
 31650K .......... .......... .......... .......... .......... 92% 10.2M 1s
 31700K .......... .......... .......... .......... .......... 92% 10.4M 1s
 31750K .......... .......... .......... .......... .......... 92% 11.1M 1s
 31800K .......... .......... .......... .......... .......... 92% 9.76M 1s
 31850K .......... .......... .......... .......... .......... 92% 9.28M 1s
 31900K .......... .......... .......... .......... .......... 92% 8.81M 1s
 31950K .......... .......... .......... .......... .......... 93% 1.27M 1s
 32000K .......... .......... .......... .......... .......... 93% 1.05M 1s
 32050K .......... .......... .......... .......... .......... 93% 8.66M 1s
 32100K .......... .......... .......... .......... .......... 93% 10.7M 0s
 32150K .......... .......... .......... .......... .......... 93% 8.92M 0s
 32200K .......... .......... .......... .......... .......... 93% 11.3M 0s
 32250K .......... .......... .......... .......... .......... 94% 11.5M 0s
 32300K .......... .......... .......... .......... .......... 94% 9.93M 0s
 32350K .......... .......... .......... .......... .......... 94% 8.25M 0s
 32400K .......... .......... .......... .......... .......... 94% 9.04M 0s
 32450K .......... .......... .......... .......... .......... 94% 10.3M 0s
 32500K .......... .......... .......... .......... .......... 94% 7.81M 0s
 32550K .......... .......... .......... .......... .......... 94% 11.4M 0s
 32600K .......... .......... .......... .......... .......... 95% 10.1M 0s
 32650K .......... .......... .......... .......... .......... 95% 10.2M 0s
 32700K .......... .......... .......... .......... .......... 95% 11.2M 0s
 32750K .......... .......... .......... .......... .......... 95% 6.99M 0s
 32800K .......... .......... .......... .......... .......... 95% 9.47M 0s
 32850K .......... .......... .......... .......... .......... 95% 1.32M 0s
 32900K .......... .......... .......... .......... .......... 95% 1.05M 0s
 32950K .......... .......... .......... .......... .......... 96% 8.70M 0s
 33000K .......... .......... .......... .......... .......... 96% 11.0M 0s
 33050K .......... .......... .......... .......... .......... 96% 9.33M 0s
 33100K .......... .......... .......... .......... .......... 96% 10.3M 0s
 33150K .......... .......... .......... .......... .......... 96% 8.55M 0s
 33200K .......... .......... .......... .......... .......... 96% 10.4M 0s
 33250K .......... .......... .......... .......... .......... 96% 10.4M 0s
 33300K .......... .......... .......... .......... .......... 97% 9.17M 0s
 33350K .......... .......... .......... .......... .......... 97% 9.44M 0s
 33400K .......... .......... .......... .......... .......... 97% 9.59M 0s
 33450K .......... .......... .......... .......... .......... 97% 10.1M 0s
 33500K .......... .......... .......... .......... .......... 97% 9.76M 0s
 33550K .......... .......... .......... .......... .......... 97% 8.27M 0s
 33600K .......... .......... .......... .......... .......... 97% 10.7M 0s
 33650K .......... .......... .......... .......... .......... 98% 9.43M 0s
 33700K .......... .......... .......... .......... .......... 98% 8.17M 0s
 33750K .......... .......... .......... .......... .......... 98% 10.9M 0s
 33800K .......... .......... .......... .......... .......... 98%  633K 0s
 33850K .......... .......... .......... .......... .......... 98% 11.7M 0s
 33900K .......... .......... .......... .......... .......... 98% 8.11M 0s
 33950K .......... .......... .......... .......... .......... 98% 7.62M 0s
 34000K .......... .......... .......... .......... .......... 99% 11.7M 0s
 34050K .......... .......... .......... .......... .......... 99% 9.02M 0s
 34100K .......... .......... .......... .......... .......... 99% 11.6M 0s
 34150K .......... .......... .......... .......... .......... 99% 10.7M 0s
 34200K .......... .......... .......... .......... .......... 99% 9.26M 0s
 34250K .......... .......... .......... .......... .......... 99% 9.15M 0s
 34300K .......... .......... .......... .......... .......... 99% 8.29M 0s
 34350K ........                                              100% 16.4M=7.6s

2020-05-06 00:40:08 (4.41 MB/s) - 'xtensa-esp32-elf-gcc8_2_0-esp32-2019r1-rc2-linux-amd64.tar.xz' saved [35183244/35183244]

xtensa-esp32-elf-gcc (crosstool-NG esp32-2019r1-rc2) 8.2.0
Copyright (C) 2018 Free Software Foundation, Inc.
This is free software; see the source for copying conditions.  There is NO
warranty; not even for MERCHANTABILITY or FITNESS FOR A PARTICULAR PURPOSE.

./cibuild.sh: line 214: pip3: command not found
Build step 'Execute shell' marked build as failure

Build failed in Jenkins: NuttX-Nightly-Build #116

Posted by Apache Jenkins Server <je...@builds.apache.org>.
See <https://builds.apache.org/job/NuttX-Nightly-Build/116/display/redirect>

Changes:


------------------------------------------
Started by timer
Running as SYSTEM
[EnvInject] - Loading node environment variables.
Building remotely on H27 (ubuntu) in workspace <https://builds.apache.org/job/NuttX-Nightly-Build/ws/>
[NuttX-Nightly-Build] $ /bin/bash -xe /tmp/jenkins7941244186320219805.sh
+ '[' -d testing ']'
+ rm -rf testing
+ '[' -d nuttx ']'
+ rm -rf nuttx
+ '[' -d apps ']'
+ rm -rf apps
+ git clone https://github.com/apache/incubator-nuttx-testing testing
Cloning into 'testing'...
+ cd testing
+ ./cibuild.sh -i -s ./testlist/all.dat
~/jenkins-slave/workspace/NuttX-Nightly-Build/testing ~/jenkins-slave/workspace/NuttX-Nightly-Build/testing
arm-none-eabi-gcc (GNU Tools for Arm Embedded Processors 9-2019-q4-major) 9.2.1 20191025 (release) [ARM/arm-9-branch revision 277599]
Copyright (C) 2019 Free Software Foundation, Inc.
This is free software; see the source for copying conditions.  There is NO
warranty; not even for MERCHANTABILITY or FITNESS FOR A PARTICULAR PURPOSE.

p32-gcc (GCC) 4.9.2
Copyright (C) 2014 Free Software Foundation, Inc.
This is free software; see the source for copying conditions.  There is NO
warranty; not even for MERCHANTABILITY or FITNESS FOR A PARTICULAR PURPOSE.

riscv64-unknown-elf-gcc (SiFive GCC 8.3.0-2019.08.0) 8.3.0
Copyright (C) 2018 Free Software Foundation, Inc.
This is free software; see the source for copying conditions.  There is NO
warranty; not even for MERCHANTABILITY or FITNESS FOR A PARTICULAR PURPOSE.

xtensa-esp32-elf-gcc (crosstool-NG esp32-2019r1-rc2) 8.2.0
Copyright (C) 2018 Free Software Foundation, Inc.
This is free software; see the source for copying conditions.  There is NO
warranty; not even for MERCHANTABILITY or FITNESS FOR A PARTICULAR PURPOSE.

./cibuild.sh: line 214: pip3: command not found
Build step 'Execute shell' marked build as failure

Build failed in Jenkins: NuttX-Nightly-Build #115

Posted by Apache Jenkins Server <je...@builds.apache.org>.
See <https://builds.apache.org/job/NuttX-Nightly-Build/115/display/redirect>

Changes:


------------------------------------------
[...truncated 266.14 KB...]
  Copy files
  Select CONFIG_HOST_LINUX=y
  Refreshing...
  Building NuttX...
  Normalize sim/minibasic
====================================================================================
Configuration/Tool: sim/tcpblaster
------------------------------------------------------------------------------------
  Cleaning...
  Configuring...
  Copy files
  Select CONFIG_HOST_LINUX=y
  Refreshing...
  Building NuttX...
--2020-05-04 05:48:02--  https://github.com/ARMmbed/littlefs/archive/v2.2.1.tar.gz
Resolving github.com (github.com)... 192.30.255.113
Connecting to github.com (github.com)|192.30.255.113|:443... connected.
HTTP request sent, awaiting response... 302 Found
Location: https://codeload.github.com/ARMmbed/littlefs/tar.gz/v2.2.1 [following]
--2020-05-04 05:48:03--  https://codeload.github.com/ARMmbed/littlefs/tar.gz/v2.2.1
Resolving codeload.github.com (codeload.github.com)... 192.30.255.120
Connecting to codeload.github.com (codeload.github.com)|192.30.255.120|:443... connected.
HTTP request sent, awaiting response... 200 OK
Length: unspecified [application/x-gzip]
Saving to: 'littlefs/v2.2.1.tar.gz'

     0K .......... .......... .......... .......... .......... 5.41M
    50K .......... .......... .......... .......... .......... 5.86M
   100K .......... .                                           27.7M=0.02s

2020-05-04 05:48:03 (6.13 MB/s) - 'littlefs/v2.2.1.tar.gz' saved [114250]

  Normalize sim/tcpblaster
====================================================================================
Configuration/Tool: sim/touchscreen
------------------------------------------------------------------------------------
  Cleaning...
  Configuring...
  Copy files
  Select CONFIG_HOST_LINUX=y
  Refreshing...
  Building NuttX...
  Normalize sim/touchscreen
====================================================================================
Configuration/Tool: sim/bas
------------------------------------------------------------------------------------
  Cleaning...
  Configuring...
  Copy files
  Select CONFIG_HOST_LINUX=y
  Refreshing...
  Building NuttX...
  Normalize sim/bas
====================================================================================
Configuration/Tool: sim/mtdpart
------------------------------------------------------------------------------------
  Cleaning...
  Configuring...
  Copy files
  Select CONFIG_HOST_LINUX=y
  Refreshing...
  Building NuttX...
  Normalize sim/mtdpart
====================================================================================
Configuration/Tool: sim/spiffs
------------------------------------------------------------------------------------
  Cleaning...
  Configuring...
  Copy files
  Select CONFIG_HOST_LINUX=y
  Refreshing...
  Building NuttX...
  Normalize sim/spiffs
====================================================================================
Configuration/Tool: sim/ustream
------------------------------------------------------------------------------------
  Cleaning...
  Configuring...
  Copy files
  Select CONFIG_HOST_LINUX=y
  Refreshing...
  Building NuttX...
  Normalize sim/ustream
====================================================================================
Configuration/Tool: sim/userfs
------------------------------------------------------------------------------------
  Cleaning...
  Configuring...
  Copy files
  Select CONFIG_HOST_LINUX=y
  Refreshing...
  Building NuttX...
  Normalize sim/userfs
====================================================================================
Configuration/Tool: sim/rpproxy
------------------------------------------------------------------------------------
  Cleaning...
  Configuring...
  Copy files
  Select CONFIG_HOST_LINUX=y
  Refreshing...
--2020-05-04 05:51:35--  https://github.com/OpenAMP/libmetal/archive/v2020.04.0.zip
Resolving github.com (github.com)... 192.30.255.113
Connecting to github.com (github.com)|192.30.255.113|:443... connected.
HTTP request sent, awaiting response... 302 Found
Location: https://codeload.github.com/OpenAMP/libmetal/zip/v2020.04.0 [following]
--2020-05-04 05:51:36--  https://codeload.github.com/OpenAMP/libmetal/zip/v2020.04.0
Resolving codeload.github.com (codeload.github.com)... 192.30.255.121
Connecting to codeload.github.com (codeload.github.com)|192.30.255.121|:443... connected.
HTTP request sent, awaiting response... 200 OK
Length: unspecified [application/zip]
Saving to: 'libmetal.zip'

     0K .......... .......... .......... .......... .......... 2.52M
    50K .......... .......... .......... .......... .......... 5.45M
   100K .......... .......... .......... .......... .......... 3.12M
   150K .......... .......... .......... .......... .......... 3.56M
   200K .......... .......... .......... .......... .......... 2.34M
   250K .......... .......... .......... .......... .......... 5.64M
   300K .......... .......... .......... .......... .......... 10.3M
   350K .......... .......... .....                            6.21M=0.1s

2020-05-04 05:51:36 (3.82 MB/s) - 'libmetal.zip' saved [384158]

--2020-05-04 05:51:36--  https://github.com/OpenAMP/open-amp/archive/v2020.04.0.zip
Resolving github.com (github.com)... 192.30.255.113
Connecting to github.com (github.com)|192.30.255.113|:443... connected.
HTTP request sent, awaiting response... 302 Found
Location: https://codeload.github.com/OpenAMP/open-amp/zip/v2020.04.0 [following]
--2020-05-04 05:51:36--  https://codeload.github.com/OpenAMP/open-amp/zip/v2020.04.0
Resolving codeload.github.com (codeload.github.com)... 192.30.255.121
Connecting to codeload.github.com (codeload.github.com)|192.30.255.121|:443... connected.
HTTP request sent, awaiting response... 200 OK
Length: unspecified [application/zip]
Saving to: 'open-amp.zip'

     0K .......... .......... .......... .......... .......... 3.07M
    50K .......... .......... .......... .......... .......... 3.19M
   100K .......... .......... .......... .......... .......... 2.16M
   150K .......... .......... .......... .......... .......... 5.61M
   200K .......... .......... .......... .......... .......... 5.76M
   250K .......... .......... .......... .......... .......... 9.48M
   300K .......... .......... .......... .......... .......... 9.69M
   350K .......... .......... .......... .......... .......... 10.3M
   400K .......... .......... .......... .......... .......... 5.84M
   450K .......... .......... .......... .......... .......... 10.5M
   500K .......... .......... .......... .......... .......... 10.6M
   550K .......... .......... .......... .......... .......... 11.0M
   600K .......... .......... .......... .......... .......... 11.0M
   650K .......... .......... .......... .......... .......... 11.3M
   700K .......... ......                                      27.6M=0.1s

2020-05-04 05:51:37 (5.97 MB/s) - 'open-amp.zip' saved [734059]

  Building NuttX...
  Normalize sim/rpproxy
====================================================================================
Configuration/Tool: sim/vpnkit
------------------------------------------------------------------------------------
  Cleaning...
  Configuring...
  Copy files
  Select CONFIG_HOST_LINUX=y
  Refreshing...
  Building NuttX...
  Normalize sim/vpnkit
====================================================================================
Configuration/Tool: sim/dsptest
------------------------------------------------------------------------------------
  Cleaning...
  Configuring...
  Copy files
  Select CONFIG_HOST_LINUX=y
  Refreshing...
  Building NuttX...
--2020-05-04 05:52:56--  https://github.com/ThrowTheSwitch/Unity/archive/v2.4.3.tar.gz
Resolving github.com (github.com)... 192.30.255.112
Connecting to github.com (github.com)|192.30.255.112|:443... connected.
HTTP request sent, awaiting response... 302 Found
Location: https://codeload.github.com/ThrowTheSwitch/Unity/tar.gz/v2.4.3 [following]
--2020-05-04 05:52:57--  https://codeload.github.com/ThrowTheSwitch/Unity/tar.gz/v2.4.3
Resolving codeload.github.com (codeload.github.com)... 192.30.255.121
Connecting to codeload.github.com (codeload.github.com)|192.30.255.121|:443... connected.
HTTP request sent, awaiting response... 200 OK
Length: unspecified [application/x-gzip]
Saving to: 'v2.4.3.tar.gz'

     0K .......... .......... .......... .......... .......... 5.32M
    50K .......... .......... .......... .......... .......... 11.1M
   100K .......... .......... .......... .......... .......... 31.0M
   150K .......... .......... .......... .......... .......... 2.98M
   200K .......... .......... .......... .......... .......... 4.87M
   250K .......                                                12.4M=0.04s

2020-05-04 05:52:57 (5.97 MB/s) - 'v2.4.3.tar.gz' saved [264150]

  Normalize sim/dsptest
====================================================================================
Configuration/Tool: qemu-i486/nsh
------------------------------------------------------------------------------------
  Cleaning...
  Configuring...
  Copy files
  Select CONFIG_HOST_LINUX=y
  Refreshing...
  Building NuttX...
  Normalize qemu-i486/nsh
====================================================================================
Configuration/Tool: qemu-i486/ostest
------------------------------------------------------------------------------------
  Cleaning...
  Configuring...
  Copy files
  Select CONFIG_HOST_LINUX=y
  Refreshing...
  Building NuttX...
  Normalize qemu-i486/ostest
====================================================================================
Configuration/Tool: esp32-core/smp
------------------------------------------------------------------------------------
  Cleaning...
  Configuring...
  Copy files
  Select CONFIG_HOST_LINUX=y
  Refreshing...
  Building NuttX...
  Normalize esp32-core/smp
====================================================================================
Configuration/Tool: esp32-core/nsh
------------------------------------------------------------------------------------
  Cleaning...
  Configuring...
  Copy files
  Select CONFIG_HOST_LINUX=y
  Refreshing...
  Building NuttX...
  Normalize esp32-core/nsh
====================================================================================
Configuration/Tool: esp32-core/ostest
------------------------------------------------------------------------------------
  Cleaning...
  Configuring...
  Copy files
  Select CONFIG_HOST_LINUX=y
  Refreshing...
  Building NuttX...
  Normalize esp32-core/ostest
====================================================================================
Build step 'Execute shell' marked build as failure

Build failed in Jenkins: NuttX-Nightly-Build #114

Posted by Apache Jenkins Server <je...@builds.apache.org>.
See <https://builds.apache.org/job/NuttX-Nightly-Build/114/display/redirect>

Changes:


------------------------------------------
[...truncated 268.22 KB...]
  Copy files
  Select CONFIG_HOST_LINUX=y
  Refreshing...
  Building NuttX...
  Normalize sim/minibasic
====================================================================================
Configuration/Tool: sim/tcpblaster
------------------------------------------------------------------------------------
  Cleaning...
  Configuring...
  Copy files
  Select CONFIG_HOST_LINUX=y
  Refreshing...
  Building NuttX...
--2020-05-03 06:02:34--  https://github.com/ARMmbed/littlefs/archive/v2.2.1.tar.gz
Resolving github.com (github.com)... 192.30.255.113
Connecting to github.com (github.com)|192.30.255.113|:443... connected.
HTTP request sent, awaiting response... 302 Found
Location: https://codeload.github.com/ARMmbed/littlefs/tar.gz/v2.2.1 [following]
--2020-05-03 06:02:34--  https://codeload.github.com/ARMmbed/littlefs/tar.gz/v2.2.1
Resolving codeload.github.com (codeload.github.com)... 192.30.255.121
Connecting to codeload.github.com (codeload.github.com)|192.30.255.121|:443... connected.
HTTP request sent, awaiting response... 200 OK
Length: unspecified [application/x-gzip]
Saving to: 'littlefs/v2.2.1.tar.gz'

     0K .......... .......... .......... .......... .......... 5.47M
    50K .......... .......... .......... .......... .......... 5.37M
   100K .......... .                                           23.7M=0.02s

2020-05-03 06:02:35 (5.89 MB/s) - 'littlefs/v2.2.1.tar.gz' saved [114250]

  Normalize sim/tcpblaster
====================================================================================
Configuration/Tool: sim/touchscreen
------------------------------------------------------------------------------------
  Cleaning...
  Configuring...
  Copy files
  Select CONFIG_HOST_LINUX=y
  Refreshing...
  Building NuttX...
  Normalize sim/touchscreen
====================================================================================
Configuration/Tool: sim/bas
------------------------------------------------------------------------------------
  Cleaning...
  Configuring...
  Copy files
  Select CONFIG_HOST_LINUX=y
  Refreshing...
  Building NuttX...
  Normalize sim/bas
====================================================================================
Configuration/Tool: sim/mtdpart
------------------------------------------------------------------------------------
  Cleaning...
  Configuring...
  Copy files
  Select CONFIG_HOST_LINUX=y
  Refreshing...
  Building NuttX...
  Normalize sim/mtdpart
====================================================================================
Configuration/Tool: sim/spiffs
------------------------------------------------------------------------------------
  Cleaning...
  Configuring...
  Copy files
  Select CONFIG_HOST_LINUX=y
  Refreshing...
  Building NuttX...
  Normalize sim/spiffs
====================================================================================
Configuration/Tool: sim/ustream
------------------------------------------------------------------------------------
  Cleaning...
  Configuring...
  Copy files
  Select CONFIG_HOST_LINUX=y
  Refreshing...
  Building NuttX...
  Normalize sim/ustream
====================================================================================
Configuration/Tool: sim/userfs
------------------------------------------------------------------------------------
  Cleaning...
  Configuring...
  Copy files
  Select CONFIG_HOST_LINUX=y
  Refreshing...
  Building NuttX...
  Normalize sim/userfs
====================================================================================
Configuration/Tool: sim/rpproxy
------------------------------------------------------------------------------------
  Cleaning...
  Configuring...
  Copy files
  Select CONFIG_HOST_LINUX=y
  Refreshing...
--2020-05-03 06:06:07--  https://github.com/OpenAMP/libmetal/archive/v2020.04.0.zip
Resolving github.com (github.com)... 192.30.255.112
Connecting to github.com (github.com)|192.30.255.112|:443... connected.
HTTP request sent, awaiting response... 302 Found
Location: https://codeload.github.com/OpenAMP/libmetal/zip/v2020.04.0 [following]
--2020-05-03 06:06:07--  https://codeload.github.com/OpenAMP/libmetal/zip/v2020.04.0
Resolving codeload.github.com (codeload.github.com)... 192.30.255.120
Connecting to codeload.github.com (codeload.github.com)|192.30.255.120|:443... connected.
HTTP request sent, awaiting response... 200 OK
Length: unspecified [application/zip]
Saving to: 'libmetal.zip'

     0K .......... .......... .......... .......... .......... 2.23M
    50K .......... .......... .......... .......... .......... 4.31M
   100K .......... .......... .......... .......... .......... 2.90M
   150K .......... .......... .......... .......... .......... 3.50M
   200K .......... .......... .......... .......... .......... 2.27M
   250K .......... .......... .......... .......... .......... 5.35M
   300K .......... .......... .......... .......... .......... 8.49M
   350K .......... .......... .....                            6.57M=0.1s

2020-05-03 06:06:07 (3.52 MB/s) - 'libmetal.zip' saved [384158]

--2020-05-03 06:06:08--  https://github.com/OpenAMP/open-amp/archive/v2020.04.0.zip
Resolving github.com (github.com)... 192.30.255.112
Connecting to github.com (github.com)|192.30.255.112|:443... connected.
HTTP request sent, awaiting response... 302 Found
Location: https://codeload.github.com/OpenAMP/open-amp/zip/v2020.04.0 [following]
--2020-05-03 06:06:08--  https://codeload.github.com/OpenAMP/open-amp/zip/v2020.04.0
Resolving codeload.github.com (codeload.github.com)... 192.30.255.120
Connecting to codeload.github.com (codeload.github.com)|192.30.255.120|:443... connected.
HTTP request sent, awaiting response... 200 OK
Length: unspecified [application/zip]
Saving to: 'open-amp.zip'

     0K .......... .......... .......... .......... .......... 3.03M
    50K .......... .......... .......... .......... .......... 3.18M
   100K .......... .......... .......... .......... .......... 2.15M
   150K .......... .......... .......... .......... .......... 5.62M
   200K .......... .......... .......... .......... .......... 5.74M
   250K .......... .......... .......... .......... .......... 9.32M
   300K .......... .......... .......... .......... .......... 9.62M
   350K .......... .......... .......... .......... .......... 5.93M
   400K .......... .......... .......... .......... .......... 9.88M
   450K .......... .......... .......... .......... .......... 10.1M
   500K .......... .......... .......... .......... .......... 9.65M
   550K .......... .......... .......... .......... .......... 9.81M
   600K .......... .......... .......... .......... .......... 11.2M
   650K .......... .......... .......... .......... .......... 12.6M
   700K .......... ......                                      45.7M=0.1s

2020-05-03 06:06:08 (5.91 MB/s) - 'open-amp.zip' saved [734059]

  Building NuttX...
  Normalize sim/rpproxy
====================================================================================
Configuration/Tool: sim/vpnkit
------------------------------------------------------------------------------------
  Cleaning...
  Configuring...
  Copy files
  Select CONFIG_HOST_LINUX=y
  Refreshing...
  Building NuttX...
  Normalize sim/vpnkit
====================================================================================
Configuration/Tool: sim/dsptest
------------------------------------------------------------------------------------
  Cleaning...
  Configuring...
  Copy files
  Select CONFIG_HOST_LINUX=y
  Refreshing...
  Building NuttX...
--2020-05-03 06:07:28--  https://github.com/ThrowTheSwitch/Unity/archive/v2.4.3.tar.gz
Resolving github.com (github.com)... 192.30.255.112
Connecting to github.com (github.com)|192.30.255.112|:443... connected.
HTTP request sent, awaiting response... 302 Found
Location: https://codeload.github.com/ThrowTheSwitch/Unity/tar.gz/v2.4.3 [following]
--2020-05-03 06:07:28--  https://codeload.github.com/ThrowTheSwitch/Unity/tar.gz/v2.4.3
Resolving codeload.github.com (codeload.github.com)... 192.30.255.120
Connecting to codeload.github.com (codeload.github.com)|192.30.255.120|:443... connected.
HTTP request sent, awaiting response... 200 OK
Length: unspecified [application/x-gzip]
Saving to: 'v2.4.3.tar.gz'

     0K .......... .......... .......... .......... .......... 5.25M
    50K .......... .......... .......... .......... .......... 11.6M
   100K .......... .......... .......... .......... .......... 26.1M
   150K .......... .......... .......... .......... .......... 3.09M
   200K .......... .......... .......... .......... .......... 4.99M
   250K .......                                                12.7M=0.04s

2020-05-03 06:07:28 (6.06 MB/s) - 'v2.4.3.tar.gz' saved [264150]

  Normalize sim/dsptest
====================================================================================
Configuration/Tool: qemu-i486/nsh
------------------------------------------------------------------------------------
  Cleaning...
  Configuring...
  Copy files
  Select CONFIG_HOST_LINUX=y
  Refreshing...
  Building NuttX...
  Normalize qemu-i486/nsh
====================================================================================
Configuration/Tool: qemu-i486/ostest
------------------------------------------------------------------------------------
  Cleaning...
  Configuring...
  Copy files
  Select CONFIG_HOST_LINUX=y
  Refreshing...
  Building NuttX...
  Normalize qemu-i486/ostest
====================================================================================
Configuration/Tool: esp32-core/smp
------------------------------------------------------------------------------------
  Cleaning...
  Configuring...
  Copy files
  Select CONFIG_HOST_LINUX=y
  Refreshing...
  Building NuttX...
  Normalize esp32-core/smp
====================================================================================
Configuration/Tool: esp32-core/nsh
------------------------------------------------------------------------------------
  Cleaning...
  Configuring...
  Copy files
  Select CONFIG_HOST_LINUX=y
  Refreshing...
  Building NuttX...
  Normalize esp32-core/nsh
====================================================================================
Configuration/Tool: esp32-core/ostest
------------------------------------------------------------------------------------
  Cleaning...
  Configuring...
  Copy files
  Select CONFIG_HOST_LINUX=y
  Refreshing...
  Building NuttX...
  Normalize esp32-core/ostest
====================================================================================
Build step 'Execute shell' marked build as failure

Build failed in Jenkins: NuttX-Nightly-Build #113

Posted by Apache Jenkins Server <je...@builds.apache.org>.
See <https://builds.apache.org/job/NuttX-Nightly-Build/113/display/redirect>

Changes:


------------------------------------------
[...truncated 269.34 KB...]
  Select CONFIG_HOST_LINUX=y
  Refreshing...
  Building NuttX...
  Normalize sim/nx11
====================================================================================
Configuration/Tool: sim/mount
------------------------------------------------------------------------------------
  Cleaning...
  Configuring...
  Copy files
  Select CONFIG_HOST_LINUX=y
  Refreshing...
  Building NuttX...
  Normalize sim/mount
====================================================================================
Configuration/Tool: sim/spiffs
------------------------------------------------------------------------------------
  Cleaning...
  Configuring...
  Copy files
  Select CONFIG_HOST_LINUX=y
  Refreshing...
  Building NuttX...
  Normalize sim/spiffs
====================================================================================
Configuration/Tool: sim/unionfs
------------------------------------------------------------------------------------
  Cleaning...
  Configuring...
  Copy files
  Select CONFIG_HOST_LINUX=y
  Refreshing...
  Building NuttX...
  Normalize sim/unionfs
====================================================================================
Configuration/Tool: sim/sixlowpan
------------------------------------------------------------------------------------
  Cleaning...
  Configuring...
  Copy files
  Select CONFIG_HOST_LINUX=y
  Refreshing...
  Building NuttX...
  Normalize sim/sixlowpan
====================================================================================
Configuration/Tool: sim/configdata
------------------------------------------------------------------------------------
  Cleaning...
  Configuring...
  Copy files
  Select CONFIG_HOST_LINUX=y
  Refreshing...
  Building NuttX...
  Normalize sim/configdata
====================================================================================
Configuration/Tool: sim/fb
------------------------------------------------------------------------------------
  Cleaning...
  Configuring...
  Copy files
  Select CONFIG_HOST_LINUX=y
  Refreshing...
  Building NuttX...
  Normalize sim/fb
====================================================================================
Configuration/Tool: sim/nxwm
------------------------------------------------------------------------------------
  Cleaning...
  Configuring...
  Copy files
  Select CONFIG_HOST_LINUX=y
  Refreshing...
  Building NuttX...
  Normalize sim/nxwm
====================================================================================
Configuration/Tool: sim/rpproxy
------------------------------------------------------------------------------------
  Cleaning...
  Configuring...
  Copy files
  Select CONFIG_HOST_LINUX=y
  Refreshing...
--2020-05-02 06:42:16--  https://github.com/OpenAMP/libmetal/archive/v2020.04.0.zip
Resolving github.com (github.com)... 192.30.255.112
Connecting to github.com (github.com)|192.30.255.112|:443... connected.
HTTP request sent, awaiting response... 302 Found
Location: https://codeload.github.com/OpenAMP/libmetal/zip/v2020.04.0 [following]
--2020-05-02 06:42:16--  https://codeload.github.com/OpenAMP/libmetal/zip/v2020.04.0
Resolving codeload.github.com (codeload.github.com)... 192.30.255.120
Connecting to codeload.github.com (codeload.github.com)|192.30.255.120|:443... connected.
HTTP request sent, awaiting response... 200 OK
Length: unspecified [application/zip]
Saving to: 'libmetal.zip'

     0K .......... .......... .......... .......... .......... 2.60M
    50K .......... .......... .......... .......... .......... 5.44M
   100K .......... .......... .......... .......... .......... 3.36M
   150K .......... .......... .......... .......... .......... 4.13M
   200K .......... .......... .......... .......... .......... 3.10M
   250K .......... .......... .......... .......... .......... 5.91M
   300K .......... .......... .......... .......... .......... 9.89M
   350K .......... .......... .....                            6.85M=0.09s

2020-05-02 06:42:17 (4.23 MB/s) - 'libmetal.zip' saved [384158]

--2020-05-02 06:42:17--  https://github.com/OpenAMP/open-amp/archive/v2020.04.0.zip
Resolving github.com (github.com)... 192.30.255.112
Connecting to github.com (github.com)|192.30.255.112|:443... connected.
HTTP request sent, awaiting response... 302 Found
Location: https://codeload.github.com/OpenAMP/open-amp/zip/v2020.04.0 [following]
--2020-05-02 06:42:17--  https://codeload.github.com/OpenAMP/open-amp/zip/v2020.04.0
Resolving codeload.github.com (codeload.github.com)... 192.30.255.120
Connecting to codeload.github.com (codeload.github.com)|192.30.255.120|:443... connected.
HTTP request sent, awaiting response... 200 OK
Length: unspecified [application/zip]
Saving to: 'open-amp.zip'

     0K .......... .......... .......... .......... .......... 3.89M
    50K .......... .......... .......... .......... .......... 3.91M
   100K .......... .......... .......... .......... .......... 2.51M
   150K .......... .......... .......... .......... .......... 6.03M
   200K .......... .......... .......... .......... .......... 8.74M
   250K .......... .......... .......... .......... .......... 9.96M
   300K .......... .......... .......... .......... .......... 9.98M
   350K .......... .......... .......... .......... .......... 6.50M
   400K .......... .......... .......... .......... .......... 10.6M
   450K .......... .......... .......... .......... .......... 11.1M
   500K .......... .......... .......... .......... .......... 11.3M
   550K .......... .......... .......... .......... .......... 21.1M
   600K .......... .......... .......... .......... .......... 9.24M
   650K .......... .......... .......... .......... .......... 11.5M
   700K .......... ......                                      5.81M=0.1s

2020-05-02 06:42:17 (6.76 MB/s) - 'open-amp.zip' saved [734059]

  Building NuttX...
  Normalize sim/rpproxy
====================================================================================
Configuration/Tool: sim/vpnkit
------------------------------------------------------------------------------------
  Cleaning...
  Configuring...
  Copy files
  Select CONFIG_HOST_LINUX=y
  Refreshing...
  Building NuttX...
  Normalize sim/vpnkit
====================================================================================
Configuration/Tool: sim/mtdpart
------------------------------------------------------------------------------------
  Cleaning...
  Configuring...
  Copy files
  Select CONFIG_HOST_LINUX=y
  Refreshing...
  Building NuttX...
  Normalize sim/mtdpart
====================================================================================
Configuration/Tool: sim/nsh2
------------------------------------------------------------------------------------
  Cleaning...
  Configuring...
  Copy files
  Select CONFIG_HOST_LINUX=y
  Refreshing...
  Building NuttX...
  Normalize sim/nsh2
====================================================================================
Configuration/Tool: sim/touchscreen
------------------------------------------------------------------------------------
  Cleaning...
  Configuring...
  Copy files
  Select CONFIG_HOST_LINUX=y
  Refreshing...
  Building NuttX...
  Normalize sim/touchscreen
====================================================================================
Configuration/Tool: sim/tcploop
------------------------------------------------------------------------------------
  Cleaning...
  Configuring...
  Copy files
  Select CONFIG_HOST_LINUX=y
  Refreshing...
  Building NuttX...
  Normalize sim/tcploop
====================================================================================
Configuration/Tool: sim/ipforward
------------------------------------------------------------------------------------
  Cleaning...
  Configuring...
  Copy files
  Select CONFIG_HOST_LINUX=y
  Refreshing...
  Building NuttX...
  Normalize sim/ipforward
====================================================================================
Configuration/Tool: qemu-i486/ostest
------------------------------------------------------------------------------------
  Cleaning...
  Configuring...
  Copy files
  Select CONFIG_HOST_LINUX=y
  Refreshing...
  Building NuttX...
  Normalize qemu-i486/ostest
====================================================================================
Configuration/Tool: qemu-i486/nsh
------------------------------------------------------------------------------------
  Cleaning...
  Configuring...
  Copy files
  Select CONFIG_HOST_LINUX=y
  Refreshing...
  Building NuttX...
  Normalize qemu-i486/nsh
====================================================================================
Configuration/Tool: esp32-core/smp
------------------------------------------------------------------------------------
  Cleaning...
  Configuring...
  Copy files
  Select CONFIG_HOST_LINUX=y
  Refreshing...
  Building NuttX...
  Normalize esp32-core/smp
====================================================================================
Configuration/Tool: esp32-core/ostest
------------------------------------------------------------------------------------
  Cleaning...
  Configuring...
  Copy files
  Select CONFIG_HOST_LINUX=y
  Refreshing...
  Building NuttX...
  Normalize esp32-core/ostest
====================================================================================
Configuration/Tool: esp32-core/nsh
------------------------------------------------------------------------------------
  Cleaning...
  Configuring...
  Copy files
  Select CONFIG_HOST_LINUX=y
  Refreshing...
  Building NuttX...
  Normalize esp32-core/nsh
====================================================================================
Build step 'Execute shell' marked build as failure

Build failed in Jenkins: NuttX-Nightly-Build #112

Posted by Apache Jenkins Server <je...@builds.apache.org>.
See <https://builds.apache.org/job/NuttX-Nightly-Build/112/display/redirect>

Changes:


------------------------------------------
[...truncated 443.61 KB...]
  (use "git add -f <file>..." to include in what will be committed)

	libs/libc/exec_symtab.c
	tools/pic32/mkpichex

nothing to commit, working tree clean
On branch master
Your branch is up to date with 'origin/master'.

Ignored files:
  (use "git add -f <file>..." to include in what will be committed)

	examples/romfs/testdir/

nothing to commit, working tree clean
  Configuring...
  Copy files
  Select CONFIG_HOST_LINUX=y
  Refreshing...
  Building NuttX...
  Normalize sim/userfs
====================================================================================
Skipping: sim/rpproxy
====================================================================================
Configuration/Tool: sim/vpnkit
------------------------------------------------------------------------------------
  Cleaning...
On branch master
Your branch is up to date with 'origin/master'.

Ignored files:
  (use "git add -f <file>..." to include in what will be committed)

	libs/libc/exec_symtab.c
	tools/pic32/mkpichex

nothing to commit, working tree clean
On branch master
Your branch is up to date with 'origin/master'.

Ignored files:
  (use "git add -f <file>..." to include in what will be committed)

	examples/romfs/testdir/

nothing to commit, working tree clean
  Configuring...
  Copy files
  Select CONFIG_HOST_LINUX=y
  Refreshing...
  Building NuttX...
  Normalize sim/vpnkit
====================================================================================
Configuration/Tool: sim/dsptest
------------------------------------------------------------------------------------
  Cleaning...
On branch master
Your branch is up to date with 'origin/master'.

Ignored files:
  (use "git add -f <file>..." to include in what will be committed)

	libs/libc/exec_symtab.c
	tools/pic32/mkpichex

nothing to commit, working tree clean
On branch master
Your branch is up to date with 'origin/master'.

Ignored files:
  (use "git add -f <file>..." to include in what will be committed)

	examples/romfs/testdir/

nothing to commit, working tree clean
  Configuring...
  Copy files
  Select CONFIG_HOST_LINUX=y
  Refreshing...
  Building NuttX...
--2020-05-01 05:36:04--  https://github.com/ThrowTheSwitch/Unity/archive/v2.4.3.tar.gz
Resolving github.com (github.com)... 192.30.255.113
Connecting to github.com (github.com)|192.30.255.113|:443... connected.
HTTP request sent, awaiting response... 302 Found
Location: https://codeload.github.com/ThrowTheSwitch/Unity/tar.gz/v2.4.3 [following]
--2020-05-01 05:36:04--  https://codeload.github.com/ThrowTheSwitch/Unity/tar.gz/v2.4.3
Resolving codeload.github.com (codeload.github.com)... 192.30.255.120
Connecting to codeload.github.com (codeload.github.com)|192.30.255.120|:443... connected.
HTTP request sent, awaiting response... 200 OK
Length: unspecified [application/x-gzip]
Saving to: 'v2.4.3.tar.gz'

     0K .......... .......... .......... .......... .......... 5.30M
    50K .......... .......... .......... .......... .......... 11.0M
   100K .......... .......... .......... .......... .......... 30.1M
   150K .......... .......... .......... .......... .......... 3.63M
   200K .......... .......... .......... .......... .......... 5.49M
   250K .......                                                13.3M=0.04s

2020-05-01 05:36:04 (6.59 MB/s) - 'v2.4.3.tar.gz' saved [264150]

  Normalize sim/dsptest
====================================================================================
Configuration/Tool: qemu-i486/nsh
------------------------------------------------------------------------------------
  Cleaning...
On branch master
Your branch is up to date with 'origin/master'.

Ignored files:
  (use "git add -f <file>..." to include in what will be committed)

	libs/libc/exec_symtab.c
	tools/pic32/mkpichex

nothing to commit, working tree clean
On branch master
Your branch is up to date with 'origin/master'.

Ignored files:
  (use "git add -f <file>..." to include in what will be committed)

	examples/romfs/testdir/

nothing to commit, working tree clean
  Configuring...
  Copy files
  Select CONFIG_HOST_LINUX=y
  Refreshing...
  Building NuttX...
  Normalize qemu-i486/nsh
====================================================================================
Configuration/Tool: qemu-i486/ostest
------------------------------------------------------------------------------------
  Cleaning...
On branch master
Your branch is up to date with 'origin/master'.

Ignored files:
  (use "git add -f <file>..." to include in what will be committed)

	libs/libc/exec_symtab.c
	tools/pic32/mkpichex

nothing to commit, working tree clean
On branch master
Your branch is up to date with 'origin/master'.

Ignored files:
  (use "git add -f <file>..." to include in what will be committed)

	examples/romfs/testdir/

nothing to commit, working tree clean
  Configuring...
  Copy files
  Select CONFIG_HOST_LINUX=y
  Refreshing...
  Building NuttX...
  Normalize qemu-i486/ostest
====================================================================================
Configuration/Tool: esp32-core/smp
------------------------------------------------------------------------------------
  Cleaning...
On branch master
Your branch is up to date with 'origin/master'.

Ignored files:
  (use "git add -f <file>..." to include in what will be committed)

	libs/libc/exec_symtab.c
	tools/pic32/mkpichex

nothing to commit, working tree clean
On branch master
Your branch is up to date with 'origin/master'.

Ignored files:
  (use "git add -f <file>..." to include in what will be committed)

	examples/romfs/testdir/

nothing to commit, working tree clean
  Configuring...
  Copy files
  Select CONFIG_HOST_LINUX=y
  Refreshing...
  Building NuttX...
  Normalize esp32-core/smp
====================================================================================
Configuration/Tool: esp32-core/nsh
------------------------------------------------------------------------------------
  Cleaning...
On branch master
Your branch is up to date with 'origin/master'.

Ignored files:
  (use "git add -f <file>..." to include in what will be committed)

	libs/libc/exec_symtab.c
	tools/pic32/mkpichex

nothing to commit, working tree clean
On branch master
Your branch is up to date with 'origin/master'.

Ignored files:
  (use "git add -f <file>..." to include in what will be committed)

	examples/romfs/testdir/

nothing to commit, working tree clean
  Configuring...
  Copy files
  Select CONFIG_HOST_LINUX=y
  Refreshing...
  Building NuttX...
  Normalize esp32-core/nsh
====================================================================================
Configuration/Tool: esp32-core/ostest
------------------------------------------------------------------------------------
  Cleaning...
On branch master
Your branch is up to date with 'origin/master'.

Ignored files:
  (use "git add -f <file>..." to include in what will be committed)

	libs/libc/exec_symtab.c
	tools/pic32/mkpichex

nothing to commit, working tree clean
On branch master
Your branch is up to date with 'origin/master'.

Ignored files:
  (use "git add -f <file>..." to include in what will be committed)

	examples/romfs/testdir/

nothing to commit, working tree clean
  Configuring...
  Copy files
  Select CONFIG_HOST_LINUX=y
  Refreshing...
  Building NuttX...
  Normalize esp32-core/ostest
====================================================================================
Build step 'Execute shell' marked build as failure

Build failed in Jenkins: NuttX-Nightly-Build #111

Posted by Apache Jenkins Server <je...@builds.apache.org>.
See <https://builds.apache.org/job/NuttX-Nightly-Build/111/display/redirect>

Changes:


------------------------------------------
[...truncated 442.34 KB...]
  (use "git add -f <file>..." to include in what will be committed)

	libs/libc/exec_symtab.c
	tools/pic32/mkpichex

nothing to commit, working tree clean
On branch master
Your branch is up to date with 'origin/master'.

Ignored files:
  (use "git add -f <file>..." to include in what will be committed)

	examples/romfs/testdir/

nothing to commit, working tree clean
  Configuring...
  Copy files
  Select CONFIG_HOST_LINUX=y
  Refreshing...
  Building NuttX...
  Normalize sim/userfs
====================================================================================
Skipping: sim/rpproxy
====================================================================================
Configuration/Tool: sim/vpnkit
------------------------------------------------------------------------------------
  Cleaning...
On branch master
Your branch is up to date with 'origin/master'.

Ignored files:
  (use "git add -f <file>..." to include in what will be committed)

	libs/libc/exec_symtab.c
	tools/pic32/mkpichex

nothing to commit, working tree clean
On branch master
Your branch is up to date with 'origin/master'.

Ignored files:
  (use "git add -f <file>..." to include in what will be committed)

	examples/romfs/testdir/

nothing to commit, working tree clean
  Configuring...
  Copy files
  Select CONFIG_HOST_LINUX=y
  Refreshing...
  Building NuttX...
  Normalize sim/vpnkit
====================================================================================
Configuration/Tool: sim/dsptest
------------------------------------------------------------------------------------
  Cleaning...
On branch master
Your branch is up to date with 'origin/master'.

Ignored files:
  (use "git add -f <file>..." to include in what will be committed)

	libs/libc/exec_symtab.c
	tools/pic32/mkpichex

nothing to commit, working tree clean
On branch master
Your branch is up to date with 'origin/master'.

Ignored files:
  (use "git add -f <file>..." to include in what will be committed)

	examples/romfs/testdir/

nothing to commit, working tree clean
  Configuring...
  Copy files
  Select CONFIG_HOST_LINUX=y
  Refreshing...
  Building NuttX...
--2020-04-30 05:58:59--  https://github.com/ThrowTheSwitch/Unity/archive/v2.4.3.tar.gz
Resolving github.com (github.com)... 192.30.255.113
Connecting to github.com (github.com)|192.30.255.113|:443... connected.
HTTP request sent, awaiting response... 302 Found
Location: https://codeload.github.com/ThrowTheSwitch/Unity/tar.gz/v2.4.3 [following]
--2020-04-30 05:58:59--  https://codeload.github.com/ThrowTheSwitch/Unity/tar.gz/v2.4.3
Resolving codeload.github.com (codeload.github.com)... 192.30.255.121
Connecting to codeload.github.com (codeload.github.com)|192.30.255.121|:443... connected.
HTTP request sent, awaiting response... 200 OK
Length: unspecified [application/x-gzip]
Saving to: 'v2.4.3.tar.gz'

     0K .......... .......... .......... .......... .......... 5.38M
    50K .......... .......... .......... .......... .......... 11.2M
   100K .......... .......... .......... .......... .......... 30.5M
   150K .......... .......... .......... .......... .......... 3.05M
   200K .......... .......... .......... .......... .......... 4.76M
   250K .......                                                10.6M=0.04s

2020-04-30 05:58:59 (5.99 MB/s) - 'v2.4.3.tar.gz' saved [264150]

  Normalize sim/dsptest
====================================================================================
Configuration/Tool: qemu-i486/nsh
------------------------------------------------------------------------------------
  Cleaning...
On branch master
Your branch is up to date with 'origin/master'.

Ignored files:
  (use "git add -f <file>..." to include in what will be committed)

	libs/libc/exec_symtab.c
	tools/pic32/mkpichex

nothing to commit, working tree clean
On branch master
Your branch is up to date with 'origin/master'.

Ignored files:
  (use "git add -f <file>..." to include in what will be committed)

	examples/romfs/testdir/

nothing to commit, working tree clean
  Configuring...
  Copy files
  Select CONFIG_HOST_LINUX=y
  Refreshing...
  Building NuttX...
  Normalize qemu-i486/nsh
====================================================================================
Configuration/Tool: qemu-i486/ostest
------------------------------------------------------------------------------------
  Cleaning...
On branch master
Your branch is up to date with 'origin/master'.

Ignored files:
  (use "git add -f <file>..." to include in what will be committed)

	libs/libc/exec_symtab.c
	tools/pic32/mkpichex

nothing to commit, working tree clean
On branch master
Your branch is up to date with 'origin/master'.

Ignored files:
  (use "git add -f <file>..." to include in what will be committed)

	examples/romfs/testdir/

nothing to commit, working tree clean
  Configuring...
  Copy files
  Select CONFIG_HOST_LINUX=y
  Refreshing...
  Building NuttX...
  Normalize qemu-i486/ostest
====================================================================================
Configuration/Tool: esp32-core/smp
------------------------------------------------------------------------------------
  Cleaning...
On branch master
Your branch is up to date with 'origin/master'.

Ignored files:
  (use "git add -f <file>..." to include in what will be committed)

	libs/libc/exec_symtab.c
	tools/pic32/mkpichex

nothing to commit, working tree clean
On branch master
Your branch is up to date with 'origin/master'.

Ignored files:
  (use "git add -f <file>..." to include in what will be committed)

	examples/romfs/testdir/

nothing to commit, working tree clean
  Configuring...
  Copy files
  Select CONFIG_HOST_LINUX=y
  Refreshing...
  Building NuttX...
  Normalize esp32-core/smp
====================================================================================
Configuration/Tool: esp32-core/nsh
------------------------------------------------------------------------------------
  Cleaning...
On branch master
Your branch is up to date with 'origin/master'.

Ignored files:
  (use "git add -f <file>..." to include in what will be committed)

	libs/libc/exec_symtab.c
	tools/pic32/mkpichex

nothing to commit, working tree clean
On branch master
Your branch is up to date with 'origin/master'.

Ignored files:
  (use "git add -f <file>..." to include in what will be committed)

	examples/romfs/testdir/

nothing to commit, working tree clean
  Configuring...
  Copy files
  Select CONFIG_HOST_LINUX=y
  Refreshing...
  Building NuttX...
  Normalize esp32-core/nsh
====================================================================================
Configuration/Tool: esp32-core/ostest
------------------------------------------------------------------------------------
  Cleaning...
On branch master
Your branch is up to date with 'origin/master'.

Ignored files:
  (use "git add -f <file>..." to include in what will be committed)

	libs/libc/exec_symtab.c
	tools/pic32/mkpichex

nothing to commit, working tree clean
On branch master
Your branch is up to date with 'origin/master'.

Ignored files:
  (use "git add -f <file>..." to include in what will be committed)

	examples/romfs/testdir/

nothing to commit, working tree clean
  Configuring...
  Copy files
  Select CONFIG_HOST_LINUX=y
  Refreshing...
  Building NuttX...
  Normalize esp32-core/ostest
====================================================================================
Build step 'Execute shell' marked build as failure

Build failed in Jenkins: NuttX-Nightly-Build #110

Posted by Apache Jenkins Server <je...@builds.apache.org>.
See <https://builds.apache.org/job/NuttX-Nightly-Build/110/display/redirect>

Changes:


------------------------------------------
[...truncated 4.73 MB...]
	sched/pthread_mutexunlock.d
	sched/pthread_release.d
	sched/pthread_setaffinity.d
	sched/pthread_setschedparam.d
	sched/pthread_setschedprio.d
	sched/pthread_setspecific.d
	sched/pthread_sigmask.d
	sched/sched_addblocked.d
	sched/sched_addprioritized.d
	sched/sched_addreadytorun.d
	sched/sched_cpupause.d
	sched/sched_cpuselect.d
	sched/sched_foreach.d
	sched/sched_getaffinity.d
	sched/sched_getcpu.d
	sched/sched_getfiles.d
	sched/sched_getparam.d
	sched/sched_getscheduler.d
	sched/sched_getsockets.d
	sched/sched_getstreams.d
	sched/sched_gettcb.d
	sched/sched_idletask.d
	sched/sched_lock.d
	sched/sched_lockcount.d
	sched/sched_mergepending.d
	sched/sched_mergeprioritized.d
	sched/sched_note.d
	sched/sched_processtimer.d
	sched/sched_releasetcb.d
	sched/sched_removeblocked.d
	sched/sched_removereadytorun.d
	sched/sched_resumescheduler.d
	sched/sched_roundrobin.d
	sched/sched_rrgetinterval.d
	sched/sched_self.d
	sched/sched_setaffinity.d
	sched/sched_setparam.d
	sched/sched_setpriority.d
	sched/sched_setscheduler.d
	sched/sched_suspendscheduler.d
	sched/sched_tasklistlock.d
	sched/sched_thistask.d
	sched/sched_unlock.d
	sched/sched_verifytcb.d
	sched/sched_waitpid.d
	sched/sched_yield.d
	sched/sem_destroy.d
	sched/sem_post.d
	sched/sem_recover.d
	sched/sem_reset.d
	sched/sem_tickwait.d
	sched/sem_timedwait.d
	sched/sem_timeout.d
	sched/sem_trywait.d
	sched/sem_wait.d
	sched/sem_waitirq.d
	sched/sig_action.d
	sched/sig_allocpendingsigaction.d
	sched/sig_cleanup.d
	sched/sig_deliver.d
	sched/sig_dispatch.d
	sched/sig_findaction.d
	sched/sig_initialize.d
	sched/sig_kill.d
	sched/sig_lowest.d
	sched/sig_nanosleep.d
	sched/sig_notification.d
	sched/sig_pause.d
	sched/sig_pending.d
	sched/sig_ppoll.d
	sched/sig_procmask.d
	sched/sig_pselect.d
	sched/sig_queue.d
	sched/sig_releasependingsigaction.d
	sched/sig_releasependingsignal.d
	sched/sig_removependingsignal.d
	sched/sig_sleep.d
	sched/sig_suspend.d
	sched/sig_timedwait.d
	sched/sig_unmaskpendingsignal.d
	sched/sig_usleep.d
	sched/sig_waitinfo.d
	sched/spinlock.d
	sched/task_activate.d
	sched/task_create.d
	sched/task_delete.d
	sched/task_exit.d
	sched/task_exithook.d
	sched/task_getgroup.d
	sched/task_getpid.d
	sched/task_init.d
	sched/task_prctl.d
	sched/task_recover.d
	sched/task_restart.d
	sched/task_setcancelstate.d
	sched/task_setup.d
	sched/task_spawn.d
	sched/task_spawnparms.d
	sched/task_start.d
	sched/task_terminate.d
	sched/timer_create.d
	sched/timer_delete.d
	sched/timer_getitimer.d
	sched/timer_getoverrun.d
	sched/timer_gettime.d
	sched/timer_initialize.d
	sched/timer_release.d
	sched/timer_setitimer.d
	sched/timer_settime.d
	sched/wd_cancel.d
	sched/wd_create.d
	sched/wd_delete.d
	sched/wd_gettime.d
	sched/wd_initialize.d
	sched/wd_recover.d
	sched/wd_start.d
	tools/pic32/mkpichex
	uImage

nothing to commit, working tree clean
On branch master
Your branch is up to date with 'origin/master'.

Ignored files:
  (use "git add -f <file>..." to include in what will be committed)

	builtin/builtin_list.d
	builtin/builtin_list.home.jenkins.jenkins-slave.workspace.NuttX-Nightly-Build.apps.builtin.d
	builtin/exec_builtin.d
	builtin/exec_builtin.home.jenkins.jenkins-slave.workspace.NuttX-Nightly-Build.apps.builtin.d
	examples/hello/hello_main.d
	examples/hello/hello_main.home.jenkins.jenkins-slave.workspace.NuttX-Nightly-Build.apps.examples.hello.d
	examples/romfs/testdir/
	nshlib/nsh_builtin.d
	nshlib/nsh_builtin.home.jenkins.jenkins-slave.workspace.NuttX-Nightly-Build.apps.nshlib.d
	nshlib/nsh_command.d
	nshlib/nsh_command.home.jenkins.jenkins-slave.workspace.NuttX-Nightly-Build.apps.nshlib.d
	nshlib/nsh_console.d
	nshlib/nsh_console.home.jenkins.jenkins-slave.workspace.NuttX-Nightly-Build.apps.nshlib.d
	nshlib/nsh_consolemain.d
	nshlib/nsh_consolemain.home.jenkins.jenkins-slave.workspace.NuttX-Nightly-Build.apps.nshlib.d
	nshlib/nsh_dbgcmds.d
	nshlib/nsh_dbgcmds.home.jenkins.jenkins-slave.workspace.NuttX-Nightly-Build.apps.nshlib.d
	nshlib/nsh_ddcmd.d
	nshlib/nsh_ddcmd.home.jenkins.jenkins-slave.workspace.NuttX-Nightly-Build.apps.nshlib.d
	nshlib/nsh_envcmds.d
	nshlib/nsh_envcmds.home.jenkins.jenkins-slave.workspace.NuttX-Nightly-Build.apps.nshlib.d
	nshlib/nsh_fscmds.d
	nshlib/nsh_fscmds.home.jenkins.jenkins-slave.workspace.NuttX-Nightly-Build.apps.nshlib.d
	nshlib/nsh_fsutils.d
	nshlib/nsh_fsutils.home.jenkins.jenkins-slave.workspace.NuttX-Nightly-Build.apps.nshlib.d
	nshlib/nsh_init.d
	nshlib/nsh_init.home.jenkins.jenkins-slave.workspace.NuttX-Nightly-Build.apps.nshlib.d
	nshlib/nsh_mmcmds.d
	nshlib/nsh_mmcmds.home.jenkins.jenkins-slave.workspace.NuttX-Nightly-Build.apps.nshlib.d
	nshlib/nsh_mntcmds.d
	nshlib/nsh_mntcmds.home.jenkins.jenkins-slave.workspace.NuttX-Nightly-Build.apps.nshlib.d
	nshlib/nsh_parse.d
	nshlib/nsh_parse.home.jenkins.jenkins-slave.workspace.NuttX-Nightly-Build.apps.nshlib.d
	nshlib/nsh_proccmds.d
	nshlib/nsh_proccmds.home.jenkins.jenkins-slave.workspace.NuttX-Nightly-Build.apps.nshlib.d
	nshlib/nsh_script.d
	nshlib/nsh_script.home.jenkins.jenkins-slave.workspace.NuttX-Nightly-Build.apps.nshlib.d
	nshlib/nsh_session.d
	nshlib/nsh_session.home.jenkins.jenkins-slave.workspace.NuttX-Nightly-Build.apps.nshlib.d
	nshlib/nsh_syscmds.d
	nshlib/nsh_syscmds.home.jenkins.jenkins-slave.workspace.NuttX-Nightly-Build.apps.nshlib.d
	nshlib/nsh_system.d
	nshlib/nsh_system.home.jenkins.jenkins-slave.workspace.NuttX-Nightly-Build.apps.nshlib.d
	nshlib/nsh_test.d
	nshlib/nsh_test.home.jenkins.jenkins-slave.workspace.NuttX-Nightly-Build.apps.nshlib.d
	nshlib/nsh_timcmds.d
	nshlib/nsh_timcmds.home.jenkins.jenkins-slave.workspace.NuttX-Nightly-Build.apps.nshlib.d
	platform/dummy.d
	platform/dummy.home.jenkins.jenkins-slave.workspace.NuttX-Nightly-Build.apps.platform.d
	platform/gnu_cxxinitialize.d
	platform/gnu_cxxinitialize.home.jenkins.jenkins-slave.workspace.NuttX-Nightly-Build.apps.platform.d
	system/nsh/nsh_main.d
	system/nsh/nsh_main.home.jenkins.jenkins-slave.workspace.NuttX-Nightly-Build.apps.system.nsh.d
	system/nsh/sh_main.d
	system/nsh/sh_main.home.jenkins.jenkins-slave.workspace.NuttX-Nightly-Build.apps.system.nsh.d
	system/readline/readline.d
	system/readline/readline.home.jenkins.jenkins-slave.workspace.NuttX-Nightly-Build.apps.system.readline.d
	system/readline/readline_common.d
	system/readline/readline_common.home.jenkins.jenkins-slave.workspace.NuttX-Nightly-Build.apps.system.readline.d
	system/system/system.d
	system/system/system.home.jenkins.jenkins-slave.workspace.NuttX-Nightly-Build.apps.system.system.d
	system/taskset/taskset.d
	system/taskset/taskset.home.jenkins.jenkins-slave.workspace.NuttX-Nightly-Build.apps.system.taskset.d
	testing/ostest/barrier.d
	testing/ostest/barrier.home.jenkins.jenkins-slave.workspace.NuttX-Nightly-Build.apps.testing.ostest.d
	testing/ostest/cancel.d
	testing/ostest/cancel.home.jenkins.jenkins-slave.workspace.NuttX-Nightly-Build.apps.testing.ostest.d
	testing/ostest/cond.d
	testing/ostest/cond.home.jenkins.jenkins-slave.workspace.NuttX-Nightly-Build.apps.testing.ostest.d
	testing/ostest/dev_null.d
	testing/ostest/dev_null.home.jenkins.jenkins-slave.workspace.NuttX-Nightly-Build.apps.testing.ostest.d
	testing/ostest/mqueue.d
	testing/ostest/mqueue.home.jenkins.jenkins-slave.workspace.NuttX-Nightly-Build.apps.testing.ostest.d
	testing/ostest/mutex.d
	testing/ostest/mutex.home.jenkins.jenkins-slave.workspace.NuttX-Nightly-Build.apps.testing.ostest.d
	testing/ostest/ostest_main.d
	testing/ostest/ostest_main.home.jenkins.jenkins-slave.workspace.NuttX-Nightly-Build.apps.testing.ostest.d
	testing/ostest/posixtimer.d
	testing/ostest/posixtimer.home.jenkins.jenkins-slave.workspace.NuttX-Nightly-Build.apps.testing.ostest.d
	testing/ostest/pthread_rwlock.d
	testing/ostest/pthread_rwlock.home.jenkins.jenkins-slave.workspace.NuttX-Nightly-Build.apps.testing.ostest.d
	testing/ostest/pthread_rwlock_cancel.d
	testing/ostest/pthread_rwlock_cancel.home.jenkins.jenkins-slave.workspace.NuttX-Nightly-Build.apps.testing.ostest.d
	testing/ostest/restart.d
	testing/ostest/restart.home.jenkins.jenkins-slave.workspace.NuttX-Nightly-Build.apps.testing.ostest.d
	testing/ostest/robust.d
	testing/ostest/robust.home.jenkins.jenkins-slave.workspace.NuttX-Nightly-Build.apps.testing.ostest.d
	testing/ostest/roundrobin.d
	testing/ostest/roundrobin.home.jenkins.jenkins-slave.workspace.NuttX-Nightly-Build.apps.testing.ostest.d
	testing/ostest/sem.d
	testing/ostest/sem.home.jenkins.jenkins-slave.workspace.NuttX-Nightly-Build.apps.testing.ostest.d
	testing/ostest/semtimed.d
	testing/ostest/semtimed.home.jenkins.jenkins-slave.workspace.NuttX-Nightly-Build.apps.testing.ostest.d
	testing/ostest/setvbuf.d
	testing/ostest/setvbuf.home.jenkins.jenkins-slave.workspace.NuttX-Nightly-Build.apps.testing.ostest.d
	testing/ostest/sighand.d
	testing/ostest/sighand.home.jenkins.jenkins-slave.workspace.NuttX-Nightly-Build.apps.testing.ostest.d
	testing/ostest/signest.d
	testing/ostest/signest.home.jenkins.jenkins-slave.workspace.NuttX-Nightly-Build.apps.testing.ostest.d
	testing/ostest/sigprocmask.d
	testing/ostest/sigprocmask.home.jenkins.jenkins-slave.workspace.NuttX-Nightly-Build.apps.testing.ostest.d
	testing/ostest/specific.d
	testing/ostest/specific.home.jenkins.jenkins-slave.workspace.NuttX-Nightly-Build.apps.testing.ostest.d
	testing/ostest/timedmqueue.d
	testing/ostest/timedmqueue.home.jenkins.jenkins-slave.workspace.NuttX-Nightly-Build.apps.testing.ostest.d
	testing/ostest/timedmutex.d
	testing/ostest/timedmutex.home.jenkins.jenkins-slave.workspace.NuttX-Nightly-Build.apps.testing.ostest.d
	testing/ostest/timedwait.d
	testing/ostest/timedwait.home.jenkins.jenkins-slave.workspace.NuttX-Nightly-Build.apps.testing.ostest.d
	testing/ostest/waitpid.d
	testing/ostest/waitpid.home.jenkins.jenkins-slave.workspace.NuttX-Nightly-Build.apps.testing.ostest.d
	testing/smp/smp_main.d
	testing/smp/smp_main.home.jenkins.jenkins-slave.workspace.NuttX-Nightly-Build.apps.testing.smp.d

nothing to commit, working tree clean
  Configuring...
  Copy files
  Select CONFIG_HOST_LINUX=y
  Refreshing...
  Building NuttX...
  Normalize esp32-core/nsh
====================================================================================
Build step 'Execute shell' marked build as failure

Build failed in Jenkins: NuttX-Nightly-Build #109

Posted by Apache Jenkins Server <je...@builds.apache.org>.
See <https://builds.apache.org/job/NuttX-Nightly-Build/109/display/redirect>

Changes:


------------------------------------------
[...truncated 4.52 MB...]
	sched/pthread_setaffinity.d
	sched/pthread_setschedparam.d
	sched/pthread_setschedprio.d
	sched/pthread_setspecific.d
	sched/pthread_sigmask.d
	sched/sched_addblocked.d
	sched/sched_addprioritized.d
	sched/sched_addreadytorun.d
	sched/sched_cpupause.d
	sched/sched_cpuselect.d
	sched/sched_foreach.d
	sched/sched_getaffinity.d
	sched/sched_getcpu.d
	sched/sched_getfiles.d
	sched/sched_getparam.d
	sched/sched_getscheduler.d
	sched/sched_getsockets.d
	sched/sched_getstreams.d
	sched/sched_gettcb.d
	sched/sched_idletask.d
	sched/sched_lock.d
	sched/sched_lockcount.d
	sched/sched_mergepending.d
	sched/sched_mergeprioritized.d
	sched/sched_note.d
	sched/sched_processtimer.d
	sched/sched_releasetcb.d
	sched/sched_removeblocked.d
	sched/sched_removereadytorun.d
	sched/sched_resumescheduler.d
	sched/sched_roundrobin.d
	sched/sched_rrgetinterval.d
	sched/sched_self.d
	sched/sched_setaffinity.d
	sched/sched_setparam.d
	sched/sched_setpriority.d
	sched/sched_setscheduler.d
	sched/sched_suspendscheduler.d
	sched/sched_tasklistlock.d
	sched/sched_thistask.d
	sched/sched_unlock.d
	sched/sched_verifytcb.d
	sched/sched_waitpid.d
	sched/sched_yield.d
	sched/sem_destroy.d
	sched/sem_post.d
	sched/sem_recover.d
	sched/sem_reset.d
	sched/sem_tickwait.d
	sched/sem_timedwait.d
	sched/sem_timeout.d
	sched/sem_trywait.d
	sched/sem_wait.d
	sched/sem_waitirq.d
	sched/sig_action.d
	sched/sig_allocpendingsigaction.d
	sched/sig_cleanup.d
	sched/sig_deliver.d
	sched/sig_dispatch.d
	sched/sig_findaction.d
	sched/sig_initialize.d
	sched/sig_kill.d
	sched/sig_lowest.d
	sched/sig_nanosleep.d
	sched/sig_notification.d
	sched/sig_pause.d
	sched/sig_pending.d
	sched/sig_ppoll.d
	sched/sig_procmask.d
	sched/sig_pselect.d
	sched/sig_queue.d
	sched/sig_releasependingsigaction.d
	sched/sig_releasependingsignal.d
	sched/sig_removependingsignal.d
	sched/sig_sleep.d
	sched/sig_suspend.d
	sched/sig_timedwait.d
	sched/sig_unmaskpendingsignal.d
	sched/sig_usleep.d
	sched/sig_waitinfo.d
	sched/spinlock.d
	sched/task_activate.d
	sched/task_create.d
	sched/task_delete.d
	sched/task_exit.d
	sched/task_exithook.d
	sched/task_getgroup.d
	sched/task_getpid.d
	sched/task_init.d
	sched/task_prctl.d
	sched/task_recover.d
	sched/task_restart.d
	sched/task_setcancelstate.d
	sched/task_setup.d
	sched/task_spawn.d
	sched/task_spawnparms.d
	sched/task_start.d
	sched/task_terminate.d
	sched/timer_create.d
	sched/timer_delete.d
	sched/timer_getitimer.d
	sched/timer_getoverrun.d
	sched/timer_gettime.d
	sched/timer_initialize.d
	sched/timer_release.d
	sched/timer_setitimer.d
	sched/timer_settime.d
	sched/wd_cancel.d
	sched/wd_create.d
	sched/wd_delete.d
	sched/wd_gettime.d
	sched/wd_initialize.d
	sched/wd_recover.d
	sched/wd_start.d
	tools/pic32/mkpichex
	uImage

nothing to commit, working tree clean
On branch master
Your branch is up to date with 'origin/master'.

Ignored files:
  (use "git add -f <file>..." to include in what will be committed)

	builtin/builtin_list.d
	builtin/builtin_list.home.jenkins.jenkins-slave.workspace.NuttX-Nightly-Build.apps.builtin.d
	builtin/exec_builtin.d
	builtin/exec_builtin.home.jenkins.jenkins-slave.workspace.NuttX-Nightly-Build.apps.builtin.d
	examples/hello/hello_main.d
	examples/hello/hello_main.home.jenkins.jenkins-slave.workspace.NuttX-Nightly-Build.apps.examples.hello.d
	examples/romfs/testdir/
	examples/unionfs/romfs_atestdir.h
	examples/unionfs/romfs_btestdir.h
	nshlib/nsh_builtin.d
	nshlib/nsh_builtin.home.jenkins.jenkins-slave.workspace.NuttX-Nightly-Build.apps.nshlib.d
	nshlib/nsh_command.d
	nshlib/nsh_command.home.jenkins.jenkins-slave.workspace.NuttX-Nightly-Build.apps.nshlib.d
	nshlib/nsh_console.d
	nshlib/nsh_console.home.jenkins.jenkins-slave.workspace.NuttX-Nightly-Build.apps.nshlib.d
	nshlib/nsh_consolemain.d
	nshlib/nsh_consolemain.home.jenkins.jenkins-slave.workspace.NuttX-Nightly-Build.apps.nshlib.d
	nshlib/nsh_dbgcmds.d
	nshlib/nsh_dbgcmds.home.jenkins.jenkins-slave.workspace.NuttX-Nightly-Build.apps.nshlib.d
	nshlib/nsh_ddcmd.d
	nshlib/nsh_ddcmd.home.jenkins.jenkins-slave.workspace.NuttX-Nightly-Build.apps.nshlib.d
	nshlib/nsh_envcmds.d
	nshlib/nsh_envcmds.home.jenkins.jenkins-slave.workspace.NuttX-Nightly-Build.apps.nshlib.d
	nshlib/nsh_fscmds.d
	nshlib/nsh_fscmds.home.jenkins.jenkins-slave.workspace.NuttX-Nightly-Build.apps.nshlib.d
	nshlib/nsh_fsutils.d
	nshlib/nsh_fsutils.home.jenkins.jenkins-slave.workspace.NuttX-Nightly-Build.apps.nshlib.d
	nshlib/nsh_init.d
	nshlib/nsh_init.home.jenkins.jenkins-slave.workspace.NuttX-Nightly-Build.apps.nshlib.d
	nshlib/nsh_mmcmds.d
	nshlib/nsh_mmcmds.home.jenkins.jenkins-slave.workspace.NuttX-Nightly-Build.apps.nshlib.d
	nshlib/nsh_mntcmds.d
	nshlib/nsh_mntcmds.home.jenkins.jenkins-slave.workspace.NuttX-Nightly-Build.apps.nshlib.d
	nshlib/nsh_parse.d
	nshlib/nsh_parse.home.jenkins.jenkins-slave.workspace.NuttX-Nightly-Build.apps.nshlib.d
	nshlib/nsh_proccmds.d
	nshlib/nsh_proccmds.home.jenkins.jenkins-slave.workspace.NuttX-Nightly-Build.apps.nshlib.d
	nshlib/nsh_script.d
	nshlib/nsh_script.home.jenkins.jenkins-slave.workspace.NuttX-Nightly-Build.apps.nshlib.d
	nshlib/nsh_session.d
	nshlib/nsh_session.home.jenkins.jenkins-slave.workspace.NuttX-Nightly-Build.apps.nshlib.d
	nshlib/nsh_syscmds.d
	nshlib/nsh_syscmds.home.jenkins.jenkins-slave.workspace.NuttX-Nightly-Build.apps.nshlib.d
	nshlib/nsh_system.d
	nshlib/nsh_system.home.jenkins.jenkins-slave.workspace.NuttX-Nightly-Build.apps.nshlib.d
	nshlib/nsh_test.d
	nshlib/nsh_test.home.jenkins.jenkins-slave.workspace.NuttX-Nightly-Build.apps.nshlib.d
	nshlib/nsh_timcmds.d
	nshlib/nsh_timcmds.home.jenkins.jenkins-slave.workspace.NuttX-Nightly-Build.apps.nshlib.d
	platform/dummy.d
	platform/dummy.home.jenkins.jenkins-slave.workspace.NuttX-Nightly-Build.apps.platform.d
	platform/gnu_cxxinitialize.d
	platform/gnu_cxxinitialize.home.jenkins.jenkins-slave.workspace.NuttX-Nightly-Build.apps.platform.d
	system/nsh/nsh_main.d
	system/nsh/nsh_main.home.jenkins.jenkins-slave.workspace.NuttX-Nightly-Build.apps.system.nsh.d
	system/nsh/sh_main.d
	system/nsh/sh_main.home.jenkins.jenkins-slave.workspace.NuttX-Nightly-Build.apps.system.nsh.d
	system/readline/readline.d
	system/readline/readline.home.jenkins.jenkins-slave.workspace.NuttX-Nightly-Build.apps.system.readline.d
	system/readline/readline_common.d
	system/readline/readline_common.home.jenkins.jenkins-slave.workspace.NuttX-Nightly-Build.apps.system.readline.d
	system/system/system.d
	system/system/system.home.jenkins.jenkins-slave.workspace.NuttX-Nightly-Build.apps.system.system.d
	system/taskset/taskset.d
	system/taskset/taskset.home.jenkins.jenkins-slave.workspace.NuttX-Nightly-Build.apps.system.taskset.d
	testing/ostest/barrier.d
	testing/ostest/barrier.home.jenkins.jenkins-slave.workspace.NuttX-Nightly-Build.apps.testing.ostest.d
	testing/ostest/cancel.d
	testing/ostest/cancel.home.jenkins.jenkins-slave.workspace.NuttX-Nightly-Build.apps.testing.ostest.d
	testing/ostest/cond.d
	testing/ostest/cond.home.jenkins.jenkins-slave.workspace.NuttX-Nightly-Build.apps.testing.ostest.d
	testing/ostest/dev_null.d
	testing/ostest/dev_null.home.jenkins.jenkins-slave.workspace.NuttX-Nightly-Build.apps.testing.ostest.d
	testing/ostest/mqueue.d
	testing/ostest/mqueue.home.jenkins.jenkins-slave.workspace.NuttX-Nightly-Build.apps.testing.ostest.d
	testing/ostest/mutex.d
	testing/ostest/mutex.home.jenkins.jenkins-slave.workspace.NuttX-Nightly-Build.apps.testing.ostest.d
	testing/ostest/ostest_main.d
	testing/ostest/ostest_main.home.jenkins.jenkins-slave.workspace.NuttX-Nightly-Build.apps.testing.ostest.d
	testing/ostest/posixtimer.d
	testing/ostest/posixtimer.home.jenkins.jenkins-slave.workspace.NuttX-Nightly-Build.apps.testing.ostest.d
	testing/ostest/pthread_rwlock.d
	testing/ostest/pthread_rwlock.home.jenkins.jenkins-slave.workspace.NuttX-Nightly-Build.apps.testing.ostest.d
	testing/ostest/pthread_rwlock_cancel.d
	testing/ostest/pthread_rwlock_cancel.home.jenkins.jenkins-slave.workspace.NuttX-Nightly-Build.apps.testing.ostest.d
	testing/ostest/restart.d
	testing/ostest/restart.home.jenkins.jenkins-slave.workspace.NuttX-Nightly-Build.apps.testing.ostest.d
	testing/ostest/robust.d
	testing/ostest/robust.home.jenkins.jenkins-slave.workspace.NuttX-Nightly-Build.apps.testing.ostest.d
	testing/ostest/roundrobin.d
	testing/ostest/roundrobin.home.jenkins.jenkins-slave.workspace.NuttX-Nightly-Build.apps.testing.ostest.d
	testing/ostest/sem.d
	testing/ostest/sem.home.jenkins.jenkins-slave.workspace.NuttX-Nightly-Build.apps.testing.ostest.d
	testing/ostest/semtimed.d
	testing/ostest/semtimed.home.jenkins.jenkins-slave.workspace.NuttX-Nightly-Build.apps.testing.ostest.d
	testing/ostest/setvbuf.d
	testing/ostest/setvbuf.home.jenkins.jenkins-slave.workspace.NuttX-Nightly-Build.apps.testing.ostest.d
	testing/ostest/sighand.d
	testing/ostest/sighand.home.jenkins.jenkins-slave.workspace.NuttX-Nightly-Build.apps.testing.ostest.d
	testing/ostest/signest.d
	testing/ostest/signest.home.jenkins.jenkins-slave.workspace.NuttX-Nightly-Build.apps.testing.ostest.d
	testing/ostest/sigprocmask.d
	testing/ostest/sigprocmask.home.jenkins.jenkins-slave.workspace.NuttX-Nightly-Build.apps.testing.ostest.d
	testing/ostest/specific.d
	testing/ostest/specific.home.jenkins.jenkins-slave.workspace.NuttX-Nightly-Build.apps.testing.ostest.d
	testing/ostest/timedmqueue.d
	testing/ostest/timedmqueue.home.jenkins.jenkins-slave.workspace.NuttX-Nightly-Build.apps.testing.ostest.d
	testing/ostest/timedmutex.d
	testing/ostest/timedmutex.home.jenkins.jenkins-slave.workspace.NuttX-Nightly-Build.apps.testing.ostest.d
	testing/ostest/timedwait.d
	testing/ostest/timedwait.home.jenkins.jenkins-slave.workspace.NuttX-Nightly-Build.apps.testing.ostest.d
	testing/ostest/waitpid.d
	testing/ostest/waitpid.home.jenkins.jenkins-slave.workspace.NuttX-Nightly-Build.apps.testing.ostest.d
	testing/smp/smp_main.d
	testing/smp/smp_main.home.jenkins.jenkins-slave.workspace.NuttX-Nightly-Build.apps.testing.smp.d

nothing to commit, working tree clean
  Configuring...
  Copy files
  Select CONFIG_HOST_LINUX=y
  Refreshing...
  Building NuttX...
  Normalize esp32-core/ostest
====================================================================================
Build step 'Execute shell' marked build as failure

Build failed in Jenkins: NuttX-Nightly-Build #108

Posted by Apache Jenkins Server <je...@builds.apache.org>.
See <https://builds.apache.org/job/NuttX-Nightly-Build/108/display/redirect>

Changes:


------------------------------------------
[...truncated 4.52 MB...]
	sched/pthread_setaffinity.d
	sched/pthread_setschedparam.d
	sched/pthread_setschedprio.d
	sched/pthread_setspecific.d
	sched/pthread_sigmask.d
	sched/sched_addblocked.d
	sched/sched_addprioritized.d
	sched/sched_addreadytorun.d
	sched/sched_cpupause.d
	sched/sched_cpuselect.d
	sched/sched_foreach.d
	sched/sched_getaffinity.d
	sched/sched_getcpu.d
	sched/sched_getfiles.d
	sched/sched_getparam.d
	sched/sched_getscheduler.d
	sched/sched_getsockets.d
	sched/sched_getstreams.d
	sched/sched_gettcb.d
	sched/sched_idletask.d
	sched/sched_lock.d
	sched/sched_lockcount.d
	sched/sched_mergepending.d
	sched/sched_mergeprioritized.d
	sched/sched_note.d
	sched/sched_processtimer.d
	sched/sched_releasetcb.d
	sched/sched_removeblocked.d
	sched/sched_removereadytorun.d
	sched/sched_resumescheduler.d
	sched/sched_roundrobin.d
	sched/sched_rrgetinterval.d
	sched/sched_self.d
	sched/sched_setaffinity.d
	sched/sched_setparam.d
	sched/sched_setpriority.d
	sched/sched_setscheduler.d
	sched/sched_suspendscheduler.d
	sched/sched_tasklistlock.d
	sched/sched_thistask.d
	sched/sched_unlock.d
	sched/sched_verifytcb.d
	sched/sched_waitpid.d
	sched/sched_yield.d
	sched/sem_destroy.d
	sched/sem_post.d
	sched/sem_recover.d
	sched/sem_reset.d
	sched/sem_tickwait.d
	sched/sem_timedwait.d
	sched/sem_timeout.d
	sched/sem_trywait.d
	sched/sem_wait.d
	sched/sem_waitirq.d
	sched/sig_action.d
	sched/sig_allocpendingsigaction.d
	sched/sig_cleanup.d
	sched/sig_deliver.d
	sched/sig_dispatch.d
	sched/sig_findaction.d
	sched/sig_initialize.d
	sched/sig_kill.d
	sched/sig_lowest.d
	sched/sig_nanosleep.d
	sched/sig_notification.d
	sched/sig_pause.d
	sched/sig_pending.d
	sched/sig_ppoll.d
	sched/sig_procmask.d
	sched/sig_pselect.d
	sched/sig_queue.d
	sched/sig_releasependingsigaction.d
	sched/sig_releasependingsignal.d
	sched/sig_removependingsignal.d
	sched/sig_sleep.d
	sched/sig_suspend.d
	sched/sig_timedwait.d
	sched/sig_unmaskpendingsignal.d
	sched/sig_usleep.d
	sched/sig_waitinfo.d
	sched/spinlock.d
	sched/task_activate.d
	sched/task_create.d
	sched/task_delete.d
	sched/task_exit.d
	sched/task_exithook.d
	sched/task_getgroup.d
	sched/task_getpid.d
	sched/task_init.d
	sched/task_prctl.d
	sched/task_recover.d
	sched/task_restart.d
	sched/task_setcancelstate.d
	sched/task_setup.d
	sched/task_spawn.d
	sched/task_spawnparms.d
	sched/task_start.d
	sched/task_terminate.d
	sched/timer_create.d
	sched/timer_delete.d
	sched/timer_getitimer.d
	sched/timer_getoverrun.d
	sched/timer_gettime.d
	sched/timer_initialize.d
	sched/timer_release.d
	sched/timer_setitimer.d
	sched/timer_settime.d
	sched/wd_cancel.d
	sched/wd_create.d
	sched/wd_delete.d
	sched/wd_gettime.d
	sched/wd_initialize.d
	sched/wd_recover.d
	sched/wd_start.d
	tools/pic32/mkpichex
	uImage

nothing to commit, working tree clean
On branch master
Your branch is up to date with 'origin/master'.

Ignored files:
  (use "git add -f <file>..." to include in what will be committed)

	builtin/builtin_list.d
	builtin/builtin_list.home.jenkins.jenkins-slave.workspace.NuttX-Nightly-Build.apps.builtin.d
	builtin/exec_builtin.d
	builtin/exec_builtin.home.jenkins.jenkins-slave.workspace.NuttX-Nightly-Build.apps.builtin.d
	examples/hello/hello_main.d
	examples/hello/hello_main.home.jenkins.jenkins-slave.workspace.NuttX-Nightly-Build.apps.examples.hello.d
	examples/romfs/testdir/
	examples/unionfs/romfs_atestdir.h
	examples/unionfs/romfs_btestdir.h
	nshlib/nsh_builtin.d
	nshlib/nsh_builtin.home.jenkins.jenkins-slave.workspace.NuttX-Nightly-Build.apps.nshlib.d
	nshlib/nsh_command.d
	nshlib/nsh_command.home.jenkins.jenkins-slave.workspace.NuttX-Nightly-Build.apps.nshlib.d
	nshlib/nsh_console.d
	nshlib/nsh_console.home.jenkins.jenkins-slave.workspace.NuttX-Nightly-Build.apps.nshlib.d
	nshlib/nsh_consolemain.d
	nshlib/nsh_consolemain.home.jenkins.jenkins-slave.workspace.NuttX-Nightly-Build.apps.nshlib.d
	nshlib/nsh_dbgcmds.d
	nshlib/nsh_dbgcmds.home.jenkins.jenkins-slave.workspace.NuttX-Nightly-Build.apps.nshlib.d
	nshlib/nsh_ddcmd.d
	nshlib/nsh_ddcmd.home.jenkins.jenkins-slave.workspace.NuttX-Nightly-Build.apps.nshlib.d
	nshlib/nsh_envcmds.d
	nshlib/nsh_envcmds.home.jenkins.jenkins-slave.workspace.NuttX-Nightly-Build.apps.nshlib.d
	nshlib/nsh_fscmds.d
	nshlib/nsh_fscmds.home.jenkins.jenkins-slave.workspace.NuttX-Nightly-Build.apps.nshlib.d
	nshlib/nsh_fsutils.d
	nshlib/nsh_fsutils.home.jenkins.jenkins-slave.workspace.NuttX-Nightly-Build.apps.nshlib.d
	nshlib/nsh_init.d
	nshlib/nsh_init.home.jenkins.jenkins-slave.workspace.NuttX-Nightly-Build.apps.nshlib.d
	nshlib/nsh_mmcmds.d
	nshlib/nsh_mmcmds.home.jenkins.jenkins-slave.workspace.NuttX-Nightly-Build.apps.nshlib.d
	nshlib/nsh_mntcmds.d
	nshlib/nsh_mntcmds.home.jenkins.jenkins-slave.workspace.NuttX-Nightly-Build.apps.nshlib.d
	nshlib/nsh_parse.d
	nshlib/nsh_parse.home.jenkins.jenkins-slave.workspace.NuttX-Nightly-Build.apps.nshlib.d
	nshlib/nsh_proccmds.d
	nshlib/nsh_proccmds.home.jenkins.jenkins-slave.workspace.NuttX-Nightly-Build.apps.nshlib.d
	nshlib/nsh_script.d
	nshlib/nsh_script.home.jenkins.jenkins-slave.workspace.NuttX-Nightly-Build.apps.nshlib.d
	nshlib/nsh_session.d
	nshlib/nsh_session.home.jenkins.jenkins-slave.workspace.NuttX-Nightly-Build.apps.nshlib.d
	nshlib/nsh_syscmds.d
	nshlib/nsh_syscmds.home.jenkins.jenkins-slave.workspace.NuttX-Nightly-Build.apps.nshlib.d
	nshlib/nsh_system.d
	nshlib/nsh_system.home.jenkins.jenkins-slave.workspace.NuttX-Nightly-Build.apps.nshlib.d
	nshlib/nsh_test.d
	nshlib/nsh_test.home.jenkins.jenkins-slave.workspace.NuttX-Nightly-Build.apps.nshlib.d
	nshlib/nsh_timcmds.d
	nshlib/nsh_timcmds.home.jenkins.jenkins-slave.workspace.NuttX-Nightly-Build.apps.nshlib.d
	platform/dummy.d
	platform/dummy.home.jenkins.jenkins-slave.workspace.NuttX-Nightly-Build.apps.platform.d
	platform/gnu_cxxinitialize.d
	platform/gnu_cxxinitialize.home.jenkins.jenkins-slave.workspace.NuttX-Nightly-Build.apps.platform.d
	system/nsh/nsh_main.d
	system/nsh/nsh_main.home.jenkins.jenkins-slave.workspace.NuttX-Nightly-Build.apps.system.nsh.d
	system/nsh/sh_main.d
	system/nsh/sh_main.home.jenkins.jenkins-slave.workspace.NuttX-Nightly-Build.apps.system.nsh.d
	system/readline/readline.d
	system/readline/readline.home.jenkins.jenkins-slave.workspace.NuttX-Nightly-Build.apps.system.readline.d
	system/readline/readline_common.d
	system/readline/readline_common.home.jenkins.jenkins-slave.workspace.NuttX-Nightly-Build.apps.system.readline.d
	system/system/system.d
	system/system/system.home.jenkins.jenkins-slave.workspace.NuttX-Nightly-Build.apps.system.system.d
	system/taskset/taskset.d
	system/taskset/taskset.home.jenkins.jenkins-slave.workspace.NuttX-Nightly-Build.apps.system.taskset.d
	testing/ostest/barrier.d
	testing/ostest/barrier.home.jenkins.jenkins-slave.workspace.NuttX-Nightly-Build.apps.testing.ostest.d
	testing/ostest/cancel.d
	testing/ostest/cancel.home.jenkins.jenkins-slave.workspace.NuttX-Nightly-Build.apps.testing.ostest.d
	testing/ostest/cond.d
	testing/ostest/cond.home.jenkins.jenkins-slave.workspace.NuttX-Nightly-Build.apps.testing.ostest.d
	testing/ostest/dev_null.d
	testing/ostest/dev_null.home.jenkins.jenkins-slave.workspace.NuttX-Nightly-Build.apps.testing.ostest.d
	testing/ostest/mqueue.d
	testing/ostest/mqueue.home.jenkins.jenkins-slave.workspace.NuttX-Nightly-Build.apps.testing.ostest.d
	testing/ostest/mutex.d
	testing/ostest/mutex.home.jenkins.jenkins-slave.workspace.NuttX-Nightly-Build.apps.testing.ostest.d
	testing/ostest/ostest_main.d
	testing/ostest/ostest_main.home.jenkins.jenkins-slave.workspace.NuttX-Nightly-Build.apps.testing.ostest.d
	testing/ostest/posixtimer.d
	testing/ostest/posixtimer.home.jenkins.jenkins-slave.workspace.NuttX-Nightly-Build.apps.testing.ostest.d
	testing/ostest/pthread_rwlock.d
	testing/ostest/pthread_rwlock.home.jenkins.jenkins-slave.workspace.NuttX-Nightly-Build.apps.testing.ostest.d
	testing/ostest/pthread_rwlock_cancel.d
	testing/ostest/pthread_rwlock_cancel.home.jenkins.jenkins-slave.workspace.NuttX-Nightly-Build.apps.testing.ostest.d
	testing/ostest/restart.d
	testing/ostest/restart.home.jenkins.jenkins-slave.workspace.NuttX-Nightly-Build.apps.testing.ostest.d
	testing/ostest/robust.d
	testing/ostest/robust.home.jenkins.jenkins-slave.workspace.NuttX-Nightly-Build.apps.testing.ostest.d
	testing/ostest/roundrobin.d
	testing/ostest/roundrobin.home.jenkins.jenkins-slave.workspace.NuttX-Nightly-Build.apps.testing.ostest.d
	testing/ostest/sem.d
	testing/ostest/sem.home.jenkins.jenkins-slave.workspace.NuttX-Nightly-Build.apps.testing.ostest.d
	testing/ostest/semtimed.d
	testing/ostest/semtimed.home.jenkins.jenkins-slave.workspace.NuttX-Nightly-Build.apps.testing.ostest.d
	testing/ostest/setvbuf.d
	testing/ostest/setvbuf.home.jenkins.jenkins-slave.workspace.NuttX-Nightly-Build.apps.testing.ostest.d
	testing/ostest/sighand.d
	testing/ostest/sighand.home.jenkins.jenkins-slave.workspace.NuttX-Nightly-Build.apps.testing.ostest.d
	testing/ostest/signest.d
	testing/ostest/signest.home.jenkins.jenkins-slave.workspace.NuttX-Nightly-Build.apps.testing.ostest.d
	testing/ostest/sigprocmask.d
	testing/ostest/sigprocmask.home.jenkins.jenkins-slave.workspace.NuttX-Nightly-Build.apps.testing.ostest.d
	testing/ostest/specific.d
	testing/ostest/specific.home.jenkins.jenkins-slave.workspace.NuttX-Nightly-Build.apps.testing.ostest.d
	testing/ostest/timedmqueue.d
	testing/ostest/timedmqueue.home.jenkins.jenkins-slave.workspace.NuttX-Nightly-Build.apps.testing.ostest.d
	testing/ostest/timedmutex.d
	testing/ostest/timedmutex.home.jenkins.jenkins-slave.workspace.NuttX-Nightly-Build.apps.testing.ostest.d
	testing/ostest/timedwait.d
	testing/ostest/timedwait.home.jenkins.jenkins-slave.workspace.NuttX-Nightly-Build.apps.testing.ostest.d
	testing/ostest/waitpid.d
	testing/ostest/waitpid.home.jenkins.jenkins-slave.workspace.NuttX-Nightly-Build.apps.testing.ostest.d
	testing/smp/smp_main.d
	testing/smp/smp_main.home.jenkins.jenkins-slave.workspace.NuttX-Nightly-Build.apps.testing.smp.d

nothing to commit, working tree clean
  Configuring...
  Copy files
  Select CONFIG_HOST_LINUX=y
  Refreshing...
  Building NuttX...
  Normalize esp32-core/ostest
====================================================================================
Build step 'Execute shell' marked build as failure

Build failed in Jenkins: NuttX-Nightly-Build #107

Posted by Apache Jenkins Server <je...@builds.apache.org>.
See <https://builds.apache.org/job/NuttX-Nightly-Build/107/display/redirect>

Changes:


------------------------------------------
[...truncated 4.52 MB...]
	sched/pthread_setaffinity.d
	sched/pthread_setschedparam.d
	sched/pthread_setschedprio.d
	sched/pthread_setspecific.d
	sched/pthread_sigmask.d
	sched/sched_addblocked.d
	sched/sched_addprioritized.d
	sched/sched_addreadytorun.d
	sched/sched_cpupause.d
	sched/sched_cpuselect.d
	sched/sched_foreach.d
	sched/sched_getaffinity.d
	sched/sched_getcpu.d
	sched/sched_getfiles.d
	sched/sched_getparam.d
	sched/sched_getscheduler.d
	sched/sched_getsockets.d
	sched/sched_getstreams.d
	sched/sched_gettcb.d
	sched/sched_idletask.d
	sched/sched_lock.d
	sched/sched_lockcount.d
	sched/sched_mergepending.d
	sched/sched_mergeprioritized.d
	sched/sched_note.d
	sched/sched_processtimer.d
	sched/sched_releasetcb.d
	sched/sched_removeblocked.d
	sched/sched_removereadytorun.d
	sched/sched_resumescheduler.d
	sched/sched_roundrobin.d
	sched/sched_rrgetinterval.d
	sched/sched_self.d
	sched/sched_setaffinity.d
	sched/sched_setparam.d
	sched/sched_setpriority.d
	sched/sched_setscheduler.d
	sched/sched_suspendscheduler.d
	sched/sched_tasklistlock.d
	sched/sched_thistask.d
	sched/sched_unlock.d
	sched/sched_verifytcb.d
	sched/sched_waitpid.d
	sched/sched_yield.d
	sched/sem_destroy.d
	sched/sem_post.d
	sched/sem_recover.d
	sched/sem_reset.d
	sched/sem_tickwait.d
	sched/sem_timedwait.d
	sched/sem_timeout.d
	sched/sem_trywait.d
	sched/sem_wait.d
	sched/sem_waitirq.d
	sched/sig_action.d
	sched/sig_allocpendingsigaction.d
	sched/sig_cleanup.d
	sched/sig_deliver.d
	sched/sig_dispatch.d
	sched/sig_findaction.d
	sched/sig_initialize.d
	sched/sig_kill.d
	sched/sig_lowest.d
	sched/sig_nanosleep.d
	sched/sig_notification.d
	sched/sig_pause.d
	sched/sig_pending.d
	sched/sig_ppoll.d
	sched/sig_procmask.d
	sched/sig_pselect.d
	sched/sig_queue.d
	sched/sig_releasependingsigaction.d
	sched/sig_releasependingsignal.d
	sched/sig_removependingsignal.d
	sched/sig_sleep.d
	sched/sig_suspend.d
	sched/sig_timedwait.d
	sched/sig_unmaskpendingsignal.d
	sched/sig_usleep.d
	sched/sig_waitinfo.d
	sched/spinlock.d
	sched/task_activate.d
	sched/task_create.d
	sched/task_delete.d
	sched/task_exit.d
	sched/task_exithook.d
	sched/task_getgroup.d
	sched/task_getpid.d
	sched/task_init.d
	sched/task_prctl.d
	sched/task_recover.d
	sched/task_restart.d
	sched/task_setcancelstate.d
	sched/task_setup.d
	sched/task_spawn.d
	sched/task_spawnparms.d
	sched/task_start.d
	sched/task_terminate.d
	sched/timer_create.d
	sched/timer_delete.d
	sched/timer_getitimer.d
	sched/timer_getoverrun.d
	sched/timer_gettime.d
	sched/timer_initialize.d
	sched/timer_release.d
	sched/timer_setitimer.d
	sched/timer_settime.d
	sched/wd_cancel.d
	sched/wd_create.d
	sched/wd_delete.d
	sched/wd_gettime.d
	sched/wd_initialize.d
	sched/wd_recover.d
	sched/wd_start.d
	tools/pic32/mkpichex
	uImage

nothing to commit, working tree clean
On branch master
Your branch is up to date with 'origin/master'.

Ignored files:
  (use "git add -f <file>..." to include in what will be committed)

	builtin/builtin_list.d
	builtin/builtin_list.home.jenkins.jenkins-slave.workspace.NuttX-Nightly-Build.apps.builtin.d
	builtin/exec_builtin.d
	builtin/exec_builtin.home.jenkins.jenkins-slave.workspace.NuttX-Nightly-Build.apps.builtin.d
	examples/hello/hello_main.d
	examples/hello/hello_main.home.jenkins.jenkins-slave.workspace.NuttX-Nightly-Build.apps.examples.hello.d
	examples/romfs/testdir/
	examples/unionfs/romfs_atestdir.h
	examples/unionfs/romfs_btestdir.h
	nshlib/nsh_builtin.d
	nshlib/nsh_builtin.home.jenkins.jenkins-slave.workspace.NuttX-Nightly-Build.apps.nshlib.d
	nshlib/nsh_command.d
	nshlib/nsh_command.home.jenkins.jenkins-slave.workspace.NuttX-Nightly-Build.apps.nshlib.d
	nshlib/nsh_console.d
	nshlib/nsh_console.home.jenkins.jenkins-slave.workspace.NuttX-Nightly-Build.apps.nshlib.d
	nshlib/nsh_consolemain.d
	nshlib/nsh_consolemain.home.jenkins.jenkins-slave.workspace.NuttX-Nightly-Build.apps.nshlib.d
	nshlib/nsh_dbgcmds.d
	nshlib/nsh_dbgcmds.home.jenkins.jenkins-slave.workspace.NuttX-Nightly-Build.apps.nshlib.d
	nshlib/nsh_ddcmd.d
	nshlib/nsh_ddcmd.home.jenkins.jenkins-slave.workspace.NuttX-Nightly-Build.apps.nshlib.d
	nshlib/nsh_envcmds.d
	nshlib/nsh_envcmds.home.jenkins.jenkins-slave.workspace.NuttX-Nightly-Build.apps.nshlib.d
	nshlib/nsh_fscmds.d
	nshlib/nsh_fscmds.home.jenkins.jenkins-slave.workspace.NuttX-Nightly-Build.apps.nshlib.d
	nshlib/nsh_fsutils.d
	nshlib/nsh_fsutils.home.jenkins.jenkins-slave.workspace.NuttX-Nightly-Build.apps.nshlib.d
	nshlib/nsh_init.d
	nshlib/nsh_init.home.jenkins.jenkins-slave.workspace.NuttX-Nightly-Build.apps.nshlib.d
	nshlib/nsh_mmcmds.d
	nshlib/nsh_mmcmds.home.jenkins.jenkins-slave.workspace.NuttX-Nightly-Build.apps.nshlib.d
	nshlib/nsh_mntcmds.d
	nshlib/nsh_mntcmds.home.jenkins.jenkins-slave.workspace.NuttX-Nightly-Build.apps.nshlib.d
	nshlib/nsh_parse.d
	nshlib/nsh_parse.home.jenkins.jenkins-slave.workspace.NuttX-Nightly-Build.apps.nshlib.d
	nshlib/nsh_proccmds.d
	nshlib/nsh_proccmds.home.jenkins.jenkins-slave.workspace.NuttX-Nightly-Build.apps.nshlib.d
	nshlib/nsh_script.d
	nshlib/nsh_script.home.jenkins.jenkins-slave.workspace.NuttX-Nightly-Build.apps.nshlib.d
	nshlib/nsh_session.d
	nshlib/nsh_session.home.jenkins.jenkins-slave.workspace.NuttX-Nightly-Build.apps.nshlib.d
	nshlib/nsh_syscmds.d
	nshlib/nsh_syscmds.home.jenkins.jenkins-slave.workspace.NuttX-Nightly-Build.apps.nshlib.d
	nshlib/nsh_system.d
	nshlib/nsh_system.home.jenkins.jenkins-slave.workspace.NuttX-Nightly-Build.apps.nshlib.d
	nshlib/nsh_test.d
	nshlib/nsh_test.home.jenkins.jenkins-slave.workspace.NuttX-Nightly-Build.apps.nshlib.d
	nshlib/nsh_timcmds.d
	nshlib/nsh_timcmds.home.jenkins.jenkins-slave.workspace.NuttX-Nightly-Build.apps.nshlib.d
	platform/dummy.d
	platform/dummy.home.jenkins.jenkins-slave.workspace.NuttX-Nightly-Build.apps.platform.d
	platform/gnu_cxxinitialize.d
	platform/gnu_cxxinitialize.home.jenkins.jenkins-slave.workspace.NuttX-Nightly-Build.apps.platform.d
	system/nsh/nsh_main.d
	system/nsh/nsh_main.home.jenkins.jenkins-slave.workspace.NuttX-Nightly-Build.apps.system.nsh.d
	system/nsh/sh_main.d
	system/nsh/sh_main.home.jenkins.jenkins-slave.workspace.NuttX-Nightly-Build.apps.system.nsh.d
	system/readline/readline.d
	system/readline/readline.home.jenkins.jenkins-slave.workspace.NuttX-Nightly-Build.apps.system.readline.d
	system/readline/readline_common.d
	system/readline/readline_common.home.jenkins.jenkins-slave.workspace.NuttX-Nightly-Build.apps.system.readline.d
	system/system/system.d
	system/system/system.home.jenkins.jenkins-slave.workspace.NuttX-Nightly-Build.apps.system.system.d
	system/taskset/taskset.d
	system/taskset/taskset.home.jenkins.jenkins-slave.workspace.NuttX-Nightly-Build.apps.system.taskset.d
	testing/ostest/barrier.d
	testing/ostest/barrier.home.jenkins.jenkins-slave.workspace.NuttX-Nightly-Build.apps.testing.ostest.d
	testing/ostest/cancel.d
	testing/ostest/cancel.home.jenkins.jenkins-slave.workspace.NuttX-Nightly-Build.apps.testing.ostest.d
	testing/ostest/cond.d
	testing/ostest/cond.home.jenkins.jenkins-slave.workspace.NuttX-Nightly-Build.apps.testing.ostest.d
	testing/ostest/dev_null.d
	testing/ostest/dev_null.home.jenkins.jenkins-slave.workspace.NuttX-Nightly-Build.apps.testing.ostest.d
	testing/ostest/mqueue.d
	testing/ostest/mqueue.home.jenkins.jenkins-slave.workspace.NuttX-Nightly-Build.apps.testing.ostest.d
	testing/ostest/mutex.d
	testing/ostest/mutex.home.jenkins.jenkins-slave.workspace.NuttX-Nightly-Build.apps.testing.ostest.d
	testing/ostest/ostest_main.d
	testing/ostest/ostest_main.home.jenkins.jenkins-slave.workspace.NuttX-Nightly-Build.apps.testing.ostest.d
	testing/ostest/posixtimer.d
	testing/ostest/posixtimer.home.jenkins.jenkins-slave.workspace.NuttX-Nightly-Build.apps.testing.ostest.d
	testing/ostest/pthread_rwlock.d
	testing/ostest/pthread_rwlock.home.jenkins.jenkins-slave.workspace.NuttX-Nightly-Build.apps.testing.ostest.d
	testing/ostest/pthread_rwlock_cancel.d
	testing/ostest/pthread_rwlock_cancel.home.jenkins.jenkins-slave.workspace.NuttX-Nightly-Build.apps.testing.ostest.d
	testing/ostest/restart.d
	testing/ostest/restart.home.jenkins.jenkins-slave.workspace.NuttX-Nightly-Build.apps.testing.ostest.d
	testing/ostest/robust.d
	testing/ostest/robust.home.jenkins.jenkins-slave.workspace.NuttX-Nightly-Build.apps.testing.ostest.d
	testing/ostest/roundrobin.d
	testing/ostest/roundrobin.home.jenkins.jenkins-slave.workspace.NuttX-Nightly-Build.apps.testing.ostest.d
	testing/ostest/sem.d
	testing/ostest/sem.home.jenkins.jenkins-slave.workspace.NuttX-Nightly-Build.apps.testing.ostest.d
	testing/ostest/semtimed.d
	testing/ostest/semtimed.home.jenkins.jenkins-slave.workspace.NuttX-Nightly-Build.apps.testing.ostest.d
	testing/ostest/setvbuf.d
	testing/ostest/setvbuf.home.jenkins.jenkins-slave.workspace.NuttX-Nightly-Build.apps.testing.ostest.d
	testing/ostest/sighand.d
	testing/ostest/sighand.home.jenkins.jenkins-slave.workspace.NuttX-Nightly-Build.apps.testing.ostest.d
	testing/ostest/signest.d
	testing/ostest/signest.home.jenkins.jenkins-slave.workspace.NuttX-Nightly-Build.apps.testing.ostest.d
	testing/ostest/sigprocmask.d
	testing/ostest/sigprocmask.home.jenkins.jenkins-slave.workspace.NuttX-Nightly-Build.apps.testing.ostest.d
	testing/ostest/specific.d
	testing/ostest/specific.home.jenkins.jenkins-slave.workspace.NuttX-Nightly-Build.apps.testing.ostest.d
	testing/ostest/timedmqueue.d
	testing/ostest/timedmqueue.home.jenkins.jenkins-slave.workspace.NuttX-Nightly-Build.apps.testing.ostest.d
	testing/ostest/timedmutex.d
	testing/ostest/timedmutex.home.jenkins.jenkins-slave.workspace.NuttX-Nightly-Build.apps.testing.ostest.d
	testing/ostest/timedwait.d
	testing/ostest/timedwait.home.jenkins.jenkins-slave.workspace.NuttX-Nightly-Build.apps.testing.ostest.d
	testing/ostest/waitpid.d
	testing/ostest/waitpid.home.jenkins.jenkins-slave.workspace.NuttX-Nightly-Build.apps.testing.ostest.d
	testing/smp/smp_main.d
	testing/smp/smp_main.home.jenkins.jenkins-slave.workspace.NuttX-Nightly-Build.apps.testing.smp.d

nothing to commit, working tree clean
  Configuring...
  Copy files
  Select CONFIG_HOST_LINUX=y
  Refreshing...
  Building NuttX...
  Normalize esp32-core/ostest
====================================================================================
Build step 'Execute shell' marked build as failure