You are viewing a plain text version of this content. The canonical link for it is here.
Posted to dev@hbase.apache.org by Apache Jenkins Server <je...@builds.apache.org> on 2012/04/14 03:13:45 UTC
Build failed in Jenkins: HBase-TRUNK #2758
See <https://builds.apache.org/job/HBase-TRUNK/2758/>
------------------------------------------
[...truncated 17752 lines...]
Tests run: 1, Failures: 0, Errors: 0, Skipped: 0, Time elapsed: 1.373 sec
Forking command line: /bin/sh -c cd <https://builds.apache.org/job/HBase-TRUNK/ws/trunk> && /home/jenkins/tools/java/jdk1.6.0_27-32/jre/bin/java -enableassertions -Xmx1900m -Djava.security.egd=file:/dev/./urandom -jar <https://builds.apache.org/job/HBase-TRUNK/ws/trunk/target/surefire/surefirebooter8286439893516522676.jar> <https://builds.apache.org/job/HBase-TRUNK/ws/trunk/target/surefire/surefire1478216194695610965tmp> <https://builds.apache.org/job/HBase-TRUNK/ws/trunk/target/surefire/surefire_53995468656111424110tmp>
Running org.apache.hadoop.hbase.regionserver.handler.TestCloseRegionHandler
Tests run: 3, Failures: 0, Errors: 0, Skipped: 0, Time elapsed: 1.482 sec
Forking command line: /bin/sh -c cd <https://builds.apache.org/job/HBase-TRUNK/ws/trunk> && /home/jenkins/tools/java/jdk1.6.0_27-32/jre/bin/java -enableassertions -Xmx1900m -Djava.security.egd=file:/dev/./urandom -jar <https://builds.apache.org/job/HBase-TRUNK/ws/trunk/target/surefire/surefirebooter3087130131011720201.jar> <https://builds.apache.org/job/HBase-TRUNK/ws/trunk/target/surefire/surefire963608962836929360tmp> <https://builds.apache.org/job/HBase-TRUNK/ws/trunk/target/surefire/surefire_54179387285079547367tmp>
Running org.apache.hadoop.hbase.regionserver.handler.TestOpenRegionHandler
Tests run: 3, Failures: 0, Errors: 0, Skipped: 0, Time elapsed: 1.557 sec
Forking command line: /bin/sh -c cd <https://builds.apache.org/job/HBase-TRUNK/ws/trunk> && /home/jenkins/tools/java/jdk1.6.0_27-32/jre/bin/java -enableassertions -Xmx1900m -Djava.security.egd=file:/dev/./urandom -jar <https://builds.apache.org/job/HBase-TRUNK/ws/trunk/target/surefire/surefirebooter5887744632372105751.jar> <https://builds.apache.org/job/HBase-TRUNK/ws/trunk/target/surefire/surefire8935352981655604782tmp> <https://builds.apache.org/job/HBase-TRUNK/ws/trunk/target/surefire/surefire_558164968433684291362tmp>
Running org.apache.hadoop.hbase.regionserver.wal.TestWALReplayCompressed
Tests run: 5, Failures: 0, Errors: 0, Skipped: 0, Time elapsed: 34.396 sec
Running org.apache.hadoop.hbase.filter.TestColumnRangeFilter
Tests run: 1, Failures: 0, Errors: 0, Skipped: 0, Time elapsed: 27.461 sec
Forking command line: /bin/sh -c cd <https://builds.apache.org/job/HBase-TRUNK/ws/trunk> && /home/jenkins/tools/java/jdk1.6.0_27-32/jre/bin/java -enableassertions -Xmx1900m -Djava.security.egd=file:/dev/./urandom -jar <https://builds.apache.org/job/HBase-TRUNK/ws/trunk/target/surefire/surefirebooter6311448812070496477.jar> <https://builds.apache.org/job/HBase-TRUNK/ws/trunk/target/surefire/surefire9095511050991643164tmp> <https://builds.apache.org/job/HBase-TRUNK/ws/trunk/target/surefire/surefire_567183637270701706462tmp>
Running org.apache.hadoop.hbase.coprocessor.TestClassLoading
Tests run: 6, Failures: 0, Errors: 0, Skipped: 0, Time elapsed: 31.453 sec
Forking command line: /bin/sh -c cd <https://builds.apache.org/job/HBase-TRUNK/ws/trunk> && /home/jenkins/tools/java/jdk1.6.0_27-32/jre/bin/java -enableassertions -Xmx1900m -Djava.security.egd=file:/dev/./urandom -jar <https://builds.apache.org/job/HBase-TRUNK/ws/trunk/target/surefire/surefirebooter5865029732895950210.jar> <https://builds.apache.org/job/HBase-TRUNK/ws/trunk/target/surefire/surefire6066333964473599175tmp> <https://builds.apache.org/job/HBase-TRUNK/ws/trunk/target/surefire/surefire_577712916046690054272tmp>
Running org.apache.hadoop.hbase.coprocessor.TestAggregateProtocol
Tests run: 45, Failures: 0, Errors: 0, Skipped: 0, Time elapsed: 17.695 sec
Forking command line: /bin/sh -c cd <https://builds.apache.org/job/HBase-TRUNK/ws/trunk> && /home/jenkins/tools/java/jdk1.6.0_27-32/jre/bin/java -enableassertions -Xmx1900m -Djava.security.egd=file:/dev/./urandom -jar <https://builds.apache.org/job/HBase-TRUNK/ws/trunk/target/surefire/surefirebooter7070245654616788298.jar> <https://builds.apache.org/job/HBase-TRUNK/ws/trunk/target/surefire/surefire8452995314045800241tmp> <https://builds.apache.org/job/HBase-TRUNK/ws/trunk/target/surefire/surefire_582460113573215113919tmp>
Running org.apache.hadoop.hbase.coprocessor.TestRegionServerCoprocessorExceptionWithRemove
Tests run: 1, Failures: 0, Errors: 0, Skipped: 0, Time elapsed: 18.667 sec
Forking command line: /bin/sh -c cd <https://builds.apache.org/job/HBase-TRUNK/ws/trunk> && /home/jenkins/tools/java/jdk1.6.0_27-32/jre/bin/java -enableassertions -Xmx1900m -Djava.security.egd=file:/dev/./urandom -jar <https://builds.apache.org/job/HBase-TRUNK/ws/trunk/target/surefire/surefirebooter8272450649097526064.jar> <https://builds.apache.org/job/HBase-TRUNK/ws/trunk/target/surefire/surefire9120664004747156167tmp> <https://builds.apache.org/job/HBase-TRUNK/ws/trunk/target/surefire/surefire_594027805690925383327tmp>
Running org.apache.hadoop.hbase.coprocessor.TestRegionServerCoprocessorExceptionWithAbort
Tests run: 1, Failures: 0, Errors: 0, Skipped: 0, Time elapsed: 15.592 sec
Forking command line: /bin/sh -c cd <https://builds.apache.org/job/HBase-TRUNK/ws/trunk> && /home/jenkins/tools/java/jdk1.6.0_27-32/jre/bin/java -enableassertions -Xmx1900m -Djava.security.egd=file:/dev/./urandom -jar <https://builds.apache.org/job/HBase-TRUNK/ws/trunk/target/surefire/surefirebooter3706385977571459356.jar> <https://builds.apache.org/job/HBase-TRUNK/ws/trunk/target/surefire/surefire4822487030160157951tmp> <https://builds.apache.org/job/HBase-TRUNK/ws/trunk/target/surefire/surefire_604169357853287006524tmp>
Running org.apache.hadoop.hbase.coprocessor.TestMasterObserver
Tests run: 3, Failures: 0, Errors: 0, Skipped: 0, Time elapsed: 29.097 sec
Forking command line: /bin/sh -c cd <https://builds.apache.org/job/HBase-TRUNK/ws/trunk> && /home/jenkins/tools/java/jdk1.6.0_27-32/jre/bin/java -enableassertions -Xmx1900m -Djava.security.egd=file:/dev/./urandom -jar <https://builds.apache.org/job/HBase-TRUNK/ws/trunk/target/surefire/surefirebooter1167583572746564205.jar> <https://builds.apache.org/job/HBase-TRUNK/ws/trunk/target/surefire/surefire7556032246103762512tmp> <https://builds.apache.org/job/HBase-TRUNK/ws/trunk/target/surefire/surefire_617109234279214021001tmp>
Running org.apache.hadoop.hbase.coprocessor.TestCoprocessorEndpoint
Tests run: 3, Failures: 0, Errors: 0, Skipped: 1, Time elapsed: 32.075 sec
Forking command line: /bin/sh -c cd <https://builds.apache.org/job/HBase-TRUNK/ws/trunk> && /home/jenkins/tools/java/jdk1.6.0_27-32/jre/bin/java -enableassertions -Xmx1900m -Djava.security.egd=file:/dev/./urandom -jar <https://builds.apache.org/job/HBase-TRUNK/ws/trunk/target/surefire/surefirebooter8762562890069178498.jar> <https://builds.apache.org/job/HBase-TRUNK/ws/trunk/target/surefire/surefire430267306467499203tmp> <https://builds.apache.org/job/HBase-TRUNK/ws/trunk/target/surefire/surefire_626470762590820770175tmp>
Forking command line: /bin/sh -c cd <https://builds.apache.org/job/HBase-TRUNK/ws/trunk> && /home/jenkins/tools/java/jdk1.6.0_27-32/jre/bin/java -enableassertions -Xmx1900m -Djava.security.egd=file:/dev/./urandom -jar <https://builds.apache.org/job/HBase-TRUNK/ws/trunk/target/surefire/surefirebooter9007211990622564702.jar> <https://builds.apache.org/job/HBase-TRUNK/ws/trunk/target/surefire/surefire6404855672827099378tmp> <https://builds.apache.org/job/HBase-TRUNK/ws/trunk/target/surefire/surefire_638185465015676194567tmp>
Running org.apache.hadoop.hbase.coprocessor.TestWALObserver
Tests run: 3, Failures: 0, Errors: 0, Skipped: 0, Time elapsed: 19.263 sec
Running org.apache.hadoop.hbase.coprocessor.TestMasterCoprocessorExceptionWithAbort
Tests run: 1, Failures: 0, Errors: 0, Skipped: 0, Time elapsed: 25.233 sec
Forking command line: /bin/sh -c cd <https://builds.apache.org/job/HBase-TRUNK/ws/trunk> && /home/jenkins/tools/java/jdk1.6.0_27-32/jre/bin/java -enableassertions -Xmx1900m -Djava.security.egd=file:/dev/./urandom -jar <https://builds.apache.org/job/HBase-TRUNK/ws/trunk/target/surefire/surefirebooter3676206612395638467.jar> <https://builds.apache.org/job/HBase-TRUNK/ws/trunk/target/surefire/surefire4375797897425231846tmp> <https://builds.apache.org/job/HBase-TRUNK/ws/trunk/target/surefire/surefire_649196300414794793026tmp>
Forking command line: /bin/sh -c cd <https://builds.apache.org/job/HBase-TRUNK/ws/trunk> && /home/jenkins/tools/java/jdk1.6.0_27-32/jre/bin/java -enableassertions -Xmx1900m -Djava.security.egd=file:/dev/./urandom -jar <https://builds.apache.org/job/HBase-TRUNK/ws/trunk/target/surefire/surefirebooter8859524507944524638.jar> <https://builds.apache.org/job/HBase-TRUNK/ws/trunk/target/surefire/surefire5437231025182686112tmp> <https://builds.apache.org/job/HBase-TRUNK/ws/trunk/target/surefire/surefire_654882455558242185669tmp>
Running org.apache.hadoop.hbase.coprocessor.TestMasterCoprocessorExceptionWithRemove
Tests run: 1, Failures: 0, Errors: 0, Skipped: 0, Time elapsed: 18.415 sec
Forking command line: /bin/sh -c cd <https://builds.apache.org/job/HBase-TRUNK/ws/trunk> && /home/jenkins/tools/java/jdk1.6.0_27-32/jre/bin/java -enableassertions -Xmx1900m -Djava.security.egd=file:/dev/./urandom -jar <https://builds.apache.org/job/HBase-TRUNK/ws/trunk/target/surefire/surefirebooter4404194721903886505.jar> <https://builds.apache.org/job/HBase-TRUNK/ws/trunk/target/surefire/surefire6599005470589266384tmp> <https://builds.apache.org/job/HBase-TRUNK/ws/trunk/target/surefire/surefire_664053707222615844918tmp>
Running org.apache.hadoop.hbase.coprocessor.TestRegionObserverBypass
Tests run: 2, Failures: 0, Errors: 0, Skipped: 0, Time elapsed: 14.982 sec
Forking command line: /bin/sh -c cd <https://builds.apache.org/job/HBase-TRUNK/ws/trunk> && /home/jenkins/tools/java/jdk1.6.0_27-32/jre/bin/java -enableassertions -Xmx1900m -Djava.security.egd=file:/dev/./urandom -jar <https://builds.apache.org/job/HBase-TRUNK/ws/trunk/target/surefire/surefirebooter4208746828859787691.jar> <https://builds.apache.org/job/HBase-TRUNK/ws/trunk/target/surefire/surefire1220395060812803856tmp> <https://builds.apache.org/job/HBase-TRUNK/ws/trunk/target/surefire/surefire_675234845142800420878tmp>
Running org.apache.hadoop.hbase.coprocessor.TestRegionObserverInterface
Tests run: 6, Failures: 0, Errors: 0, Skipped: 0, Time elapsed: 40.917 sec
Forking command line: /bin/sh -c cd <https://builds.apache.org/job/HBase-TRUNK/ws/trunk> && /home/jenkins/tools/java/jdk1.6.0_27-32/jre/bin/java -enableassertions -Xmx1900m -Djava.security.egd=file:/dev/./urandom -jar <https://builds.apache.org/job/HBase-TRUNK/ws/trunk/target/surefire/surefirebooter4823935031454201557.jar> <https://builds.apache.org/job/HBase-TRUNK/ws/trunk/target/surefire/surefire5943571498615159659tmp> <https://builds.apache.org/job/HBase-TRUNK/ws/trunk/target/surefire/surefire_6860422088558572522tmp>
Running org.apache.hadoop.hbase.mapreduce.TestHLogRecordReader
Tests run: 2, Failures: 0, Errors: 0, Skipped: 0, Time elapsed: 6.437 sec
Forking command line: /bin/sh -c cd <https://builds.apache.org/job/HBase-TRUNK/ws/trunk> && /home/jenkins/tools/java/jdk1.6.0_27-32/jre/bin/java -enableassertions -Xmx1900m -Djava.security.egd=file:/dev/./urandom -jar <https://builds.apache.org/job/HBase-TRUNK/ws/trunk/target/surefire/surefirebooter4022515766153055519.jar> <https://builds.apache.org/job/HBase-TRUNK/ws/trunk/target/surefire/surefire3070789798023654963tmp> <https://builds.apache.org/job/HBase-TRUNK/ws/trunk/target/surefire/surefire_694546328187630865201tmp>
Running org.apache.hadoop.hbase.TestGlobalMemStoreSize
Tests run: 1, Failures: 0, Errors: 0, Skipped: 0, Time elapsed: 18.135 sec
Forking command line: /bin/sh -c cd <https://builds.apache.org/job/HBase-TRUNK/ws/trunk> && /home/jenkins/tools/java/jdk1.6.0_27-32/jre/bin/java -enableassertions -Xmx1900m -Djava.security.egd=file:/dev/./urandom -jar <https://builds.apache.org/job/HBase-TRUNK/ws/trunk/target/surefire/surefirebooter764749143550082509.jar> <https://builds.apache.org/job/HBase-TRUNK/ws/trunk/target/surefire/surefire8678148088690180310tmp> <https://builds.apache.org/job/HBase-TRUNK/ws/trunk/target/surefire/surefire_702021318566003804416tmp>
Running org.apache.hadoop.hbase.mapreduce.TestImportExport
Tests run: 2, Failures: 0, Errors: 0, Skipped: 0, Time elapsed: 49.458 sec
Forking command line: /bin/sh -c cd <https://builds.apache.org/job/HBase-TRUNK/ws/trunk> && /home/jenkins/tools/java/jdk1.6.0_27-32/jre/bin/java -enableassertions -Xmx1900m -Djava.security.egd=file:/dev/./urandom -jar <https://builds.apache.org/job/HBase-TRUNK/ws/trunk/target/surefire/surefirebooter3747178312704924354.jar> <https://builds.apache.org/job/HBase-TRUNK/ws/trunk/target/surefire/surefire8657515906404963721tmp> <https://builds.apache.org/job/HBase-TRUNK/ws/trunk/target/surefire/surefire_714194221491511134871tmp>
Running org.apache.hadoop.hbase.mapreduce.TestImportTsv
Tests run: 8, Failures: 0, Errors: 0, Skipped: 0, Time elapsed: 85.659 sec
Forking command line: /bin/sh -c cd <https://builds.apache.org/job/HBase-TRUNK/ws/trunk> && /home/jenkins/tools/java/jdk1.6.0_27-32/jre/bin/java -enableassertions -Xmx1900m -Djava.security.egd=file:/dev/./urandom -jar <https://builds.apache.org/job/HBase-TRUNK/ws/trunk/target/surefire/surefirebooter1129175502127783431.jar> <https://builds.apache.org/job/HBase-TRUNK/ws/trunk/target/surefire/surefire6098464661059201788tmp> <https://builds.apache.org/job/HBase-TRUNK/ws/trunk/target/surefire/surefire_722849911415141351040tmp>
Running org.apache.hadoop.hbase.thrift2.TestThriftHBaseServiceHandler
Tests run: 12, Failures: 0, Errors: 0, Skipped: 0, Time elapsed: 14.844 sec
Forking command line: /bin/sh -c cd <https://builds.apache.org/job/HBase-TRUNK/ws/trunk> && /home/jenkins/tools/java/jdk1.6.0_27-32/jre/bin/java -enableassertions -Xmx1900m -Djava.security.egd=file:/dev/./urandom -jar <https://builds.apache.org/job/HBase-TRUNK/ws/trunk/target/surefire/surefirebooter6491998914899886412.jar> <https://builds.apache.org/job/HBase-TRUNK/ws/trunk/target/surefire/surefire6284800876969468931tmp> <https://builds.apache.org/job/HBase-TRUNK/ws/trunk/target/surefire/surefire_731388762528082394854tmp>
Running org.apache.hadoop.hbase.catalog.TestMetaReaderEditorNoCluster
Tests run: 1, Failures: 0, Errors: 0, Skipped: 0, Time elapsed: 4.474 sec
Forking command line: /bin/sh -c cd <https://builds.apache.org/job/HBase-TRUNK/ws/trunk> && /home/jenkins/tools/java/jdk1.6.0_27-32/jre/bin/java -enableassertions -Xmx1900m -Djava.security.egd=file:/dev/./urandom -jar <https://builds.apache.org/job/HBase-TRUNK/ws/trunk/target/surefire/surefirebooter134858796105498212.jar> <https://builds.apache.org/job/HBase-TRUNK/ws/trunk/target/surefire/surefire1596141778850198959tmp> <https://builds.apache.org/job/HBase-TRUNK/ws/trunk/target/surefire/surefire_74940033491362309744tmp>
Running org.apache.hadoop.hbase.catalog.TestMetaReaderEditor
Tests run: 5, Failures: 0, Errors: 0, Skipped: 0, Time elapsed: 24.862 sec
Forking command line: /bin/sh -c cd <https://builds.apache.org/job/HBase-TRUNK/ws/trunk> && /home/jenkins/tools/java/jdk1.6.0_27-32/jre/bin/java -enableassertions -Xmx1900m -Djava.security.egd=file:/dev/./urandom -jar <https://builds.apache.org/job/HBase-TRUNK/ws/trunk/target/surefire/surefirebooter3541074362722245324.jar> <https://builds.apache.org/job/HBase-TRUNK/ws/trunk/target/surefire/surefire6781825417908862607tmp> <https://builds.apache.org/job/HBase-TRUNK/ws/trunk/target/surefire/surefire_75280894850916792752tmp>
Running org.apache.hadoop.hbase.catalog.TestCatalogTracker
Tests run: 9, Failures: 0, Errors: 0, Skipped: 1, Time elapsed: 5.826 sec
Forking command line: /bin/sh -c cd <https://builds.apache.org/job/HBase-TRUNK/ws/trunk> && /home/jenkins/tools/java/jdk1.6.0_27-32/jre/bin/java -enableassertions -Xmx1900m -Djava.security.egd=file:/dev/./urandom -jar <https://builds.apache.org/job/HBase-TRUNK/ws/trunk/target/surefire/surefirebooter6038263250321072287.jar> <https://builds.apache.org/job/HBase-TRUNK/ws/trunk/target/surefire/surefire8164498028238743125tmp> <https://builds.apache.org/job/HBase-TRUNK/ws/trunk/target/surefire/surefire_766575058503511816886tmp>
Running org.apache.hadoop.hbase.client.TestTimestampsFilter
Tests run: 3, Failures: 0, Errors: 0, Skipped: 0, Time elapsed: 19.244 sec
Forking command line: /bin/sh -c cd <https://builds.apache.org/job/HBase-TRUNK/ws/trunk> && /home/jenkins/tools/java/jdk1.6.0_27-32/jre/bin/java -enableassertions -Xmx1900m -Djava.security.egd=file:/dev/./urandom -jar <https://builds.apache.org/job/HBase-TRUNK/ws/trunk/target/surefire/surefirebooter3831215235191876575.jar> <https://builds.apache.org/job/HBase-TRUNK/ws/trunk/target/surefire/surefire3917842120373287761tmp> <https://builds.apache.org/job/HBase-TRUNK/ws/trunk/target/surefire/surefire_775869476633885317439tmp>
Running org.apache.hadoop.hbase.TestAcidGuarantees
Tests run: 3, Failures: 0, Errors: 0, Skipped: 0, Time elapsed: 100.946 sec
Forking command line: /bin/sh -c cd <https://builds.apache.org/job/HBase-TRUNK/ws/trunk> && /home/jenkins/tools/java/jdk1.6.0_27-32/jre/bin/java -enableassertions -Xmx1900m -Djava.security.egd=file:/dev/./urandom -jar <https://builds.apache.org/job/HBase-TRUNK/ws/trunk/target/surefire/surefirebooter3442373298766021702.jar> <https://builds.apache.org/job/HBase-TRUNK/ws/trunk/target/surefire/surefire6100554910380201986tmp> <https://builds.apache.org/job/HBase-TRUNK/ws/trunk/target/surefire/surefire_78571497092772571751tmp>
Running org.apache.hadoop.hbase.client.TestHCM
Tests run: 7, Failures: 0, Errors: 0, Skipped: 0, Time elapsed: 17.206 sec
Forking command line: /bin/sh -c cd <https://builds.apache.org/job/HBase-TRUNK/ws/trunk> && /home/jenkins/tools/java/jdk1.6.0_27-32/jre/bin/java -enableassertions -Xmx1900m -Djava.security.egd=file:/dev/./urandom -jar <https://builds.apache.org/job/HBase-TRUNK/ws/trunk/target/surefire/surefirebooter5898863677342679467.jar> <https://builds.apache.org/job/HBase-TRUNK/ws/trunk/target/surefire/surefire5357823918055084017tmp> <https://builds.apache.org/job/HBase-TRUNK/ws/trunk/target/surefire/surefire_797130581847340664594tmp>
Running org.apache.hadoop.hbase.client.TestMetaScanner
Tests run: 1, Failures: 0, Errors: 0, Skipped: 0, Time elapsed: 15.18 sec
Forking command line: /bin/sh -c cd <https://builds.apache.org/job/HBase-TRUNK/ws/trunk> && /home/jenkins/tools/java/jdk1.6.0_27-32/jre/bin/java -enableassertions -Xmx1900m -Djava.security.egd=file:/dev/./urandom -jar <https://builds.apache.org/job/HBase-TRUNK/ws/trunk/target/surefire/surefirebooter2751283486517063425.jar> <https://builds.apache.org/job/HBase-TRUNK/ws/trunk/target/surefire/surefire7686407952071902253tmp> <https://builds.apache.org/job/HBase-TRUNK/ws/trunk/target/surefire/surefire_804978369371936353485tmp>
Running org.apache.hadoop.hbase.client.TestHTableUtil
Tests run: 2, Failures: 0, Errors: 0, Skipped: 0, Time elapsed: 12.731 sec
Forking command line: /bin/sh -c cd <https://builds.apache.org/job/HBase-TRUNK/ws/trunk> && /home/jenkins/tools/java/jdk1.6.0_27-32/jre/bin/java -enableassertions -Xmx1900m -Djava.security.egd=file:/dev/./urandom -jar <https://builds.apache.org/job/HBase-TRUNK/ws/trunk/target/surefire/surefirebooter4944492438925482478.jar> <https://builds.apache.org/job/HBase-TRUNK/ws/trunk/target/surefire/surefire3699243593947155344tmp> <https://builds.apache.org/job/HBase-TRUNK/ws/trunk/target/surefire/surefire_81795190983412955677tmp>
Running org.apache.hadoop.hbase.client.TestMetaMigrationRemovingHTD
Tests run: 3, Failures: 0, Errors: 0, Skipped: 0, Time elapsed: 27.553 sec
Forking command line: /bin/sh -c cd <https://builds.apache.org/job/HBase-TRUNK/ws/trunk> && /home/jenkins/tools/java/jdk1.6.0_27-32/jre/bin/java -enableassertions -Xmx1900m -Djava.security.egd=file:/dev/./urandom -jar <https://builds.apache.org/job/HBase-TRUNK/ws/trunk/target/surefire/surefirebooter141559404146198152.jar> <https://builds.apache.org/job/HBase-TRUNK/ws/trunk/target/surefire/surefire7646883737066165740tmp> <https://builds.apache.org/job/HBase-TRUNK/ws/trunk/target/surefire/surefire_824905625670232648323tmp>
Running org.apache.hadoop.hbase.client.replication.TestReplicationAdmin
Tests run: 1, Failures: 0, Errors: 0, Skipped: 0, Time elapsed: 0.984 sec
Forking command line: /bin/sh -c cd <https://builds.apache.org/job/HBase-TRUNK/ws/trunk> && /home/jenkins/tools/java/jdk1.6.0_27-32/jre/bin/java -enableassertions -Xmx1900m -Djava.security.egd=file:/dev/./urandom -jar <https://builds.apache.org/job/HBase-TRUNK/ws/trunk/target/surefire/surefirebooter4933261973739892771.jar> <https://builds.apache.org/job/HBase-TRUNK/ws/trunk/target/surefire/surefire6494234866586082380tmp> <https://builds.apache.org/job/HBase-TRUNK/ws/trunk/target/surefire/surefire_839141564593700005049tmp>
Running org.apache.hadoop.hbase.client.TestHTablePool$TestHTableReusablePool
Tests run: 9, Failures: 0, Errors: 0, Skipped: 0, Time elapsed: 7.891 sec
Running org.apache.hadoop.hbase.client.TestHTablePool$TestHTableThreadLocalPool
Tests run: 9, Failures: 0, Errors: 0, Skipped: 0, Time elapsed: 25.655 sec
Forking command line: /bin/sh -c cd <https://builds.apache.org/job/HBase-TRUNK/ws/trunk> && /home/jenkins/tools/java/jdk1.6.0_27-32/jre/bin/java -enableassertions -Xmx1900m -Djava.security.egd=file:/dev/./urandom -jar <https://builds.apache.org/job/HBase-TRUNK/ws/trunk/target/surefire/surefirebooter4130605578010983081.jar> <https://builds.apache.org/job/HBase-TRUNK/ws/trunk/target/surefire/surefire6120824179328916386tmp> <https://builds.apache.org/job/HBase-TRUNK/ws/trunk/target/surefire/surefire_841049745730908024644tmp>
Running org.apache.hadoop.hbase.metrics.TestMetricsMBeanBase
Tests run: 2, Failures: 0, Errors: 0, Skipped: 0, Time elapsed: 1.116 sec
Forking command line: /bin/sh -c cd <https://builds.apache.org/job/HBase-TRUNK/ws/trunk> && /home/jenkins/tools/java/jdk1.6.0_27-32/jre/bin/java -enableassertions -Xmx1900m -Djava.security.egd=file:/dev/./urandom -jar <https://builds.apache.org/job/HBase-TRUNK/ws/trunk/target/surefire/surefirebooter8744027651589182257.jar> <https://builds.apache.org/job/HBase-TRUNK/ws/trunk/target/surefire/surefire4763295490862341318tmp> <https://builds.apache.org/job/HBase-TRUNK/ws/trunk/target/surefire/surefire_855658045880886815805tmp>
Running org.apache.hadoop.hbase.constraint.TestConstraint
Tests run: 5, Failures: 0, Errors: 0, Skipped: 0, Time elapsed: 36.886 sec
Forking command line: /bin/sh -c cd <https://builds.apache.org/job/HBase-TRUNK/ws/trunk> && /home/jenkins/tools/java/jdk1.6.0_27-32/jre/bin/java -enableassertions -Xmx1900m -Djava.security.egd=file:/dev/./urandom -jar <https://builds.apache.org/job/HBase-TRUNK/ws/trunk/target/surefire/surefirebooter7531578645493213188.jar> <https://builds.apache.org/job/HBase-TRUNK/ws/trunk/target/surefire/surefire60781962150659101tmp> <https://builds.apache.org/job/HBase-TRUNK/ws/trunk/target/surefire/surefire_86389985076548861216tmp>
Running org.apache.hadoop.hbase.client.TestMultiParallel
Tests run: 11, Failures: 0, Errors: 0, Skipped: 0, Time elapsed: 46.481 sec
Forking command line: /bin/sh -c cd <https://builds.apache.org/job/HBase-TRUNK/ws/trunk> && /home/jenkins/tools/java/jdk1.6.0_27-32/jre/bin/java -enableassertions -Xmx1900m -Djava.security.egd=file:/dev/./urandom -jar <https://builds.apache.org/job/HBase-TRUNK/ws/trunk/target/surefire/surefirebooter8627329881527957066.jar> <https://builds.apache.org/job/HBase-TRUNK/ws/trunk/target/surefire/surefire5396330845411626502tmp> <https://builds.apache.org/job/HBase-TRUNK/ws/trunk/target/surefire/surefire_874805573108142293486tmp>
Running org.apache.hadoop.hbase.rest.TestMultiRowResource
Tests run: 3, Failures: 0, Errors: 0, Skipped: 0, Time elapsed: 13.85 sec
Forking command line: /bin/sh -c cd <https://builds.apache.org/job/HBase-TRUNK/ws/trunk> && /home/jenkins/tools/java/jdk1.6.0_27-32/jre/bin/java -enableassertions -Xmx1900m -Djava.security.egd=file:/dev/./urandom -jar <https://builds.apache.org/job/HBase-TRUNK/ws/trunk/target/surefire/surefirebooter4156086470995281941.jar> <https://builds.apache.org/job/HBase-TRUNK/ws/trunk/target/surefire/surefire1493451702325426552tmp> <https://builds.apache.org/job/HBase-TRUNK/ws/trunk/target/surefire/surefire_882403955171728393234tmp>
Running org.apache.hadoop.hbase.rest.TestGzipFilter
Tests run: 3, Failures: 0, Errors: 0, Skipped: 0, Time elapsed: 15.484 sec
Forking command line: /bin/sh -c cd <https://builds.apache.org/job/HBase-TRUNK/ws/trunk> && /home/jenkins/tools/java/jdk1.6.0_27-32/jre/bin/java -enableassertions -Xmx1900m -Djava.security.egd=file:/dev/./urandom -jar <https://builds.apache.org/job/HBase-TRUNK/ws/trunk/target/surefire/surefirebooter929664345304117727.jar> <https://builds.apache.org/job/HBase-TRUNK/ws/trunk/target/surefire/surefire3053559022601078882tmp> <https://builds.apache.org/job/HBase-TRUNK/ws/trunk/target/surefire/surefire_896037933424902739857tmp>
Running org.apache.hadoop.hbase.rest.TestRowResource
Tests run: 11, Failures: 0, Errors: 0, Skipped: 0, Time elapsed: 20.171 sec
Forking command line: /bin/sh -c cd <https://builds.apache.org/job/HBase-TRUNK/ws/trunk> && /home/jenkins/tools/java/jdk1.6.0_27-32/jre/bin/java -enableassertions -Xmx1900m -Djava.security.egd=file:/dev/./urandom -jar <https://builds.apache.org/job/HBase-TRUNK/ws/trunk/target/surefire/surefirebooter5844241541129154441.jar> <https://builds.apache.org/job/HBase-TRUNK/ws/trunk/target/surefire/surefire4471049993319955584tmp> <https://builds.apache.org/job/HBase-TRUNK/ws/trunk/target/surefire/surefire_903183382349882082607tmp>
Running org.apache.hadoop.hbase.rest.TestScannersWithFilters
Tests run: 10, Failures: 0, Errors: 0, Skipped: 0, Time elapsed: 22.584 sec
Forking command line: /bin/sh -c cd <https://builds.apache.org/job/HBase-TRUNK/ws/trunk> && /home/jenkins/tools/java/jdk1.6.0_27-32/jre/bin/java -enableassertions -Xmx1900m -Djava.security.egd=file:/dev/./urandom -jar <https://builds.apache.org/job/HBase-TRUNK/ws/trunk/target/surefire/surefirebooter2005195068804179974.jar> <https://builds.apache.org/job/HBase-TRUNK/ws/trunk/target/surefire/surefire357170640440515912tmp> <https://builds.apache.org/job/HBase-TRUNK/ws/trunk/target/surefire/surefire_915130726154596748294tmp>
Running org.apache.hadoop.hbase.rest.client.TestRemoteAdmin
Tests run: 1, Failures: 0, Errors: 0, Skipped: 0, Time elapsed: 14.546 sec
Forking command line: /bin/sh -c cd <https://builds.apache.org/job/HBase-TRUNK/ws/trunk> && /home/jenkins/tools/java/jdk1.6.0_27-32/jre/bin/java -enableassertions -Xmx1900m -Djava.security.egd=file:/dev/./urandom -jar <https://builds.apache.org/job/HBase-TRUNK/ws/trunk/target/surefire/surefirebooter5888852949536385284.jar> <https://builds.apache.org/job/HBase-TRUNK/ws/trunk/target/surefire/surefire6356942500497719278tmp> <https://builds.apache.org/job/HBase-TRUNK/ws/trunk/target/surefire/surefire_922603508739886078513tmp>
Running org.apache.hadoop.hbase.rest.client.TestRemoteTable
Tests run: 3, Failures: 0, Errors: 0, Skipped: 0, Time elapsed: 15.323 sec
Forking command line: /bin/sh -c cd <https://builds.apache.org/job/HBase-TRUNK/ws/trunk> && /home/jenkins/tools/java/jdk1.6.0_27-32/jre/bin/java -enableassertions -Xmx1900m -Djava.security.egd=file:/dev/./urandom -jar <https://builds.apache.org/job/HBase-TRUNK/ws/trunk/target/surefire/surefirebooter305530759958809470.jar> <https://builds.apache.org/job/HBase-TRUNK/ws/trunk/target/surefire/surefire2796539817010814938tmp> <https://builds.apache.org/job/HBase-TRUNK/ws/trunk/target/surefire/surefire_931317862455330427519tmp>
Running org.apache.hadoop.hbase.rest.TestVersionResource
Tests run: 7, Failures: 0, Errors: 0, Skipped: 0, Time elapsed: 11.883 sec
Forking command line: /bin/sh -c cd <https://builds.apache.org/job/HBase-TRUNK/ws/trunk> && /home/jenkins/tools/java/jdk1.6.0_27-32/jre/bin/java -enableassertions -Xmx1900m -Djava.security.egd=file:/dev/./urandom -jar <https://builds.apache.org/job/HBase-TRUNK/ws/trunk/target/surefire/surefirebooter9097678269064871282.jar> <https://builds.apache.org/job/HBase-TRUNK/ws/trunk/target/surefire/surefire2961011832999120960tmp> <https://builds.apache.org/job/HBase-TRUNK/ws/trunk/target/surefire/surefire_941532607277972565923tmp>
Running org.apache.hadoop.hbase.rest.TestScannerResource
Tests run: 5, Failures: 0, Errors: 0, Skipped: 0, Time elapsed: 31.089 sec
Forking command line: /bin/sh -c cd <https://builds.apache.org/job/HBase-TRUNK/ws/trunk> && /home/jenkins/tools/java/jdk1.6.0_27-32/jre/bin/java -enableassertions -Xmx1900m -Djava.security.egd=file:/dev/./urandom -jar <https://builds.apache.org/job/HBase-TRUNK/ws/trunk/target/surefire/surefirebooter5720926228461522419.jar> <https://builds.apache.org/job/HBase-TRUNK/ws/trunk/target/surefire/surefire1592071707669434656tmp> <https://builds.apache.org/job/HBase-TRUNK/ws/trunk/target/surefire/surefire_957384765876650148311tmp>
Running org.apache.hadoop.hbase.rest.TestTableResource
Tests run: 8, Failures: 0, Errors: 0, Skipped: 0, Time elapsed: 23.123 sec
Forking command line: /bin/sh -c cd <https://builds.apache.org/job/HBase-TRUNK/ws/trunk> && /home/jenkins/tools/java/jdk1.6.0_27-32/jre/bin/java -enableassertions -Xmx1900m -Djava.security.egd=file:/dev/./urandom -jar <https://builds.apache.org/job/HBase-TRUNK/ws/trunk/target/surefire/surefirebooter2435216738845925235.jar> <https://builds.apache.org/job/HBase-TRUNK/ws/trunk/target/surefire/surefire6960746551257594542tmp> <https://builds.apache.org/job/HBase-TRUNK/ws/trunk/target/surefire/surefire_963140890636350537327tmp>
Running org.apache.hadoop.hbase.rest.TestStatusResource
Tests run: 2, Failures: 0, Errors: 0, Skipped: 0, Time elapsed: 11.844 sec
Forking command line: /bin/sh -c cd <https://builds.apache.org/job/HBase-TRUNK/ws/trunk> && /home/jenkins/tools/java/jdk1.6.0_27-32/jre/bin/java -enableassertions -Xmx1900m -Djava.security.egd=file:/dev/./urandom -jar <https://builds.apache.org/job/HBase-TRUNK/ws/trunk/target/surefire/surefirebooter7094159171785677172.jar> <https://builds.apache.org/job/HBase-TRUNK/ws/trunk/target/surefire/surefire7789062600403767557tmp> <https://builds.apache.org/job/HBase-TRUNK/ws/trunk/target/surefire/surefire_976797480420279692160tmp>
Running org.apache.hadoop.hbase.rest.TestSchemaResource
Tests run: 2, Failures: 0, Errors: 0, Skipped: 0, Time elapsed: 17.453 sec
Forking command line: /bin/sh -c cd <https://builds.apache.org/job/HBase-TRUNK/ws/trunk> && /home/jenkins/tools/java/jdk1.6.0_27-32/jre/bin/java -enableassertions -Xmx1900m -Djava.security.egd=file:/dev/./urandom -jar <https://builds.apache.org/job/HBase-TRUNK/ws/trunk/target/surefire/surefirebooter4005611303896664890.jar> <https://builds.apache.org/job/HBase-TRUNK/ws/trunk/target/surefire/surefire4030919075197109763tmp> <https://builds.apache.org/job/HBase-TRUNK/ws/trunk/target/surefire/surefire_98238195593484297976tmp>
Running org.apache.hadoop.hbase.io.encoding.TestLoadAndSwitchEncodeOnDisk
Tests run: 1, Failures: 0, Errors: 0, Skipped: 0, Time elapsed: 25.659 sec
Forking command line: /bin/sh -c cd <https://builds.apache.org/job/HBase-TRUNK/ws/trunk> && /home/jenkins/tools/java/jdk1.6.0_27-32/jre/bin/java -enableassertions -Xmx1900m -Djava.security.egd=file:/dev/./urandom -jar <https://builds.apache.org/job/HBase-TRUNK/ws/trunk/target/surefire/surefirebooter9013264540446514629.jar> <https://builds.apache.org/job/HBase-TRUNK/ws/trunk/target/surefire/surefire1361074457473600957tmp> <https://builds.apache.org/job/HBase-TRUNK/ws/trunk/target/surefire/surefire_995143149162421083425tmp>
Running org.apache.hadoop.hbase.io.hfile.TestHFileSeek
Tests run: 1, Failures: 0, Errors: 0, Skipped: 0, Time elapsed: 8.165 sec
Forking command line: /bin/sh -c cd <https://builds.apache.org/job/HBase-TRUNK/ws/trunk> && /home/jenkins/tools/java/jdk1.6.0_27-32/jre/bin/java -enableassertions -Xmx1900m -Djava.security.egd=file:/dev/./urandom -jar <https://builds.apache.org/job/HBase-TRUNK/ws/trunk/target/surefire/surefirebooter8354986928731448664.jar> <https://builds.apache.org/job/HBase-TRUNK/ws/trunk/target/surefire/surefire2205876538601872814tmp> <https://builds.apache.org/job/HBase-TRUNK/ws/trunk/target/surefire/surefire_1008355395956803868950tmp>
Running org.apache.hadoop.hbase.io.hfile.slab.TestSlabCache
Tests run: 7, Failures: 0, Errors: 0, Skipped: 0, Time elapsed: 19.98 sec
Forking command line: /bin/sh -c cd <https://builds.apache.org/job/HBase-TRUNK/ws/trunk> && /home/jenkins/tools/java/jdk1.6.0_27-32/jre/bin/java -enableassertions -Xmx1900m -Djava.security.egd=file:/dev/./urandom -jar <https://builds.apache.org/job/HBase-TRUNK/ws/trunk/target/surefire/surefirebooter8058363927917984574.jar> <https://builds.apache.org/job/HBase-TRUNK/ws/trunk/target/surefire/surefire6699143468408997320tmp> <https://builds.apache.org/job/HBase-TRUNK/ws/trunk/target/surefire/surefire_1013098577640231495746tmp>
Running org.apache.hadoop.hbase.thrift.TestThriftServer
Tests run: 1, Failures: 0, Errors: 0, Skipped: 0, Time elapsed: 65.71 sec
Forking command line: /bin/sh -c cd <https://builds.apache.org/job/HBase-TRUNK/ws/trunk> && /home/jenkins/tools/java/jdk1.6.0_27-32/jre/bin/java -enableassertions -Xmx1900m -Djava.security.egd=file:/dev/./urandom -jar <https://builds.apache.org/job/HBase-TRUNK/ws/trunk/target/surefire/surefirebooter186567626184687996.jar> <https://builds.apache.org/job/HBase-TRUNK/ws/trunk/target/surefire/surefire6445696917908264497tmp> <https://builds.apache.org/job/HBase-TRUNK/ws/trunk/target/surefire/surefire_1026711977543963085625tmp>
Running org.apache.hadoop.hbase.io.hfile.TestChecksum
Tests run: 3, Failures: 0, Errors: 0, Skipped: 0, Time elapsed: 1.726 sec
Forking command line: /bin/sh -c cd <https://builds.apache.org/job/HBase-TRUNK/ws/trunk> && /home/jenkins/tools/java/jdk1.6.0_27-32/jre/bin/java -enableassertions -Xmx1900m -Djava.security.egd=file:/dev/./urandom -jar <https://builds.apache.org/job/HBase-TRUNK/ws/trunk/target/surefire/surefirebooter8771693833501112294.jar> <https://builds.apache.org/job/HBase-TRUNK/ws/trunk/target/surefire/surefire2473419460435464608tmp> <https://builds.apache.org/job/HBase-TRUNK/ws/trunk/target/surefire/surefire_1036180804719008381498tmp>
Running org.apache.hadoop.hbase.io.hfile.TestHFileBlockIndex
Tests run: 10, Failures: 0, Errors: 0, Skipped: 0, Time elapsed: 10.518 sec
Forking command line: /bin/sh -c cd <https://builds.apache.org/job/HBase-TRUNK/ws/trunk> && /home/jenkins/tools/java/jdk1.6.0_27-32/jre/bin/java -enableassertions -Xmx1900m -Djava.security.egd=file:/dev/./urandom -jar <https://builds.apache.org/job/HBase-TRUNK/ws/trunk/target/surefire/surefirebooter4134710174876142101.jar> <https://builds.apache.org/job/HBase-TRUNK/ws/trunk/target/surefire/surefire7486286552048733438tmp> <https://builds.apache.org/job/HBase-TRUNK/ws/trunk/target/surefire/surefire_1045872221221604544038tmp>
Running org.apache.hadoop.hbase.io.hfile.TestLruBlockCache
Tests run: 16, Failures: 0, Errors: 0, Skipped: 0, Time elapsed: 0.765 sec
Forking command line: /bin/sh -c cd <https://builds.apache.org/job/HBase-TRUNK/ws/trunk> && /home/jenkins/tools/java/jdk1.6.0_27-32/jre/bin/java -enableassertions -Xmx1900m -Djava.security.egd=file:/dev/./urandom -jar <https://builds.apache.org/job/HBase-TRUNK/ws/trunk/target/surefire/surefirebooter2912482428652117464.jar> <https://builds.apache.org/job/HBase-TRUNK/ws/trunk/target/surefire/surefire5019726709431458774tmp> <https://builds.apache.org/job/HBase-TRUNK/ws/trunk/target/surefire/surefire_1055635620687425384773tmp>
Running org.apache.hadoop.hbase.io.hfile.TestHFilePerformance
Tests run: 1, Failures: 0, Errors: 0, Skipped: 0, Time elapsed: 6.763 sec
Forking command line: /bin/sh -c cd <https://builds.apache.org/job/HBase-TRUNK/ws/trunk> && /home/jenkins/tools/java/jdk1.6.0_27-32/jre/bin/java -enableassertions -Xmx1900m -Djava.security.egd=file:/dev/./urandom -jar <https://builds.apache.org/job/HBase-TRUNK/ws/trunk/target/surefire/surefirebooter7383623183832471674.jar> <https://builds.apache.org/job/HBase-TRUNK/ws/trunk/target/surefire/surefire4103991638804852402tmp> <https://builds.apache.org/job/HBase-TRUNK/ws/trunk/target/surefire/surefire_1069222934806603038896tmp>
Running org.apache.hadoop.hbase.io.hfile.slab.TestSingleSizeCache
Tests run: 5, Failures: 0, Errors: 0, Skipped: 0, Time elapsed: 26.426 sec
Forking command line: /bin/sh -c cd <https://builds.apache.org/job/HBase-TRUNK/ws/trunk> && /home/jenkins/tools/java/jdk1.6.0_27-32/jre/bin/java -enableassertions -Xmx1900m -Djava.security.egd=file:/dev/./urandom -jar <https://builds.apache.org/job/HBase-TRUNK/ws/trunk/target/surefire/surefirebooter5577407125878082829.jar> <https://builds.apache.org/job/HBase-TRUNK/ws/trunk/target/surefire/surefire235457570467113212tmp> <https://builds.apache.org/job/HBase-TRUNK/ws/trunk/target/surefire/surefire_1074545577255534933204tmp>
Running org.apache.hadoop.hbase.io.hfile.TestFixedFileTrailer
Tests run: 2, Failures: 0, Errors: 0, Skipped: 0, Time elapsed: 0.626 sec
Forking command line: /bin/sh -c cd <https://builds.apache.org/job/HBase-TRUNK/ws/trunk> && /home/jenkins/tools/java/jdk1.6.0_27-32/jre/bin/java -enableassertions -Xmx1900m -Djava.security.egd=file:/dev/./urandom -jar <https://builds.apache.org/job/HBase-TRUNK/ws/trunk/target/surefire/surefirebooter2813353106320254961.jar> <https://builds.apache.org/job/HBase-TRUNK/ws/trunk/target/surefire/surefire330873140060718454tmp> <https://builds.apache.org/job/HBase-TRUNK/ws/trunk/target/surefire/surefire_1083711166701345313623tmp>
Running org.apache.hadoop.hbase.io.hfile.TestHFileBlockCompatibility
Tests run: 10, Failures: 0, Errors: 0, Skipped: 0, Time elapsed: 1.231 sec
Forking command line: /bin/sh -c cd <https://builds.apache.org/job/HBase-TRUNK/ws/trunk> && /home/jenkins/tools/java/jdk1.6.0_27-32/jre/bin/java -enableassertions -Xmx1900m -Djava.security.egd=file:/dev/./urandom -jar <https://builds.apache.org/job/HBase-TRUNK/ws/trunk/target/surefire/surefirebooter6186514360143974455.jar> <https://builds.apache.org/job/HBase-TRUNK/ws/trunk/target/surefire/surefire1681309744733257179tmp> <https://builds.apache.org/job/HBase-TRUNK/ws/trunk/target/surefire/surefire_109385321458101256049tmp>
Running org.apache.hadoop.hbase.io.hfile.TestHFileBlock
Tests run: 16, Failures: 0, Errors: 0, Skipped: 0, Time elapsed: 47.766 sec
Forking command line: /bin/sh -c cd <https://builds.apache.org/job/HBase-TRUNK/ws/trunk> && /home/jenkins/tools/java/jdk1.6.0_27-32/jre/bin/java -enableassertions -Xmx1900m -Djava.security.egd=file:/dev/./urandom -jar <https://builds.apache.org/job/HBase-TRUNK/ws/trunk/target/surefire/surefirebooter4932774306485781132.jar> <https://builds.apache.org/job/HBase-TRUNK/ws/trunk/target/surefire/surefire2470218499440904488tmp> <https://builds.apache.org/job/HBase-TRUNK/ws/trunk/target/surefire/surefire_11025800960929949665tmp>
Running org.apache.hadoop.hbase.io.hfile.TestForceCacheImportantBlocks
Tests run: 4, Failures: 0, Errors: 0, Skipped: 0, Time elapsed: 61.67 sec
Forking command line: /bin/sh -c cd <https://builds.apache.org/job/HBase-TRUNK/ws/trunk> && /home/jenkins/tools/java/jdk1.6.0_27-32/jre/bin/java -enableassertions -Xmx1900m -Djava.security.egd=file:/dev/./urandom -jar <https://builds.apache.org/job/HBase-TRUNK/ws/trunk/target/surefire/surefirebooter2086648228384585595.jar> <https://builds.apache.org/job/HBase-TRUNK/ws/trunk/target/surefire/surefire638068845630906262tmp> <https://builds.apache.org/job/HBase-TRUNK/ws/trunk/target/surefire/surefire_1116559752227226739545tmp>
Running org.apache.hadoop.hbase.io.hfile.TestCacheOnWrite
Tests run: 36, Failures: 0, Errors: 0, Skipped: 0, Time elapsed: 35.209 sec
Forking command line: /bin/sh -c cd <https://builds.apache.org/job/HBase-TRUNK/ws/trunk> && /home/jenkins/tools/java/jdk1.6.0_27-32/jre/bin/java -enableassertions -Xmx1900m -Djava.security.egd=file:/dev/./urandom -jar <https://builds.apache.org/job/HBase-TRUNK/ws/trunk/target/surefire/surefirebooter5624839748743575634.jar> <https://builds.apache.org/job/HBase-TRUNK/ws/trunk/target/surefire/surefire9036558459182650123tmp> <https://builds.apache.org/job/HBase-TRUNK/ws/trunk/target/surefire/surefire_1123706837177276501482tmp>
Running org.apache.hadoop.hbase.replication.regionserver.TestReplicationSourceManager
Tests run: 1, Failures: 0, Errors: 0, Skipped: 0, Time elapsed: 1.065 sec
Forking command line: /bin/sh -c cd <https://builds.apache.org/job/HBase-TRUNK/ws/trunk> && /home/jenkins/tools/java/jdk1.6.0_27-32/jre/bin/java -enableassertions -Xmx1900m -Djava.security.egd=file:/dev/./urandom -jar <https://builds.apache.org/job/HBase-TRUNK/ws/trunk/target/surefire/surefirebooter6018220169185780246.jar> <https://builds.apache.org/job/HBase-TRUNK/ws/trunk/target/surefire/surefire8917788048432202076tmp> <https://builds.apache.org/job/HBase-TRUNK/ws/trunk/target/surefire/surefire_1131241290330264214061tmp>
Running org.apache.hadoop.hbase.avro.TestAvroServer
Tests run: 3, Failures: 0, Errors: 0, Skipped: 0, Time elapsed: 26.942 sec
Forking command line: /bin/sh -c cd <https://builds.apache.org/job/HBase-TRUNK/ws/trunk> && /home/jenkins/tools/java/jdk1.6.0_27-32/jre/bin/java -enableassertions -Xmx1900m -Djava.security.egd=file:/dev/./urandom -jar <https://builds.apache.org/job/HBase-TRUNK/ws/trunk/target/surefire/surefirebooter8654572598881450207.jar> <https://builds.apache.org/job/HBase-TRUNK/ws/trunk/target/surefire/surefire4522488783513426546tmp> <https://builds.apache.org/job/HBase-TRUNK/ws/trunk/target/surefire/surefire_1148742586698714974398tmp>
Running org.apache.hadoop.hbase.replication.TestReplicationSource
Tests run: 1, Failures: 0, Errors: 0, Skipped: 0, Time elapsed: 2.475 sec
Forking command line: /bin/sh -c cd <https://builds.apache.org/job/HBase-TRUNK/ws/trunk> && /home/jenkins/tools/java/jdk1.6.0_27-32/jre/bin/java -enableassertions -Xmx1900m -Djava.security.egd=file:/dev/./urandom -jar <https://builds.apache.org/job/HBase-TRUNK/ws/trunk/target/surefire/surefirebooter7048473995851887812.jar> <https://builds.apache.org/job/HBase-TRUNK/ws/trunk/target/surefire/surefire44160150571094308tmp> <https://builds.apache.org/job/HBase-TRUNK/ws/trunk/target/surefire/surefire_1157822462161391987563tmp>
Running org.apache.hadoop.hbase.replication.TestReplicationPeer
Tests run: 1, Failures: 0, Errors: 0, Skipped: 0, Time elapsed: 1.689 sec
Forking command line: /bin/sh -c cd <https://builds.apache.org/job/HBase-TRUNK/ws/trunk> && /home/jenkins/tools/java/jdk1.6.0_27-32/jre/bin/java -enableassertions -Xmx1900m -Djava.security.egd=file:/dev/./urandom -jar <https://builds.apache.org/job/HBase-TRUNK/ws/trunk/target/surefire/surefirebooter2778592890222738660.jar> <https://builds.apache.org/job/HBase-TRUNK/ws/trunk/target/surefire/surefire9048344476936778160tmp> <https://builds.apache.org/job/HBase-TRUNK/ws/trunk/target/surefire/surefire_1161281062535602875037tmp>
Running org.apache.hadoop.hbase.replication.TestReplicationZookeeper
Tests run: 1, Failures: 0, Errors: 0, Skipped: 0, Time elapsed: 0.667 sec
Forking command line: /bin/sh -c cd <https://builds.apache.org/job/HBase-TRUNK/ws/trunk> && /home/jenkins/tools/java/jdk1.6.0_27-32/jre/bin/java -enableassertions -Xmx1900m -Djava.security.egd=file:/dev/./urandom -jar <https://builds.apache.org/job/HBase-TRUNK/ws/trunk/target/surefire/surefirebooter6722254580145242107.jar> <https://builds.apache.org/job/HBase-TRUNK/ws/trunk/target/surefire/surefire1234130220970619509tmp> <https://builds.apache.org/job/HBase-TRUNK/ws/trunk/target/surefire/surefire_1175007041447752173663tmp>
Running org.apache.hadoop.hbase.ipc.TestDelayedRpc
Tests run: 4, Failures: 0, Errors: 0, Skipped: 0, Time elapsed: 2.694 sec
Running org.apache.hadoop.hbase.replication.regionserver.TestReplicationSink
Tests run: 5, Failures: 0, Errors: 0, Skipped: 0, Time elapsed: 30.363 sec
Results :
Tests run: 605, Failures: 0, Errors: 0, Skipped: 2
[INFO] ------------------------------------------------------------------------
[INFO] BUILD FAILURE
[INFO] ------------------------------------------------------------------------
[INFO] Total time: 37:16.941s
[INFO] Finished at: Sat Apr 14 01:13:18 UTC 2012
[INFO] Final Memory: 69M/491M
[INFO] ------------------------------------------------------------------------
[ERROR] Failed to execute goal org.apache.maven.plugins:maven-surefire-plugin:2.12-TRUNK-HBASE-2:test (secondPartTestsExecution) on project hbase: Failure or timeout -> [Help 1]
org.apache.maven.lifecycle.LifecycleExecutionException: Failed to execute goal org.apache.maven.plugins:maven-surefire-plugin:2.12-TRUNK-HBASE-2:test (secondPartTestsExecution) on project hbase: Failure or timeout
at org.apache.maven.lifecycle.internal.MojoExecutor.execute(MojoExecutor.java:217)
at org.apache.maven.lifecycle.internal.MojoExecutor.execute(MojoExecutor.java:153)
at org.apache.maven.lifecycle.internal.MojoExecutor.execute(MojoExecutor.java:145)
at org.apache.maven.lifecycle.internal.LifecycleModuleBuilder.buildProject(LifecycleModuleBuilder.java:84)
at org.apache.maven.lifecycle.internal.LifecycleModuleBuilder.buildProject(LifecycleModuleBuilder.java:59)
at org.apache.maven.lifecycle.internal.LifecycleStarter.singleThreadedBuild(LifecycleStarter.java:183)
at org.apache.maven.lifecycle.internal.LifecycleStarter.execute(LifecycleStarter.java:161)
at org.apache.maven.DefaultMaven.doExecute(DefaultMaven.java:319)
at org.apache.maven.DefaultMaven.execute(DefaultMaven.java:156)
at org.apache.maven.cli.MavenCli.execute(MavenCli.java:537)
at org.apache.maven.cli.MavenCli.doMain(MavenCli.java:196)
at org.apache.maven.cli.MavenCli.main(MavenCli.java:141)
at sun.reflect.NativeMethodAccessorImpl.invoke0(Native Method)
at sun.reflect.NativeMethodAccessorImpl.invoke(NativeMethodAccessorImpl.java:39)
at sun.reflect.DelegatingMethodAccessorImpl.invoke(DelegatingMethodAccessorImpl.java:25)
at java.lang.reflect.Method.invoke(Method.java:597)
at org.codehaus.plexus.classworlds.launcher.Launcher.launchEnhanced(Launcher.java:290)
at org.codehaus.plexus.classworlds.launcher.Launcher.launch(Launcher.java:230)
at org.codehaus.plexus.classworlds.launcher.Launcher.mainWithExitCode(Launcher.java:409)
at org.codehaus.plexus.classworlds.launcher.Launcher.main(Launcher.java:352)
Caused by: org.apache.maven.plugin.MojoExecutionException: Failure or timeout
at org.apache.maven.plugin.surefire.SurefirePlugin.assertNoFailureOrTimeout(SurefirePlugin.java:643)
at org.apache.maven.plugin.surefire.SurefirePlugin.handleSummary(SurefirePlugin.java:624)
at org.apache.maven.plugin.surefire.AbstractSurefireMojo.executeAfterPreconditionsChecked(AbstractSurefireMojo.java:137)
at org.apache.maven.plugin.surefire.AbstractSurefireMojo.execute(AbstractSurefireMojo.java:98)
at org.apache.maven.plugin.DefaultBuildPluginManager.executeMojo(DefaultBuildPluginManager.java:101)
at org.apache.maven.lifecycle.internal.MojoExecutor.execute(MojoExecutor.java:209)
... 19 more
[ERROR]
[ERROR]
[ERROR] For more information about the errors and possible solutions, please read the following articles:
[ERROR] [Help 1] http://cwiki.apache.org/confluence/display/MAVEN/MojoExecutionException
Build step 'Invoke top-level Maven targets' marked build as failure
Archiving artifacts
Recording test results
Jenkins build is back to normal : HBase-TRUNK #2765
Posted by Apache Jenkins Server <je...@builds.apache.org>.
See <https://builds.apache.org/job/HBase-TRUNK/2765/changes>
Build failed in Jenkins: HBase-TRUNK #2764
Posted by Apache Jenkins Server <je...@builds.apache.org>.
See <https://builds.apache.org/job/HBase-TRUNK/2764/>
------------------------------------------
[...truncated 7963 lines...]
Tests run: 3, Failures: 0, Errors: 0, Skipped: 0, Time elapsed: 22.832 sec
Running org.apache.hadoop.hbase.client.replication.TestReplicationAdmin
Tests run: 1, Failures: 0, Errors: 0, Skipped: 0, Time elapsed: 0.826 sec
Running org.apache.hadoop.hbase.client.TestHCM
Tests run: 7, Failures: 0, Errors: 0, Skipped: 0, Time elapsed: 18.586 sec
Running org.apache.hadoop.hbase.client.TestMetaScanner
Tests run: 1, Failures: 0, Errors: 0, Skipped: 0, Time elapsed: 12.85 sec
Running org.apache.hadoop.hbase.thrift.TestThriftServer
Tests run: 1, Failures: 0, Errors: 0, Skipped: 0, Time elapsed: 65.03 sec
Running org.apache.hadoop.hbase.avro.TestAvroServer
Tests run: 3, Failures: 0, Errors: 0, Skipped: 0, Time elapsed: 25.934 sec
Running org.apache.hadoop.hbase.monitoring.TestMemoryBoundedLogMessageBuffer
Tests run: 2, Failures: 0, Errors: 0, Skipped: 0, Time elapsed: 0.317 sec
Running org.apache.hadoop.hbase.monitoring.TestTaskMonitor
Tests run: 3, Failures: 0, Errors: 0, Skipped: 0, Time elapsed: 0.341 sec
Running org.apache.hadoop.hbase.TestAcidGuarantees
Tests run: 3, Failures: 0, Errors: 0, Skipped: 0, Time elapsed: 97.196 sec
Running org.apache.hadoop.hbase.filter.TestColumnRangeFilter
Tests run: 1, Failures: 0, Errors: 0, Skipped: 0, Time elapsed: 18.587 sec
Running org.apache.hadoop.hbase.zookeeper.TestZooKeeperNodeTracker
Tests run: 2, Failures: 0, Errors: 0, Skipped: 0, Time elapsed: 0.886 sec
Running org.apache.hadoop.hbase.zookeeper.TestZKTable
Tests run: 1, Failures: 0, Errors: 0, Skipped: 0, Time elapsed: 0.564 sec
Running org.apache.hadoop.hbase.zookeeper.TestZKLeaderManager
Tests run: 1, Failures: 0, Errors: 0, Skipped: 0, Time elapsed: 0.628 sec
Running org.apache.hadoop.hbase.TestMultiVersions
Tests run: 3, Failures: 0, Errors: 0, Skipped: 0, Time elapsed: 19.821 sec
Running org.apache.hadoop.hbase.zookeeper.TestZooKeeperACL
Tests run: 5, Failures: 0, Errors: 0, Skipped: 0, Time elapsed: 36.533 sec
Running org.apache.hadoop.hbase.coprocessor.TestCoprocessorEndpoint
Tests run: 3, Failures: 0, Errors: 0, Skipped: 1, Time elapsed: 29.096 sec
Running org.apache.hadoop.hbase.coprocessor.TestRegionObserverBypass
Tests run: 2, Failures: 0, Errors: 0, Skipped: 0, Time elapsed: 10.81 sec
Running org.apache.hadoop.hbase.coprocessor.TestRegionServerCoprocessorExceptionWithAbort
Tests run: 1, Failures: 0, Errors: 0, Skipped: 0, Time elapsed: 73.686 sec
Running org.apache.hadoop.hbase.coprocessor.TestMasterObserver
Tests run: 3, Failures: 0, Errors: 0, Skipped: 0, Time elapsed: 27.134 sec
Running org.apache.hadoop.hbase.coprocessor.TestMasterCoprocessorExceptionWithAbort
Tests run: 1, Failures: 0, Errors: 0, Skipped: 0, Time elapsed: 25.318 sec
Running org.apache.hadoop.hbase.coprocessor.TestClassLoading
Tests run: 6, Failures: 0, Errors: 0, Skipped: 0, Time elapsed: 31.217 sec
Running org.apache.hadoop.hbase.coprocessor.TestAggregateProtocol
Tests run: 45, Failures: 0, Errors: 0, Skipped: 0, Time elapsed: 17.491 sec
Running org.apache.hadoop.hbase.coprocessor.TestRegionServerCoprocessorExceptionWithRemove
Tests run: 1, Failures: 0, Errors: 0, Skipped: 0, Time elapsed: 16.636 sec
Running org.apache.hadoop.hbase.coprocessor.TestWALObserver
Tests run: 3, Failures: 0, Errors: 0, Skipped: 0, Time elapsed: 15.722 sec
Running org.apache.hadoop.hbase.coprocessor.TestMasterCoprocessorExceptionWithRemove
Tests run: 1, Failures: 0, Errors: 0, Skipped: 0, Time elapsed: 14.362 sec
Running org.apache.hadoop.hbase.master.TestLogsCleaner
Tests run: 1, Failures: 0, Errors: 0, Skipped: 0, Time elapsed: 3.047 sec
Running org.apache.hadoop.hbase.master.TestActiveMasterManager
Tests run: 2, Failures: 0, Errors: 0, Skipped: 0, Time elapsed: 0.823 sec
Running org.apache.hadoop.hbase.master.TestHMasterRPCException
Tests run: 1, Failures: 0, Errors: 0, Skipped: 0, Time elapsed: 1.197 sec
Running org.apache.hadoop.hbase.master.TestMasterStatusServlet
Tests run: 5, Failures: 0, Errors: 0, Skipped: 0, Time elapsed: 1.092 sec
Running org.apache.hadoop.hbase.master.TestDefaultLoadBalancer
Tests run: 4, Failures: 0, Errors: 0, Skipped: 0, Time elapsed: 1.362 sec
Running org.apache.hadoop.hbase.master.TestOpenedRegionHandler
Tests run: 2, Failures: 0, Errors: 0, Skipped: 0, Time elapsed: 14.34 sec
Running org.apache.hadoop.hbase.coprocessor.TestRegionObserverInterface
Tests run: 6, Failures: 0, Errors: 0, Skipped: 0, Time elapsed: 36.368 sec
Running org.apache.hadoop.hbase.master.TestZKBasedOpenCloseRegion
Tests run: 3, Failures: 0, Errors: 0, Skipped: 0, Time elapsed: 19.607 sec
Running org.apache.hadoop.hbase.master.TestClockSkewDetection
Tests run: 1, Failures: 0, Errors: 0, Skipped: 0, Time elapsed: 0.255 sec
Running org.apache.hadoop.hbase.master.TestSplitLogManager
Tests run: 12, Failures: 0, Errors: 0, Skipped: 0, Time elapsed: 14.58 sec
Running org.apache.hadoop.hbase.master.TestMaster
Tests run: 1, Failures: 0, Errors: 0, Skipped: 0, Time elapsed: 15.477 sec
Running org.apache.hadoop.hbase.TestDrainingServer
Tests run: 2, Failures: 0, Errors: 0, Skipped: 0, Time elapsed: 18.466 sec
Running org.apache.hadoop.hbase.catalog.TestMetaReaderEditorNoCluster
Tests run: 1, Failures: 0, Errors: 0, Skipped: 0, Time elapsed: 3.995 sec
Running org.apache.hadoop.hbase.catalog.TestCatalogTracker
Tests run: 9, Failures: 0, Errors: 0, Skipped: 1, Time elapsed: 5.306 sec
Running org.apache.hadoop.hbase.thrift2.TestThriftHBaseServiceHandler
Tests run: 12, Failures: 0, Errors: 0, Skipped: 0, Time elapsed: 14.026 sec
Running org.apache.hadoop.hbase.catalog.TestMetaReaderEditor
Tests run: 5, Failures: 0, Errors: 0, Skipped: 0, Time elapsed: 22.783 sec
Running org.apache.hadoop.hbase.mapreduce.TestImportTsv
Tests run: 8, Failures: 0, Errors: 0, Skipped: 0, Time elapsed: 83.45 sec
Running org.apache.hadoop.hbase.mapreduce.TestImportExport
Tests run: 2, Failures: 0, Errors: 0, Skipped: 0, Time elapsed: 106.888 sec
Running org.apache.hadoop.hbase.mapreduce.TestHLogRecordReader
Tests run: 2, Failures: 0, Errors: 0, Skipped: 0, Time elapsed: 4.483 sec
Running org.apache.hadoop.hbase.regionserver.wal.TestHLogBench
Tests run: 1, Failures: 0, Errors: 0, Skipped: 0, Time elapsed: 1.249 sec
Running org.apache.hadoop.hbase.regionserver.TestStore
Tests run: 12, Failures: 0, Errors: 0, Skipped: 0, Time elapsed: 9.072 sec
Running org.apache.hadoop.hbase.regionserver.wal.TestLogRollingNoCluster
Tests run: 1, Failures: 0, Errors: 0, Skipped: 0, Time elapsed: 2.582 sec
Running org.apache.hadoop.hbase.regionserver.wal.TestLogRollAbort
Tests run: 1, Failures: 0, Errors: 0, Skipped: 0, Time elapsed: 17.734 sec
Running org.apache.hadoop.hbase.regionserver.wal.TestWALReplay
Tests run: 5, Failures: 0, Errors: 0, Skipped: 0, Time elapsed: 26.925 sec
Running org.apache.hadoop.hbase.regionserver.wal.TestWALReplayCompressed
Tests run: 5, Failures: 0, Errors: 0, Skipped: 0, Time elapsed: 30.452 sec
Running org.apache.hadoop.hbase.regionserver.TestRegionServerMetrics
Tests run: 2, Failures: 0, Errors: 0, Skipped: 0, Time elapsed: 42.225 sec
Running org.apache.hadoop.hbase.regionserver.TestAtomicOperation
Tests run: 5, Failures: 0, Errors: 0, Skipped: 0, Time elapsed: 31.483 sec
Running org.apache.hadoop.hbase.regionserver.TestServerCustomProtocol
Tests run: 7, Failures: 0, Errors: 0, Skipped: 0, Time elapsed: 17.087 sec
Running org.apache.hadoop.hbase.regionserver.TestParallelPut
Tests run: 2, Failures: 0, Errors: 0, Skipped: 0, Time elapsed: 2.938 sec
Running org.apache.hadoop.hbase.regionserver.TestRpcMetrics
Tests run: 1, Failures: 0, Errors: 0, Skipped: 0, Time elapsed: 1.957 sec
Running org.apache.hadoop.hbase.regionserver.TestSeekOptimizations
Tests run: 6, Failures: 0, Errors: 0, Skipped: 0, Time elapsed: 2.212 sec
Running org.apache.hadoop.hbase.regionserver.handler.TestCloseRegionHandler
Tests run: 3, Failures: 0, Errors: 0, Skipped: 0, Time elapsed: 1.095 sec
Running org.apache.hadoop.hbase.regionserver.TestFSErrorsExposed
Tests run: 3, Failures: 0, Errors: 0, Skipped: 0, Time elapsed: 30.338 sec
Running org.apache.hadoop.hbase.regionserver.handler.TestOpenRegionHandler
Tests run: 3, Failures: 0, Errors: 0, Skipped: 0, Time elapsed: 1.015 sec
Running org.apache.hadoop.hbase.regionserver.TestBlocksRead
Tests run: 4, Failures: 0, Errors: 0, Skipped: 0, Time elapsed: 0.787 sec
Running org.apache.hadoop.hbase.regionserver.TestStoreScanner
Tests run: 16, Failures: 0, Errors: 0, Skipped: 0, Time elapsed: 0.068 sec
Running org.apache.hadoop.hbase.regionserver.TestSplitLogWorker
Tests run: 5, Failures: 0, Errors: 0, Skipped: 0, Time elapsed: 2.02 sec
Running org.apache.hadoop.hbase.regionserver.metrics.TestSchemaMetrics
Tests run: 6, Failures: 0, Errors: 0, Skipped: 0, Time elapsed: 10.786 sec
Running org.apache.hadoop.hbase.regionserver.TestStoreFileBlockCacheSummary
Tests run: 1, Failures: 0, Errors: 0, Skipped: 0, Time elapsed: 14.876 sec
Running org.apache.hadoop.hbase.regionserver.TestMasterAddressManager
Tests run: 1, Failures: 0, Errors: 0, Skipped: 0, Time elapsed: 0.536 sec
Running org.apache.hadoop.hbase.regionserver.TestMultiColumnScanner
Tests run: 12, Failures: 0, Errors: 0, Skipped: 0, Time elapsed: 27.904 sec
Running org.apache.hadoop.hbase.ipc.TestDelayedRpc
Tests run: 4, Failures: 0, Errors: 0, Skipped: 0, Time elapsed: 2.516 sec
Running org.apache.hadoop.hbase.TestGlobalMemStoreSize
Tests run: 1, Failures: 0, Errors: 0, Skipped: 0, Time elapsed: 15.565 sec
Running org.apache.hadoop.hbase.regionserver.TestHRegion
Tests run: 62, Failures: 0, Errors: 0, Skipped: 0, Time elapsed: 51.976 sec
Running org.apache.hadoop.hbase.constraint.TestConstraint
Tests run: 5, Failures: 0, Errors: 0, Skipped: 0, Time elapsed: 29.854 sec
Running org.apache.hadoop.hbase.rest.TestSchemaResource
Tests run: 2, Failures: 0, Errors: 0, Skipped: 0, Time elapsed: 18.951 sec
Running org.apache.hadoop.hbase.rest.client.TestRemoteAdmin
Tests run: 1, Failures: 0, Errors: 0, Skipped: 0, Time elapsed: 14.32 sec
Running org.apache.hadoop.hbase.rest.client.TestRemoteTable
Tests run: 3, Failures: 0, Errors: 0, Skipped: 0, Time elapsed: 15.235 sec
Running org.apache.hadoop.hbase.rest.TestMultiRowResource
Tests run: 3, Failures: 0, Errors: 0, Skipped: 0, Time elapsed: 13.258 sec
Running org.apache.hadoop.hbase.rest.TestTableResource
Tests run: 8, Failures: 0, Errors: 0, Skipped: 0, Time elapsed: 24.552 sec
Running org.apache.hadoop.hbase.rest.TestGzipFilter
Tests run: 3, Failures: 0, Errors: 0, Skipped: 0, Time elapsed: 13.225 sec
Running org.apache.hadoop.hbase.rest.TestRowResource
Tests run: 11, Failures: 0, Errors: 0, Skipped: 0, Time elapsed: 14.98 sec
Running org.apache.hadoop.hbase.rest.TestVersionResource
Tests run: 7, Failures: 0, Errors: 0, Skipped: 0, Time elapsed: 12.467 sec
Running org.apache.hadoop.hbase.rest.TestScannerResource
Tests run: 5, Failures: 0, Errors: 0, Skipped: 0, Time elapsed: 33.96 sec
Running org.apache.hadoop.hbase.rest.TestStatusResource
Tests run: 2, Failures: 0, Errors: 0, Skipped: 0, Time elapsed: 11.787 sec
Running org.apache.hadoop.hbase.metrics.TestMetricsMBeanBase
Tests run: 2, Failures: 0, Errors: 0, Skipped: 0, Time elapsed: 1.163 sec
Running org.apache.hadoop.hbase.io.hfile.TestHFileBlockIndex
Tests run: 10, Failures: 0, Errors: 0, Skipped: 0, Time elapsed: 6.972 sec
Running org.apache.hadoop.hbase.rest.TestScannersWithFilters
Tests run: 10, Failures: 0, Errors: 0, Skipped: 0, Time elapsed: 16.753 sec
Running org.apache.hadoop.hbase.io.hfile.TestHFileSeek
Tests run: 1, Failures: 0, Errors: 0, Skipped: 0, Time elapsed: 6.042 sec
Running org.apache.hadoop.hbase.io.hfile.TestLruBlockCache
Tests run: 16, Failures: 0, Errors: 0, Skipped: 0, Time elapsed: 0.839 sec
Running org.apache.hadoop.hbase.io.hfile.TestFixedFileTrailer
Tests run: 2, Failures: 0, Errors: 0, Skipped: 0, Time elapsed: 0.599 sec
Running org.apache.hadoop.hbase.io.hfile.TestHFilePerformance
Tests run: 1, Failures: 0, Errors: 0, Skipped: 0, Time elapsed: 4.365 sec
Running org.apache.hadoop.hbase.io.hfile.TestHFileBlockCompatibility
Tests run: 10, Failures: 0, Errors: 0, Skipped: 0, Time elapsed: 0.905 sec
Running org.apache.hadoop.hbase.io.hfile.TestCacheOnWrite
Tests run: 36, Failures: 0, Errors: 0, Skipped: 0, Time elapsed: 24.74 sec
Running org.apache.hadoop.hbase.io.hfile.TestChecksum
Tests run: 3, Failures: 0, Errors: 0, Skipped: 0, Time elapsed: 0.75 sec
Running org.apache.hadoop.hbase.io.hfile.TestForceCacheImportantBlocks
Tests run: 4, Failures: 0, Errors: 0, Skipped: 0, Time elapsed: 34.623 sec
Running org.apache.hadoop.hbase.io.hfile.slab.TestSlabCache
Tests run: 7, Failures: 0, Errors: 0, Skipped: 0, Time elapsed: 12.178 sec
Running org.apache.hadoop.hbase.io.hfile.slab.TestSingleSizeCache
Tests run: 5, Failures: 0, Errors: 0, Skipped: 0, Time elapsed: 15.883 sec
Running org.apache.hadoop.hbase.io.hfile.TestHFileBlock
Tests run: 16, Failures: 0, Errors: 0, Skipped: 0, Time elapsed: 46.289 sec
Running org.apache.hadoop.hbase.replication.TestReplicationZookeeper
Tests run: 1, Failures: 0, Errors: 0, Skipped: 0, Time elapsed: 0.571 sec
Running org.apache.hadoop.hbase.io.encoding.TestLoadAndSwitchEncodeOnDisk
Tests run: 1, Failures: 0, Errors: 0, Skipped: 0, Time elapsed: 24.418 sec
Running org.apache.hadoop.hbase.replication.regionserver.TestReplicationSourceManager
Tests run: 1, Failures: 0, Errors: 0, Skipped: 0, Time elapsed: 0.774 sec
Running org.apache.hadoop.hbase.replication.TestReplicationSource
Tests run: 1, Failures: 0, Errors: 0, Skipped: 0, Time elapsed: 1.852 sec
Running org.apache.hadoop.hbase.replication.TestReplicationPeer
Tests run: 1, Failures: 0, Errors: 0, Skipped: 0, Time elapsed: 0.786 sec
Running org.apache.hadoop.hbase.util.TestFSTableDescriptors
Tests run: 10, Failures: 0, Errors: 0, Skipped: 0, Time elapsed: 0.84 sec
Running org.apache.hadoop.hbase.replication.regionserver.TestReplicationSink
Tests run: 5, Failures: 0, Errors: 0, Skipped: 0, Time elapsed: 28.413 sec
Running org.apache.hadoop.hbase.util.TestIdLock
Tests run: 1, Failures: 0, Errors: 0, Skipped: 0, Time elapsed: 15.393 sec
Running org.apache.hadoop.hbase.util.TestEnvironmentEdgeManager
Tests run: 2, Failures: 0, Errors: 0, Skipped: 0, Time elapsed: 0.288 sec
Running org.apache.hadoop.hbase.util.TestMergeTable
Tests run: 1, Failures: 0, Errors: 0, Skipped: 0, Time elapsed: 23.791 sec
Running org.apache.hadoop.hbase.util.TestFSUtils
Tests run: 3, Failures: 0, Errors: 0, Skipped: 0, Time elapsed: 19.056 sec
Running org.apache.hadoop.hbase.util.TestPoolMap$TestRoundRobinPoolType
Tests run: 3, Failures: 0, Errors: 0, Skipped: 0, Time elapsed: 0.009 sec
Running org.apache.hadoop.hbase.util.TestPoolMap$TestThreadLocalPoolType
Tests run: 3, Failures: 0, Errors: 0, Skipped: 0, Time elapsed: 0.006 sec
Running org.apache.hadoop.hbase.util.TestPoolMap$TestReusablePoolType
Tests run: 3, Failures: 0, Errors: 0, Skipped: 0, Time elapsed: 0.032 sec
Running org.apache.hadoop.hbase.util.TestRegionSplitter
Tests run: 5, Failures: 0, Errors: 0, Skipped: 0, Time elapsed: 17.503 sec
Running org.apache.hadoop.hbase.util.hbck.TestOfflineMetaRebuildBase
Tests run: 1, Failures: 0, Errors: 0, Skipped: 0, Time elapsed: 19.955 sec
Running org.apache.hadoop.hbase.util.hbck.TestOfflineMetaRebuildOverlap
Tests run: 1, Failures: 0, Errors: 0, Skipped: 0, Time elapsed: 18.252 sec
Running org.apache.hadoop.hbase.util.hbck.TestOfflineMetaRebuildHole
Tests run: 1, Failures: 0, Errors: 0, Skipped: 0, Time elapsed: 17.652 sec
Running org.apache.hadoop.hbase.util.TestDefaultEnvironmentEdge
Tests run: 1, Failures: 0, Errors: 0, Skipped: 0, Time elapsed: 0.294 sec
Running org.apache.hadoop.hbase.TestInfoServers
Tests run: 2, Failures: 0, Errors: 0, Skipped: 0, Time elapsed: 9.733 sec
Results :
Tests run: 605, Failures: 0, Errors: 0, Skipped: 2
[INFO] ------------------------------------------------------------------------
[INFO] BUILD FAILURE
[INFO] ------------------------------------------------------------------------
[INFO] Total time: 39:36.142s
[INFO] Finished at: Sun Apr 15 14:18:05 UTC 2012
[INFO] Final Memory: 79M/901M
[INFO] ------------------------------------------------------------------------
[ERROR] Failed to execute goal org.apache.maven.plugins:maven-surefire-plugin:2.12-TRUNK-HBASE-2:test (secondPartTestsExecution) on project hbase: Failure or timeout -> [Help 1]
[ERROR]
[ERROR] To see the full stack trace of the errors, re-run Maven with the -e switch.
[ERROR] Re-run Maven using the -X switch to enable full debug logging.
[ERROR]
[ERROR] For more information about the errors and possible solutions, please read the following articles:
[ERROR] [Help 1] http://cwiki.apache.org/confluence/display/MAVEN/MojoExecutionException
Build step 'Invoke top-level Maven targets' marked build as failure
Archiving artifacts
Recording test results
Build failed in Jenkins: HBase-TRUNK #2763
Posted by Apache Jenkins Server <je...@builds.apache.org>.
See <https://builds.apache.org/job/HBase-TRUNK/2763/changes>
Changes:
[jmhsieh] HBASE-5781 Zookeeper session got closed while trying to assign the region to RS using hbck -fix
------------------------------------------
[...truncated 9225 lines...]
Running org.apache.hadoop.hbase.ipc.TestDelayedRpc
Tests run: 4, Failures: 0, Errors: 0, Skipped: 0, Time elapsed: 2.621 sec
Running org.apache.hadoop.hbase.util.TestDefaultEnvironmentEdge
Tests run: 1, Failures: 0, Errors: 0, Skipped: 0, Time elapsed: 0.195 sec
Running org.apache.hadoop.hbase.util.TestIdLock
Tests run: 1, Failures: 0, Errors: 0, Skipped: 0, Time elapsed: 15.272 sec
Running org.apache.hadoop.hbase.util.TestFSTableDescriptors
Tests run: 10, Failures: 0, Errors: 0, Skipped: 0, Time elapsed: 0.862 sec
Running org.apache.hadoop.hbase.util.TestPoolMap$TestRoundRobinPoolType
Tests run: 3, Failures: 0, Errors: 0, Skipped: 0, Time elapsed: 0.008 sec
Running org.apache.hadoop.hbase.util.TestPoolMap$TestThreadLocalPoolType
Tests run: 3, Failures: 0, Errors: 0, Skipped: 0, Time elapsed: 0.005 sec
Running org.apache.hadoop.hbase.util.TestPoolMap$TestReusablePoolType
Tests run: 3, Failures: 0, Errors: 0, Skipped: 0, Time elapsed: 0.029 sec
Running org.apache.hadoop.hbase.util.TestEnvironmentEdgeManager
Tests run: 2, Failures: 0, Errors: 0, Skipped: 0, Time elapsed: 0.35 sec
Running org.apache.hadoop.hbase.util.TestRegionSplitter
Tests run: 5, Failures: 0, Errors: 0, Skipped: 0, Time elapsed: 17.723 sec
Running org.apache.hadoop.hbase.mapreduce.TestImportExport
Tests run: 2, Failures: 0, Errors: 0, Skipped: 0, Time elapsed: 105.963 sec
Running org.apache.hadoop.hbase.util.hbck.TestOfflineMetaRebuildHole
Tests run: 1, Failures: 0, Errors: 0, Skipped: 0, Time elapsed: 18.242 sec
Running org.apache.hadoop.hbase.util.hbck.TestOfflineMetaRebuildBase
Tests run: 1, Failures: 0, Errors: 0, Skipped: 0, Time elapsed: 18.257 sec
Running org.apache.hadoop.hbase.util.hbck.TestOfflineMetaRebuildOverlap
Tests run: 1, Failures: 0, Errors: 0, Skipped: 0, Time elapsed: 17.705 sec
Running org.apache.hadoop.hbase.util.TestMergeTable
Tests run: 1, Failures: 0, Errors: 0, Skipped: 0, Time elapsed: 23.725 sec
Running org.apache.hadoop.hbase.util.TestFSUtils
Tests run: 3, Failures: 0, Errors: 0, Skipped: 0, Time elapsed: 19.927 sec
Running org.apache.hadoop.hbase.TestDrainingServer
Tests run: 2, Failures: 0, Errors: 0, Skipped: 0, Time elapsed: 19.259 sec
Running org.apache.hadoop.hbase.client.TestMetaScanner
Tests run: 1, Failures: 0, Errors: 0, Skipped: 0, Time elapsed: 12.546 sec
Running org.apache.hadoop.hbase.client.TestHTablePool$TestHTableReusablePool
Tests run: 9, Failures: 0, Errors: 0, Skipped: 0, Time elapsed: 5.107 sec
Running org.apache.hadoop.hbase.client.TestHTablePool$TestHTableThreadLocalPool
Tests run: 9, Failures: 0, Errors: 0, Skipped: 0, Time elapsed: 22.008 sec
Running org.apache.hadoop.hbase.client.TestHCM
Tests run: 7, Failures: 0, Errors: 0, Skipped: 0, Time elapsed: 15.314 sec
Running org.apache.hadoop.hbase.client.TestHTableUtil
Tests run: 2, Failures: 0, Errors: 0, Skipped: 0, Time elapsed: 15.526 sec
Running org.apache.hadoop.hbase.client.TestTimestampsFilter
Tests run: 3, Failures: 0, Errors: 0, Skipped: 0, Time elapsed: 20.617 sec
Running org.apache.hadoop.hbase.client.TestMetaMigrationRemovingHTD
Tests run: 3, Failures: 0, Errors: 0, Skipped: 0, Time elapsed: 22.43 sec
Running org.apache.hadoop.hbase.client.replication.TestReplicationAdmin
Tests run: 1, Failures: 0, Errors: 0, Skipped: 0, Time elapsed: 0.794 sec
Running org.apache.hadoop.hbase.client.TestMultiParallel
Tests run: 11, Failures: 0, Errors: 0, Skipped: 0, Time elapsed: 35.26 sec
Running org.apache.hadoop.hbase.io.encoding.TestLoadAndSwitchEncodeOnDisk
Tests run: 1, Failures: 0, Errors: 0, Skipped: 0, Time elapsed: 23.669 sec
Running org.apache.hadoop.hbase.io.hfile.TestForceCacheImportantBlocks
Tests run: 4, Failures: 0, Errors: 0, Skipped: 0, Time elapsed: 52.846 sec
Running org.apache.hadoop.hbase.io.hfile.TestHFileBlockCompatibility
Tests run: 10, Failures: 0, Errors: 0, Skipped: 0, Time elapsed: 1.106 sec
Running org.apache.hadoop.hbase.io.hfile.TestLruBlockCache
Tests run: 16, Failures: 0, Errors: 0, Skipped: 0, Time elapsed: 0.738 sec
Running org.apache.hadoop.hbase.io.hfile.TestHFileBlock
Tests run: 16, Failures: 0, Errors: 0, Skipped: 0, Time elapsed: 47.634 sec
Running org.apache.hadoop.hbase.io.hfile.TestHFileBlockIndex
Tests run: 10, Failures: 0, Errors: 0, Skipped: 0, Time elapsed: 9.835 sec
Running org.apache.hadoop.hbase.io.hfile.TestChecksum
Tests run: 3, Failures: 0, Errors: 0, Skipped: 0, Time elapsed: 0.814 sec
Running org.apache.hadoop.hbase.io.hfile.TestHFilePerformance
Tests run: 1, Failures: 0, Errors: 0, Skipped: 0, Time elapsed: 6.517 sec
Running org.apache.hadoop.hbase.io.hfile.slab.TestSingleSizeCache
Tests run: 5, Failures: 0, Errors: 0, Skipped: 0, Time elapsed: 27.236 sec
Running org.apache.hadoop.hbase.io.hfile.slab.TestSlabCache
Tests run: 7, Failures: 0, Errors: 0, Skipped: 0, Time elapsed: 21.599 sec
Running org.apache.hadoop.hbase.io.hfile.TestFixedFileTrailer
Tests run: 2, Failures: 0, Errors: 0, Skipped: 0, Time elapsed: 0.528 sec
Running org.apache.hadoop.hbase.io.hfile.TestHFileSeek
Tests run: 1, Failures: 0, Errors: 0, Skipped: 0, Time elapsed: 8.164 sec
Running org.apache.hadoop.hbase.io.hfile.TestCacheOnWrite
Tests run: 36, Failures: 0, Errors: 0, Skipped: 0, Time elapsed: 34.708 sec
Running org.apache.hadoop.hbase.zookeeper.TestZKTable
Tests run: 1, Failures: 0, Errors: 0, Skipped: 0, Time elapsed: 0.637 sec
Running org.apache.hadoop.hbase.zookeeper.TestZKLeaderManager
Tests run: 1, Failures: 0, Errors: 0, Skipped: 0, Time elapsed: 0.589 sec
Running org.apache.hadoop.hbase.zookeeper.TestZooKeeperACL
Tests run: 5, Failures: 0, Errors: 0, Skipped: 0, Time elapsed: 35.765 sec
Running org.apache.hadoop.hbase.zookeeper.TestZooKeeperNodeTracker
Tests run: 2, Failures: 0, Errors: 0, Skipped: 0, Time elapsed: 0.633 sec
Running org.apache.hadoop.hbase.rest.TestSchemaResource
Tests run: 2, Failures: 0, Errors: 0, Skipped: 0, Time elapsed: 18.65 sec
Running org.apache.hadoop.hbase.rest.TestGzipFilter
Tests run: 3, Failures: 0, Errors: 0, Skipped: 0, Time elapsed: 14.861 sec
Running org.apache.hadoop.hbase.rest.TestRowResource
Tests run: 11, Failures: 0, Errors: 0, Skipped: 0, Time elapsed: 15.563 sec
Running org.apache.hadoop.hbase.rest.TestMultiRowResource
Tests run: 3, Failures: 0, Errors: 0, Skipped: 0, Time elapsed: 14.766 sec
Running org.apache.hadoop.hbase.rest.client.TestRemoteTable
Tests run: 3, Failures: 0, Errors: 0, Skipped: 0, Time elapsed: 12.976 sec
Running org.apache.hadoop.hbase.rest.client.TestRemoteAdmin
Tests run: 1, Failures: 0, Errors: 0, Skipped: 0, Time elapsed: 15.554 sec
Running org.apache.hadoop.hbase.rest.TestVersionResource
Tests run: 7, Failures: 0, Errors: 0, Skipped: 0, Time elapsed: 12.302 sec
Running org.apache.hadoop.hbase.rest.TestTableResource
Tests run: 8, Failures: 0, Errors: 0, Skipped: 0, Time elapsed: 21.634 sec
Running org.apache.hadoop.hbase.rest.TestScannerResource
Tests run: 5, Failures: 0, Errors: 0, Skipped: 0, Time elapsed: 30.231 sec
Running org.apache.hadoop.hbase.rest.TestStatusResource
Tests run: 2, Failures: 0, Errors: 0, Skipped: 0, Time elapsed: 11.314 sec
Running org.apache.hadoop.hbase.rest.TestScannersWithFilters
Tests run: 10, Failures: 0, Errors: 0, Skipped: 0, Time elapsed: 16.877 sec
Running org.apache.hadoop.hbase.TestInfoServers
Tests run: 2, Failures: 0, Errors: 0, Skipped: 0, Time elapsed: 10.311 sec
Running org.apache.hadoop.hbase.monitoring.TestTaskMonitor
Tests run: 3, Failures: 0, Errors: 0, Skipped: 0, Time elapsed: 0.294 sec
Running org.apache.hadoop.hbase.monitoring.TestMemoryBoundedLogMessageBuffer
Tests run: 2, Failures: 0, Errors: 0, Skipped: 0, Time elapsed: 0.229 sec
Running org.apache.hadoop.hbase.metrics.TestMetricsMBeanBase
Tests run: 2, Failures: 0, Errors: 0, Skipped: 0, Time elapsed: 1.146 sec
Running org.apache.hadoop.hbase.regionserver.TestServerCustomProtocol
Tests run: 7, Failures: 0, Errors: 0, Skipped: 0, Time elapsed: 16.201 sec
Running org.apache.hadoop.hbase.regionserver.TestAtomicOperation
Tests run: 5, Failures: 0, Errors: 0, Skipped: 0, Time elapsed: 26.652 sec
Running org.apache.hadoop.hbase.regionserver.TestHRegion
Tests run: 62, Failures: 0, Errors: 0, Skipped: 0, Time elapsed: 56.403 sec
Running org.apache.hadoop.hbase.regionserver.wal.TestWALReplayCompressed
Tests run: 5, Failures: 0, Errors: 0, Skipped: 0, Time elapsed: 27.825 sec
Running org.apache.hadoop.hbase.regionserver.wal.TestLogRollAbort
Tests run: 1, Failures: 0, Errors: 0, Skipped: 0, Time elapsed: 162.986 sec
Running org.apache.hadoop.hbase.regionserver.wal.TestWALReplay
Tests run: 5, Failures: 0, Errors: 0, Skipped: 0, Time elapsed: 27.039 sec
Running org.apache.hadoop.hbase.regionserver.wal.TestLogRollingNoCluster
Tests run: 1, Failures: 0, Errors: 0, Skipped: 0, Time elapsed: 2.121 sec
Running org.apache.hadoop.hbase.regionserver.wal.TestHLogBench
Tests run: 1, Failures: 0, Errors: 0, Skipped: 0, Time elapsed: 1.358 sec
Running org.apache.hadoop.hbase.regionserver.TestStore
Tests run: 12, Failures: 0, Errors: 0, Skipped: 0, Time elapsed: 9.452 sec
Running org.apache.hadoop.hbase.regionserver.TestRpcMetrics
Tests run: 1, Failures: 0, Errors: 0, Skipped: 0, Time elapsed: 2.076 sec
Running org.apache.hadoop.hbase.regionserver.TestBlocksRead
Tests run: 4, Failures: 0, Errors: 0, Skipped: 0, Time elapsed: 1.094 sec
Running org.apache.hadoop.hbase.regionserver.TestRegionServerMetrics
Tests run: 2, Failures: 0, Errors: 0, Skipped: 0, Time elapsed: 42.339 sec
Running org.apache.hadoop.hbase.regionserver.metrics.TestSchemaMetrics
Tests run: 6, Failures: 0, Errors: 0, Skipped: 0, Time elapsed: 15.111 sec
Running org.apache.hadoop.hbase.regionserver.TestParallelPut
Tests run: 2, Failures: 0, Errors: 0, Skipped: 0, Time elapsed: 5.37 sec
Running org.apache.hadoop.hbase.regionserver.TestStoreScanner
Tests run: 16, Failures: 0, Errors: 0, Skipped: 0, Time elapsed: 0.057 sec
Running org.apache.hadoop.hbase.regionserver.TestStoreFileBlockCacheSummary
Tests run: 1, Failures: 0, Errors: 0, Skipped: 0, Time elapsed: 13.905 sec
Running org.apache.hadoop.hbase.regionserver.TestMultiColumnScanner
Tests run: 12, Failures: 0, Errors: 0, Skipped: 0, Time elapsed: 41.033 sec
Running org.apache.hadoop.hbase.regionserver.handler.TestCloseRegionHandler
Tests run: 3, Failures: 0, Errors: 0, Skipped: 0, Time elapsed: 1.194 sec
Running org.apache.hadoop.hbase.regionserver.handler.TestOpenRegionHandler
Tests run: 3, Failures: 0, Errors: 0, Skipped: 0, Time elapsed: 0.916 sec
Running org.apache.hadoop.hbase.regionserver.TestMasterAddressManager
Tests run: 1, Failures: 0, Errors: 0, Skipped: 0, Time elapsed: 0.609 sec
Running org.apache.hadoop.hbase.regionserver.TestSplitLogWorker
Tests run: 5, Failures: 0, Errors: 0, Skipped: 0, Time elapsed: 2.089 sec
Running org.apache.hadoop.hbase.regionserver.TestSeekOptimizations
Tests run: 6, Failures: 0, Errors: 0, Skipped: 0, Time elapsed: 2.776 sec
Running org.apache.hadoop.hbase.regionserver.TestFSErrorsExposed
Tests run: 3, Failures: 0, Errors: 0, Skipped: 0, Time elapsed: 29.02 sec
Running org.apache.hadoop.hbase.filter.TestColumnRangeFilter
Tests run: 1, Failures: 0, Errors: 0, Skipped: 0, Time elapsed: 18.29 sec
Running org.apache.hadoop.hbase.TestGlobalMemStoreSize
Tests run: 1, Failures: 0, Errors: 0, Skipped: 0, Time elapsed: 16.062 sec
Running org.apache.hadoop.hbase.TestMultiVersions
Tests run: 3, Failures: 0, Errors: 0, Skipped: 0, Time elapsed: 21.752 sec
Running org.apache.hadoop.hbase.replication.TestReplicationZookeeper
Tests run: 1, Failures: 0, Errors: 0, Skipped: 0, Time elapsed: 0.548 sec
Running org.apache.hadoop.hbase.replication.regionserver.TestReplicationSourceManager
Tests run: 1, Failures: 0, Errors: 0, Skipped: 0, Time elapsed: 0.912 sec
Running org.apache.hadoop.hbase.thrift2.TestThriftHBaseServiceHandler
Tests run: 12, Failures: 0, Errors: 0, Skipped: 0, Time elapsed: 12.999 sec
Running org.apache.hadoop.hbase.replication.TestReplicationPeer
Tests run: 1, Failures: 0, Errors: 0, Skipped: 0, Time elapsed: 1.336 sec
Running org.apache.hadoop.hbase.replication.TestReplicationSource
Tests run: 1, Failures: 0, Errors: 0, Skipped: 0, Time elapsed: 2.509 sec
Running org.apache.hadoop.hbase.replication.regionserver.TestReplicationSink
Tests run: 5, Failures: 0, Errors: 0, Skipped: 0, Time elapsed: 29.378 sec
Running org.apache.hadoop.hbase.avro.TestAvroServer
Tests run: 3, Failures: 0, Errors: 0, Skipped: 0, Time elapsed: 26.415 sec
Running org.apache.hadoop.hbase.coprocessor.TestRegionServerCoprocessorExceptionWithRemove
Tests run: 1, Failures: 0, Errors: 0, Skipped: 0, Time elapsed: 15.778 sec
Running org.apache.hadoop.hbase.coprocessor.TestRegionObserverInterface
Tests run: 6, Failures: 0, Errors: 0, Skipped: 0, Time elapsed: 32.446 sec
Running org.apache.hadoop.hbase.coprocessor.TestMasterObserver
Tests run: 3, Failures: 0, Errors: 0, Skipped: 0, Time elapsed: 26.085 sec
Running org.apache.hadoop.hbase.TestAcidGuarantees
Tests run: 3, Failures: 0, Errors: 0, Skipped: 0, Time elapsed: 93.937 sec
Running org.apache.hadoop.hbase.coprocessor.TestCoprocessorEndpoint
Tests run: 3, Failures: 0, Errors: 0, Skipped: 1, Time elapsed: 30.385 sec
Running org.apache.hadoop.hbase.coprocessor.TestWALObserver
Tests run: 3, Failures: 0, Errors: 0, Skipped: 0, Time elapsed: 14.704 sec
Running org.apache.hadoop.hbase.coprocessor.TestRegionObserverBypass
Tests run: 2, Failures: 0, Errors: 0, Skipped: 0, Time elapsed: 11.681 sec
Running org.apache.hadoop.hbase.coprocessor.TestRegionServerCoprocessorExceptionWithAbort
Tests run: 1, Failures: 0, Errors: 0, Skipped: 0, Time elapsed: 13.512 sec
Running org.apache.hadoop.hbase.coprocessor.TestMasterCoprocessorExceptionWithAbort
Tests run: 1, Failures: 0, Errors: 0, Skipped: 0, Time elapsed: 24.355 sec
Running org.apache.hadoop.hbase.coprocessor.TestAggregateProtocol
Tests run: 45, Failures: 0, Errors: 0, Skipped: 0, Time elapsed: 17.239 sec
Running org.apache.hadoop.hbase.coprocessor.TestMasterCoprocessorExceptionWithRemove
Tests run: 1, Failures: 0, Errors: 0, Skipped: 0, Time elapsed: 14.496 sec
Running org.apache.hadoop.hbase.constraint.TestConstraint
Tests run: 5, Failures: 0, Errors: 0, Skipped: 0, Time elapsed: 30.158 sec
Running org.apache.hadoop.hbase.coprocessor.TestClassLoading
Tests run: 6, Failures: 0, Errors: 0, Skipped: 0, Time elapsed: 30.429 sec
Running org.apache.hadoop.hbase.master.TestActiveMasterManager
Tests run: 2, Failures: 0, Errors: 0, Skipped: 0, Time elapsed: 0.836 sec
Running org.apache.hadoop.hbase.master.TestMasterStatusServlet
Tests run: 5, Failures: 0, Errors: 0, Skipped: 0, Time elapsed: 1.051 sec
Running org.apache.hadoop.hbase.master.TestClockSkewDetection
Tests run: 1, Failures: 0, Errors: 0, Skipped: 0, Time elapsed: 0.301 sec
Running org.apache.hadoop.hbase.master.TestDefaultLoadBalancer
Tests run: 4, Failures: 0, Errors: 0, Skipped: 0, Time elapsed: 1.423 sec
Running org.apache.hadoop.hbase.master.TestHMasterRPCException
Tests run: 1, Failures: 0, Errors: 0, Skipped: 0, Time elapsed: 1.238 sec
Running org.apache.hadoop.hbase.master.TestOpenedRegionHandler
Tests run: 2, Failures: 0, Errors: 0, Skipped: 0, Time elapsed: 14.041 sec
Running org.apache.hadoop.hbase.master.TestMaster
Tests run: 1, Failures: 0, Errors: 0, Skipped: 0, Time elapsed: 15.732 sec
Running org.apache.hadoop.hbase.master.TestLogsCleaner
Tests run: 1, Failures: 0, Errors: 0, Skipped: 0, Time elapsed: 3.011 sec
Running org.apache.hadoop.hbase.master.TestSplitLogManager
Tests run: 12, Failures: 0, Errors: 0, Skipped: 0, Time elapsed: 14.214 sec
Running org.apache.hadoop.hbase.master.TestZKBasedOpenCloseRegion
Tests run: 3, Failures: 0, Errors: 0, Skipped: 0, Time elapsed: 17.408 sec
Results :
Tests run: 605, Failures: 0, Errors: 0, Skipped: 2
[INFO] ------------------------------------------------------------------------
[INFO] BUILD FAILURE
[INFO] ------------------------------------------------------------------------
[INFO] Total time: 35:42.724s
[INFO] Finished at: Sun Apr 15 09:42:29 UTC 2012
[INFO] Final Memory: 79M/721M
[INFO] ------------------------------------------------------------------------
[ERROR] Failed to execute goal org.apache.maven.plugins:maven-surefire-plugin:2.12-TRUNK-HBASE-2:test (secondPartTestsExecution) on project hbase: Failure or timeout -> [Help 1]
[ERROR]
[ERROR] To see the full stack trace of the errors, re-run Maven with the -e switch.
[ERROR] Re-run Maven using the -X switch to enable full debug logging.
[ERROR]
[ERROR] For more information about the errors and possible solutions, please read the following articles:
[ERROR] [Help 1] http://cwiki.apache.org/confluence/display/MAVEN/MojoExecutionException
Build step 'Invoke top-level Maven targets' marked build as failure
Archiving artifacts
Recording test results
Updating HBASE-5781
Build failed in Jenkins: HBase-TRUNK #2762
Posted by Apache Jenkins Server <je...@builds.apache.org>.
See <https://builds.apache.org/job/HBase-TRUNK/2762/>
------------------------------------------
[...truncated 9160 lines...]
Running org.apache.hadoop.hbase.mapreduce.TestImportTsv
Tests run: 8, Failures: 0, Errors: 0, Skipped: 0, Time elapsed: 101.173 sec
Running org.apache.hadoop.hbase.rest.TestMultiRowResource
Tests run: 3, Failures: 0, Errors: 0, Skipped: 0, Time elapsed: 17.949 sec
Running org.apache.hadoop.hbase.rest.TestVersionResource
Tests run: 7, Failures: 0, Errors: 0, Skipped: 0, Time elapsed: 14.787 sec
Running org.apache.hadoop.hbase.rest.TestStatusResource
Tests run: 2, Failures: 0, Errors: 0, Skipped: 0, Time elapsed: 14.38 sec
Running org.apache.hadoop.hbase.rest.TestScannersWithFilters
Tests run: 10, Failures: 0, Errors: 0, Skipped: 0, Time elapsed: 21.501 sec
Running org.apache.hadoop.hbase.rest.TestRowResource
Tests run: 11, Failures: 0, Errors: 0, Skipped: 0, Time elapsed: 18.071 sec
Running org.apache.hadoop.hbase.rest.TestTableResource
Tests run: 8, Failures: 0, Errors: 0, Skipped: 0, Time elapsed: 27.088 sec
Running org.apache.hadoop.hbase.rest.TestGzipFilter
Tests run: 3, Failures: 0, Errors: 0, Skipped: 0, Time elapsed: 17.173 sec
Running org.apache.hadoop.hbase.rest.TestSchemaResource
Tests run: 2, Failures: 0, Errors: 0, Skipped: 0, Time elapsed: 22.385 sec
Running org.apache.hadoop.hbase.rest.client.TestRemoteAdmin
Tests run: 1, Failures: 0, Errors: 0, Skipped: 0, Time elapsed: 18.963 sec
Running org.apache.hadoop.hbase.rest.client.TestRemoteTable
Tests run: 3, Failures: 0, Errors: 0, Skipped: 0, Time elapsed: 17.175 sec
Running org.apache.hadoop.hbase.zookeeper.TestZooKeeperNodeTracker
Tests run: 2, Failures: 0, Errors: 0, Skipped: 0, Time elapsed: 0.746 sec
Running org.apache.hadoop.hbase.zookeeper.TestZKTable
Tests run: 1, Failures: 0, Errors: 0, Skipped: 0, Time elapsed: 0.757 sec
Running org.apache.hadoop.hbase.rest.TestScannerResource
Tests run: 5, Failures: 0, Errors: 0, Skipped: 0, Time elapsed: 34.271 sec
Running org.apache.hadoop.hbase.zookeeper.TestZKLeaderManager
Tests run: 1, Failures: 0, Errors: 0, Skipped: 0, Time elapsed: 0.75 sec
Running org.apache.hadoop.hbase.zookeeper.TestZooKeeperACL
Tests run: 5, Failures: 0, Errors: 0, Skipped: 0, Time elapsed: 36.403 sec
Running org.apache.hadoop.hbase.monitoring.TestMemoryBoundedLogMessageBuffer
Tests run: 2, Failures: 0, Errors: 0, Skipped: 0, Time elapsed: 0.232 sec
Running org.apache.hadoop.hbase.monitoring.TestTaskMonitor
Tests run: 3, Failures: 0, Errors: 0, Skipped: 0, Time elapsed: 0.307 sec
Running org.apache.hadoop.hbase.filter.TestColumnRangeFilter
Tests run: 1, Failures: 0, Errors: 0, Skipped: 0, Time elapsed: 23.292 sec
Running org.apache.hadoop.hbase.TestDrainingServer
Tests run: 2, Failures: 0, Errors: 0, Skipped: 0, Time elapsed: 32.03 sec
Running org.apache.hadoop.hbase.io.encoding.TestLoadAndSwitchEncodeOnDisk
Tests run: 1, Failures: 0, Errors: 0, Skipped: 0, Time elapsed: 42.637 sec
Running org.apache.hadoop.hbase.io.hfile.slab.TestSingleSizeCache
Tests run: 5, Failures: 0, Errors: 0, Skipped: 0, Time elapsed: 29.193 sec
Running org.apache.hadoop.hbase.io.hfile.TestLruBlockCache
Tests run: 16, Failures: 0, Errors: 0, Skipped: 0, Time elapsed: 1.096 sec
Running org.apache.hadoop.hbase.io.hfile.TestFixedFileTrailer
Tests run: 2, Failures: 0, Errors: 0, Skipped: 0, Time elapsed: 0.557 sec
Running org.apache.hadoop.hbase.io.hfile.TestHFileSeek
Tests run: 1, Failures: 0, Errors: 0, Skipped: 0, Time elapsed: 8.569 sec
Running org.apache.hadoop.hbase.io.hfile.slab.TestSlabCache
Tests run: 7, Failures: 0, Errors: 0, Skipped: 0, Time elapsed: 20.406 sec
Running org.apache.hadoop.hbase.io.hfile.TestCacheOnWrite
Tests run: 36, Failures: 0, Errors: 0, Skipped: 0, Time elapsed: 40.276 sec
Running org.apache.hadoop.hbase.io.hfile.TestForceCacheImportantBlocks
Tests run: 4, Failures: 0, Errors: 1, Skipped: 0, Time elapsed: 50.157 sec <<< FAILURE!
Running org.apache.hadoop.hbase.io.hfile.TestHFileBlockIndex
Tests run: 10, Failures: 0, Errors: 0, Skipped: 0, Time elapsed: 10.976 sec
Running org.apache.hadoop.hbase.io.hfile.TestHFileBlockCompatibility
Tests run: 10, Failures: 0, Errors: 0, Skipped: 0, Time elapsed: 1.786 sec
Running org.apache.hadoop.hbase.io.hfile.TestChecksum
Tests run: 3, Failures: 0, Errors: 0, Skipped: 0, Time elapsed: 1.187 sec
Running org.apache.hadoop.hbase.io.hfile.TestHFilePerformance
Tests run: 1, Failures: 0, Errors: 0, Skipped: 0, Time elapsed: 7.284 sec
Running org.apache.hadoop.hbase.metrics.TestMetricsMBeanBase
Tests run: 2, Failures: 0, Errors: 0, Skipped: 0, Time elapsed: 1.134 sec
Running org.apache.hadoop.hbase.replication.TestReplicationPeer
Tests run: 1, Failures: 0, Errors: 0, Skipped: 0, Time elapsed: 1.656 sec
Running org.apache.hadoop.hbase.replication.TestReplicationSource
Tests run: 1, Failures: 0, Errors: 0, Skipped: 0, Time elapsed: 5.302 sec
Running org.apache.hadoop.hbase.replication.regionserver.TestReplicationSourceManager
Tests run: 1, Failures: 0, Errors: 0, Skipped: 0, Time elapsed: 1.916 sec
Running org.apache.hadoop.hbase.io.hfile.TestHFileBlock
Tests run: 16, Failures: 0, Errors: 0, Skipped: 0, Time elapsed: 47.611 sec
Running org.apache.hadoop.hbase.replication.TestReplicationZookeeper
Tests run: 1, Failures: 0, Errors: 0, Skipped: 0, Time elapsed: 0.753 sec
Running org.apache.hadoop.hbase.replication.regionserver.TestReplicationSink
Tests run: 5, Failures: 0, Errors: 0, Skipped: 0, Time elapsed: 36.138 sec
Running org.apache.hadoop.hbase.coprocessor.TestClassLoading
Tests run: 6, Failures: 0, Errors: 0, Skipped: 0, Time elapsed: 35.874 sec
Running org.apache.hadoop.hbase.coprocessor.TestAggregateProtocol
Tests run: 45, Failures: 0, Errors: 0, Skipped: 0, Time elapsed: 21.448 sec
Running org.apache.hadoop.hbase.coprocessor.TestRegionObserverBypass
Tests run: 2, Failures: 0, Errors: 0, Skipped: 0, Time elapsed: 17.004 sec
Running org.apache.hadoop.hbase.coprocessor.TestRegionServerCoprocessorExceptionWithAbort
Tests run: 1, Failures: 0, Errors: 0, Skipped: 0, Time elapsed: 19.996 sec
Running org.apache.hadoop.hbase.coprocessor.TestCoprocessorEndpoint
Tests run: 3, Failures: 0, Errors: 0, Skipped: 1, Time elapsed: 33.316 sec
Running org.apache.hadoop.hbase.coprocessor.TestRegionObserverInterface
Tests run: 6, Failures: 0, Errors: 0, Skipped: 0, Time elapsed: 38.062 sec
Running org.apache.hadoop.hbase.coprocessor.TestMasterCoprocessorExceptionWithRemove
Tests run: 1, Failures: 0, Errors: 0, Skipped: 0, Time elapsed: 18.476 sec
Running org.apache.hadoop.hbase.coprocessor.TestRegionServerCoprocessorExceptionWithRemove
Tests run: 1, Failures: 0, Errors: 0, Skipped: 0, Time elapsed: 21.507 sec
Running org.apache.hadoop.hbase.coprocessor.TestWALObserver
Tests run: 3, Failures: 0, Errors: 0, Skipped: 0, Time elapsed: 18.704 sec
Running org.apache.hadoop.hbase.coprocessor.TestMasterObserver
Tests run: 3, Failures: 0, Errors: 0, Skipped: 0, Time elapsed: 33.012 sec
Running org.apache.hadoop.hbase.coprocessor.TestMasterCoprocessorExceptionWithAbort
Tests run: 1, Failures: 0, Errors: 0, Skipped: 0, Time elapsed: 29.529 sec
Running org.apache.hadoop.hbase.util.TestFSUtils
Tests run: 3, Failures: 0, Errors: 0, Skipped: 0, Time elapsed: 26.806 sec
Running org.apache.hadoop.hbase.util.TestMergeTable
Tests run: 1, Failures: 0, Errors: 0, Skipped: 0, Time elapsed: 34.068 sec
Running org.apache.hadoop.hbase.util.hbck.TestOfflineMetaRebuildOverlap
Tests run: 1, Failures: 0, Errors: 0, Skipped: 0, Time elapsed: 29.35 sec
Running org.apache.hadoop.hbase.util.hbck.TestOfflineMetaRebuildBase
Tests run: 1, Failures: 0, Errors: 0, Skipped: 0, Time elapsed: 25.62 sec
Running org.apache.hadoop.hbase.util.TestPoolMap$TestRoundRobinPoolType
Tests run: 3, Failures: 0, Errors: 0, Skipped: 0, Time elapsed: 0.013 sec
Running org.apache.hadoop.hbase.util.TestPoolMap$TestThreadLocalPoolType
Tests run: 3, Failures: 0, Errors: 0, Skipped: 0, Time elapsed: 0.009 sec
Running org.apache.hadoop.hbase.util.TestPoolMap$TestReusablePoolType
Tests run: 3, Failures: 0, Errors: 0, Skipped: 0, Time elapsed: 0.039 sec
Running org.apache.hadoop.hbase.util.hbck.TestOfflineMetaRebuildHole
Tests run: 1, Failures: 0, Errors: 0, Skipped: 0, Time elapsed: 23.272 sec
Running org.apache.hadoop.hbase.util.TestIdLock
Tests run: 1, Failures: 0, Errors: 0, Skipped: 0, Time elapsed: 15.278 sec
Running org.apache.hadoop.hbase.util.TestDefaultEnvironmentEdge
Tests run: 1, Failures: 0, Errors: 0, Skipped: 0, Time elapsed: 0.209 sec
Running org.apache.hadoop.hbase.util.TestFSTableDescriptors
Tests run: 10, Failures: 0, Errors: 0, Skipped: 0, Time elapsed: 0.936 sec
Running org.apache.hadoop.hbase.util.TestEnvironmentEdgeManager
Tests run: 2, Failures: 0, Errors: 0, Skipped: 0, Time elapsed: 0.36 sec
Running org.apache.hadoop.hbase.util.TestRegionSplitter
Tests run: 5, Failures: 0, Errors: 0, Skipped: 0, Time elapsed: 24.063 sec
Running org.apache.hadoop.hbase.regionserver.TestStoreFileBlockCacheSummary
Tests run: 1, Failures: 0, Errors: 0, Skipped: 0, Time elapsed: 18.631 sec
Running org.apache.hadoop.hbase.regionserver.TestStore
Tests run: 12, Failures: 0, Errors: 0, Skipped: 0, Time elapsed: 9.398 sec
Running org.apache.hadoop.hbase.regionserver.TestRegionServerMetrics
Tests run: 2, Failures: 0, Errors: 0, Skipped: 0, Time elapsed: 54.628 sec
Running org.apache.hadoop.hbase.regionserver.handler.TestOpenRegionHandler
Tests run: 3, Failures: 0, Errors: 0, Skipped: 0, Time elapsed: 1.141 sec
Running org.apache.hadoop.hbase.regionserver.handler.TestCloseRegionHandler
Tests run: 3, Failures: 0, Errors: 0, Skipped: 0, Time elapsed: 1.373 sec
Running org.apache.hadoop.hbase.regionserver.TestParallelPut
Tests run: 2, Failures: 0, Errors: 0, Skipped: 0, Time elapsed: 5.295 sec
Running org.apache.hadoop.hbase.regionserver.TestServerCustomProtocol
Tests run: 7, Failures: 0, Errors: 0, Skipped: 0, Time elapsed: 20.075 sec
Running org.apache.hadoop.hbase.regionserver.TestAtomicOperation
Tests run: 5, Failures: 0, Errors: 0, Skipped: 0, Time elapsed: 27.349 sec
Running org.apache.hadoop.hbase.regionserver.TestBlocksRead
Tests run: 4, Failures: 0, Errors: 0, Skipped: 0, Time elapsed: 1.042 sec
Running org.apache.hadoop.hbase.regionserver.TestMasterAddressManager
Tests run: 1, Failures: 0, Errors: 0, Skipped: 0, Time elapsed: 0.643 sec
Running org.apache.hadoop.hbase.regionserver.wal.TestWALReplayCompressed
Tests run: 5, Failures: 0, Errors: 0, Skipped: 0, Time elapsed: 42.498 sec
Running org.apache.hadoop.hbase.regionserver.wal.TestWALReplay
Tests run: 5, Failures: 0, Errors: 0, Skipped: 0, Time elapsed: 41.515 sec
Running org.apache.hadoop.hbase.regionserver.wal.TestLogRollingNoCluster
Tests run: 1, Failures: 0, Errors: 0, Skipped: 0, Time elapsed: 2.209 sec
Running org.apache.hadoop.hbase.regionserver.wal.TestHLogBench
Tests run: 1, Failures: 0, Errors: 0, Skipped: 0, Time elapsed: 1.354 sec
Running org.apache.hadoop.hbase.regionserver.wal.TestLogRollAbort
Tests run: 1, Failures: 0, Errors: 0, Skipped: 0, Time elapsed: 158.269 sec
Running org.apache.hadoop.hbase.regionserver.metrics.TestSchemaMetrics
Tests run: 6, Failures: 0, Errors: 0, Skipped: 0, Time elapsed: 15.072 sec
Running org.apache.hadoop.hbase.regionserver.TestRpcMetrics
Tests run: 1, Failures: 0, Errors: 0, Skipped: 0, Time elapsed: 2.06 sec
Running org.apache.hadoop.hbase.regionserver.TestStoreScanner
Tests run: 16, Failures: 0, Errors: 0, Skipped: 0, Time elapsed: 0.055 sec
Running org.apache.hadoop.hbase.regionserver.TestSeekOptimizations
Tests run: 6, Failures: 0, Errors: 0, Skipped: 0, Time elapsed: 2.937 sec
Running org.apache.hadoop.hbase.regionserver.TestFSErrorsExposed
Tests run: 3, Failures: 0, Errors: 0, Skipped: 0, Time elapsed: 32.735 sec
Running org.apache.hadoop.hbase.regionserver.TestSplitLogWorker
Tests run: 5, Failures: 0, Errors: 0, Skipped: 0, Time elapsed: 2.548 sec
Running org.apache.hadoop.hbase.regionserver.TestMultiColumnScanner
Tests run: 12, Failures: 0, Errors: 0, Skipped: 0, Time elapsed: 41.819 sec
Running org.apache.hadoop.hbase.client.replication.TestReplicationAdmin
Tests run: 1, Failures: 0, Errors: 0, Skipped: 0, Time elapsed: 0.969 sec
Running org.apache.hadoop.hbase.client.TestTimestampsFilter
Tests run: 3, Failures: 0, Errors: 0, Skipped: 0, Time elapsed: 30.985 sec
Running org.apache.hadoop.hbase.regionserver.TestHRegion
Tests run: 62, Failures: 0, Errors: 0, Skipped: 0, Time elapsed: 61.4 sec
Running org.apache.hadoop.hbase.client.TestHCM
Tests run: 7, Failures: 0, Errors: 0, Skipped: 0, Time elapsed: 26.542 sec
Running org.apache.hadoop.hbase.client.TestHTablePool$TestHTableReusablePool
Tests run: 9, Failures: 0, Errors: 0, Skipped: 0, Time elapsed: 6.213 sec
Running org.apache.hadoop.hbase.client.TestHTableUtil
Tests run: 2, Failures: 0, Errors: 0, Skipped: 0, Time elapsed: 17.899 sec
Running org.apache.hadoop.hbase.client.TestHTablePool$TestHTableThreadLocalPool
Tests run: 9, Failures: 0, Errors: 0, Skipped: 0, Time elapsed: 27.604 sec
Running org.apache.hadoop.hbase.client.TestMetaScanner
Tests run: 1, Failures: 0, Errors: 0, Skipped: 0, Time elapsed: 16.998 sec
Running org.apache.hadoop.hbase.client.TestMetaMigrationRemovingHTD
Tests run: 3, Failures: 0, Errors: 0, Skipped: 0, Time elapsed: 32.131 sec
Running org.apache.hadoop.hbase.TestMultiVersions
Tests run: 3, Failures: 0, Errors: 0, Skipped: 0, Time elapsed: 29.17 sec
Running org.apache.hadoop.hbase.client.TestMultiParallel
Tests run: 11, Failures: 0, Errors: 0, Skipped: 0, Time elapsed: 49.152 sec
Running org.apache.hadoop.hbase.master.TestActiveMasterManager
Tests run: 2, Failures: 0, Errors: 0, Skipped: 0, Time elapsed: 1.238 sec
Running org.apache.hadoop.hbase.master.TestLogsCleaner
Tests run: 1, Failures: 0, Errors: 0, Skipped: 0, Time elapsed: 3.395 sec
Running org.apache.hadoop.hbase.master.TestZKBasedOpenCloseRegion
Tests run: 3, Failures: 0, Errors: 0, Skipped: 0, Time elapsed: 29.748 sec
Running org.apache.hadoop.hbase.master.TestMaster
Tests run: 1, Failures: 0, Errors: 0, Skipped: 0, Time elapsed: 20.544 sec
Running org.apache.hadoop.hbase.thrift.TestThriftServer
Tests run: 1, Failures: 0, Errors: 0, Skipped: 0, Time elapsed: 75.165 sec
Running org.apache.hadoop.hbase.master.TestClockSkewDetection
Tests run: 1, Failures: 0, Errors: 0, Skipped: 0, Time elapsed: 0.301 sec
Running org.apache.hadoop.hbase.master.TestOpenedRegionHandler
Tests run: 2, Failures: 0, Errors: 0, Skipped: 0, Time elapsed: 18.011 sec
Running org.apache.hadoop.hbase.master.TestDefaultLoadBalancer
Tests run: 4, Failures: 0, Errors: 0, Skipped: 0, Time elapsed: 1.448 sec
Running org.apache.hadoop.hbase.master.TestMasterStatusServlet
Tests run: 5, Failures: 0, Errors: 0, Skipped: 0, Time elapsed: 1.086 sec
Running org.apache.hadoop.hbase.master.TestHMasterRPCException
Tests run: 1, Failures: 0, Errors: 0, Skipped: 0, Time elapsed: 1.354 sec
Running org.apache.hadoop.hbase.master.TestSplitLogManager
Tests run: 12, Failures: 0, Errors: 0, Skipped: 0, Time elapsed: 16.24 sec
Running org.apache.hadoop.hbase.avro.TestAvroServer
Tests run: 3, Failures: 0, Errors: 0, Skipped: 0, Time elapsed: 34.226 sec
Running org.apache.hadoop.hbase.ipc.TestDelayedRpc
Tests run: 4, Failures: 0, Errors: 0, Skipped: 0, Time elapsed: 2.713 sec
Running org.apache.hadoop.hbase.thrift2.TestThriftHBaseServiceHandler
Tests run: 12, Failures: 0, Errors: 0, Skipped: 0, Time elapsed: 17.741 sec
Running org.apache.hadoop.hbase.TestInfoServers
Tests run: 2, Failures: 0, Errors: 0, Skipped: 0, Time elapsed: 14.809 sec
Running org.apache.hadoop.hbase.TestAcidGuarantees
Tests run: 3, Failures: 0, Errors: 0, Skipped: 0, Time elapsed: 111.316 sec
Results :
Tests in error:
testCacheBlocks[1](org.apache.hadoop.hbase.io.hfile.TestForceCacheImportantBlocks)
Tests run: 605, Failures: 0, Errors: 1, Skipped: 2
[INFO] ------------------------------------------------------------------------
[INFO] BUILD FAILURE
[INFO] ------------------------------------------------------------------------
[INFO] Total time: 39:44.615s
[INFO] Finished at: Sat Apr 14 14:13:49 UTC 2012
[INFO] Final Memory: 78M/627M
[INFO] ------------------------------------------------------------------------
[ERROR] Failed to execute goal org.apache.maven.plugins:maven-surefire-plugin:2.12-TRUNK-HBASE-2:test (secondPartTestsExecution) on project hbase: Failure or timeout -> [Help 1]
[ERROR]
[ERROR] To see the full stack trace of the errors, re-run Maven with the -e switch.
[ERROR] Re-run Maven using the -X switch to enable full debug logging.
[ERROR]
[ERROR] For more information about the errors and possible solutions, please read the following articles:
[ERROR] [Help 1] http://cwiki.apache.org/confluence/display/MAVEN/MojoExecutionException
Build step 'Invoke top-level Maven targets' marked build as failure
Archiving artifacts
Recording test results
Build failed in Jenkins: HBase-TRUNK #2761
Posted by Apache Jenkins Server <je...@builds.apache.org>.
See <https://builds.apache.org/job/HBase-TRUNK/2761/>
------------------------------------------
[...truncated 17763 lines...]
Forking command line: /bin/sh -c cd <https://builds.apache.org/job/HBase-TRUNK/ws/trunk> && /home/jenkins/tools/java/jdk1.6.0_27-32/jre/bin/java -enableassertions -Xmx1900m -Djava.security.egd=file:/dev/./urandom -jar <https://builds.apache.org/job/HBase-TRUNK/ws/trunk/target/surefire/surefirebooter4217489369275067305.jar> <https://builds.apache.org/job/HBase-TRUNK/ws/trunk/target/surefire/surefire5696718592905022007tmp> <https://builds.apache.org/job/HBase-TRUNK/ws/trunk/target/surefire/surefire_521863878122733064106tmp>
Running org.apache.hadoop.hbase.regionserver.wal.TestHLogBench
Tests run: 1, Failures: 0, Errors: 0, Skipped: 0, Time elapsed: 1.348 sec
Forking command line: /bin/sh -c cd <https://builds.apache.org/job/HBase-TRUNK/ws/trunk> && /home/jenkins/tools/java/jdk1.6.0_27-32/jre/bin/java -enableassertions -Xmx1900m -Djava.security.egd=file:/dev/./urandom -jar <https://builds.apache.org/job/HBase-TRUNK/ws/trunk/target/surefire/surefirebooter4536224959703402406.jar> <https://builds.apache.org/job/HBase-TRUNK/ws/trunk/target/surefire/surefire5638735868434691520tmp> <https://builds.apache.org/job/HBase-TRUNK/ws/trunk/target/surefire/surefire_539169780654843542042tmp>
Running org.apache.hadoop.hbase.regionserver.handler.TestCloseRegionHandler
Tests run: 3, Failures: 0, Errors: 0, Skipped: 0, Time elapsed: 1.32 sec
Forking command line: /bin/sh -c cd <https://builds.apache.org/job/HBase-TRUNK/ws/trunk> && /home/jenkins/tools/java/jdk1.6.0_27-32/jre/bin/java -enableassertions -Xmx1900m -Djava.security.egd=file:/dev/./urandom -jar <https://builds.apache.org/job/HBase-TRUNK/ws/trunk/target/surefire/surefirebooter5572735731614646211.jar> <https://builds.apache.org/job/HBase-TRUNK/ws/trunk/target/surefire/surefire8149564315104172860tmp> <https://builds.apache.org/job/HBase-TRUNK/ws/trunk/target/surefire/surefire_544022935386554208978tmp>
Running org.apache.hadoop.hbase.regionserver.handler.TestOpenRegionHandler
Tests run: 3, Failures: 0, Errors: 0, Skipped: 0, Time elapsed: 1.058 sec
Forking command line: /bin/sh -c cd <https://builds.apache.org/job/HBase-TRUNK/ws/trunk> && /home/jenkins/tools/java/jdk1.6.0_27-32/jre/bin/java -enableassertions -Xmx1900m -Djava.security.egd=file:/dev/./urandom -jar <https://builds.apache.org/job/HBase-TRUNK/ws/trunk/target/surefire/surefirebooter521995510205361266.jar> <https://builds.apache.org/job/HBase-TRUNK/ws/trunk/target/surefire/surefire6575344123623791647tmp> <https://builds.apache.org/job/HBase-TRUNK/ws/trunk/target/surefire/surefire_558499594736299743028tmp>
Running org.apache.hadoop.hbase.filter.TestColumnRangeFilter
Tests run: 1, Failures: 0, Errors: 0, Skipped: 0, Time elapsed: 17.93 sec
Forking command line: /bin/sh -c cd <https://builds.apache.org/job/HBase-TRUNK/ws/trunk> && /home/jenkins/tools/java/jdk1.6.0_27-32/jre/bin/java -enableassertions -Xmx1900m -Djava.security.egd=file:/dev/./urandom -jar <https://builds.apache.org/job/HBase-TRUNK/ws/trunk/target/surefire/surefirebooter667811963052924803.jar> <https://builds.apache.org/job/HBase-TRUNK/ws/trunk/target/surefire/surefire1174486999859150839tmp> <https://builds.apache.org/job/HBase-TRUNK/ws/trunk/target/surefire/surefire_568387689630806972368tmp>
Running org.apache.hadoop.hbase.coprocessor.TestClassLoading
Tests run: 6, Failures: 0, Errors: 0, Skipped: 0, Time elapsed: 29.856 sec
Forking command line: /bin/sh -c cd <https://builds.apache.org/job/HBase-TRUNK/ws/trunk> && /home/jenkins/tools/java/jdk1.6.0_27-32/jre/bin/java -enableassertions -Xmx1900m -Djava.security.egd=file:/dev/./urandom -jar <https://builds.apache.org/job/HBase-TRUNK/ws/trunk/target/surefire/surefirebooter5901698959293231294.jar> <https://builds.apache.org/job/HBase-TRUNK/ws/trunk/target/surefire/surefire340138404333548764tmp> <https://builds.apache.org/job/HBase-TRUNK/ws/trunk/target/surefire/surefire_571654175401433429385tmp>
Running org.apache.hadoop.hbase.coprocessor.TestAggregateProtocol
Tests run: 45, Failures: 0, Errors: 0, Skipped: 0, Time elapsed: 16.662 sec
Forking command line: /bin/sh -c cd <https://builds.apache.org/job/HBase-TRUNK/ws/trunk> && /home/jenkins/tools/java/jdk1.6.0_27-32/jre/bin/java -enableassertions -Xmx1900m -Djava.security.egd=file:/dev/./urandom -jar <https://builds.apache.org/job/HBase-TRUNK/ws/trunk/target/surefire/surefirebooter4992725540440705603.jar> <https://builds.apache.org/job/HBase-TRUNK/ws/trunk/target/surefire/surefire564305489497599156tmp> <https://builds.apache.org/job/HBase-TRUNK/ws/trunk/target/surefire/surefire_5833619004468703052tmp>
Forking command line: /bin/sh -c cd <https://builds.apache.org/job/HBase-TRUNK/ws/trunk> && /home/jenkins/tools/java/jdk1.6.0_27-32/jre/bin/java -enableassertions -Xmx1900m -Djava.security.egd=file:/dev/./urandom -jar <https://builds.apache.org/job/HBase-TRUNK/ws/trunk/target/surefire/surefirebooter6345864018442220015.jar> <https://builds.apache.org/job/HBase-TRUNK/ws/trunk/target/surefire/surefire7943085786136462025tmp> <https://builds.apache.org/job/HBase-TRUNK/ws/trunk/target/surefire/surefire_595523645965290598438tmp>
Running org.apache.hadoop.hbase.coprocessor.TestRegionServerCoprocessorExceptionWithRemove
Tests run: 1, Failures: 0, Errors: 0, Skipped: 0, Time elapsed: 19.867 sec
Forking command line: /bin/sh -c cd <https://builds.apache.org/job/HBase-TRUNK/ws/trunk> && /home/jenkins/tools/java/jdk1.6.0_27-32/jre/bin/java -enableassertions -Xmx1900m -Djava.security.egd=file:/dev/./urandom -jar <https://builds.apache.org/job/HBase-TRUNK/ws/trunk/target/surefire/surefirebooter1346911913967033511.jar> <https://builds.apache.org/job/HBase-TRUNK/ws/trunk/target/surefire/surefire3601163127105407837tmp> <https://builds.apache.org/job/HBase-TRUNK/ws/trunk/target/surefire/surefire_607906858319339606425tmp>
Running org.apache.hadoop.hbase.coprocessor.TestMasterObserver
Tests run: 3, Failures: 0, Errors: 0, Skipped: 0, Time elapsed: 28.761 sec
Forking command line: /bin/sh -c cd <https://builds.apache.org/job/HBase-TRUNK/ws/trunk> && /home/jenkins/tools/java/jdk1.6.0_27-32/jre/bin/java -enableassertions -Xmx1900m -Djava.security.egd=file:/dev/./urandom -jar <https://builds.apache.org/job/HBase-TRUNK/ws/trunk/target/surefire/surefirebooter1854807060120581216.jar> <https://builds.apache.org/job/HBase-TRUNK/ws/trunk/target/surefire/surefire6939623569433925406tmp> <https://builds.apache.org/job/HBase-TRUNK/ws/trunk/target/surefire/surefire_613096703544658129242tmp>
Running org.apache.hadoop.hbase.coprocessor.TestRegionServerCoprocessorExceptionWithAbort
Tests run: 1, Failures: 0, Errors: 0, Skipped: 0, Time elapsed: 76.295 sec
Forking command line: /bin/sh -c cd <https://builds.apache.org/job/HBase-TRUNK/ws/trunk> && /home/jenkins/tools/java/jdk1.6.0_27-32/jre/bin/java -enableassertions -Xmx1900m -Djava.security.egd=file:/dev/./urandom -jar <https://builds.apache.org/job/HBase-TRUNK/ws/trunk/target/surefire/surefirebooter7058373672375423935.jar> <https://builds.apache.org/job/HBase-TRUNK/ws/trunk/target/surefire/surefire1295927227303535430tmp> <https://builds.apache.org/job/HBase-TRUNK/ws/trunk/target/surefire/surefire_624921260648861038948tmp>
Running org.apache.hadoop.hbase.coprocessor.TestCoprocessorEndpoint
Tests run: 3, Failures: 0, Errors: 0, Skipped: 1, Time elapsed: 30.482 sec
Forking command line: /bin/sh -c cd <https://builds.apache.org/job/HBase-TRUNK/ws/trunk> && /home/jenkins/tools/java/jdk1.6.0_27-32/jre/bin/java -enableassertions -Xmx1900m -Djava.security.egd=file:/dev/./urandom -jar <https://builds.apache.org/job/HBase-TRUNK/ws/trunk/target/surefire/surefirebooter3096095099954742066.jar> <https://builds.apache.org/job/HBase-TRUNK/ws/trunk/target/surefire/surefire5138049365746882278tmp> <https://builds.apache.org/job/HBase-TRUNK/ws/trunk/target/surefire/surefire_638085666450185991023tmp>
Running org.apache.hadoop.hbase.coprocessor.TestWALObserver
Tests run: 3, Failures: 0, Errors: 0, Skipped: 0, Time elapsed: 16.537 sec
Running org.apache.hadoop.hbase.coprocessor.TestMasterCoprocessorExceptionWithAbort
Tests run: 1, Failures: 0, Errors: 0, Skipped: 0, Time elapsed: 25.955 sec
Forking command line: /bin/sh -c cd <https://builds.apache.org/job/HBase-TRUNK/ws/trunk> && /home/jenkins/tools/java/jdk1.6.0_27-32/jre/bin/java -enableassertions -Xmx1900m -Djava.security.egd=file:/dev/./urandom -jar <https://builds.apache.org/job/HBase-TRUNK/ws/trunk/target/surefire/surefirebooter3266928098259516379.jar> <https://builds.apache.org/job/HBase-TRUNK/ws/trunk/target/surefire/surefire8592583448028522929tmp> <https://builds.apache.org/job/HBase-TRUNK/ws/trunk/target/surefire/surefire_644009981120579078108tmp>
Forking command line: /bin/sh -c cd <https://builds.apache.org/job/HBase-TRUNK/ws/trunk> && /home/jenkins/tools/java/jdk1.6.0_27-32/jre/bin/java -enableassertions -Xmx1900m -Djava.security.egd=file:/dev/./urandom -jar <https://builds.apache.org/job/HBase-TRUNK/ws/trunk/target/surefire/surefirebooter5620721156160825038.jar> <https://builds.apache.org/job/HBase-TRUNK/ws/trunk/target/surefire/surefire4342134152862436589tmp> <https://builds.apache.org/job/HBase-TRUNK/ws/trunk/target/surefire/surefire_658044820205668920713tmp>
Running org.apache.hadoop.hbase.coprocessor.TestMasterCoprocessorExceptionWithRemove
Tests run: 1, Failures: 0, Errors: 0, Skipped: 0, Time elapsed: 14.646 sec
Forking command line: /bin/sh -c cd <https://builds.apache.org/job/HBase-TRUNK/ws/trunk> && /home/jenkins/tools/java/jdk1.6.0_27-32/jre/bin/java -enableassertions -Xmx1900m -Djava.security.egd=file:/dev/./urandom -jar <https://builds.apache.org/job/HBase-TRUNK/ws/trunk/target/surefire/surefirebooter6991116775695745955.jar> <https://builds.apache.org/job/HBase-TRUNK/ws/trunk/target/surefire/surefire7913176038642726802tmp> <https://builds.apache.org/job/HBase-TRUNK/ws/trunk/target/surefire/surefire_666246113756524943543tmp>
Running org.apache.hadoop.hbase.coprocessor.TestRegionObserverInterface
Tests run: 6, Failures: 0, Errors: 0, Skipped: 0, Time elapsed: 32.971 sec
Forking command line: /bin/sh -c cd <https://builds.apache.org/job/HBase-TRUNK/ws/trunk> && /home/jenkins/tools/java/jdk1.6.0_27-32/jre/bin/java -enableassertions -Xmx1900m -Djava.security.egd=file:/dev/./urandom -jar <https://builds.apache.org/job/HBase-TRUNK/ws/trunk/target/surefire/surefirebooter8616323935056379992.jar> <https://builds.apache.org/job/HBase-TRUNK/ws/trunk/target/surefire/surefire3064639936024788805tmp> <https://builds.apache.org/job/HBase-TRUNK/ws/trunk/target/surefire/surefire_673744386921388189342tmp>
Running org.apache.hadoop.hbase.coprocessor.TestRegionObserverBypass
Tests run: 2, Failures: 0, Errors: 0, Skipped: 0, Time elapsed: 13.456 sec
Forking command line: /bin/sh -c cd <https://builds.apache.org/job/HBase-TRUNK/ws/trunk> && /home/jenkins/tools/java/jdk1.6.0_27-32/jre/bin/java -enableassertions -Xmx1900m -Djava.security.egd=file:/dev/./urandom -jar <https://builds.apache.org/job/HBase-TRUNK/ws/trunk/target/surefire/surefirebooter8578544783599337346.jar> <https://builds.apache.org/job/HBase-TRUNK/ws/trunk/target/surefire/surefire6313193993010149526tmp> <https://builds.apache.org/job/HBase-TRUNK/ws/trunk/target/surefire/surefire_688666143131674076547tmp>
Running org.apache.hadoop.hbase.mapreduce.TestHLogRecordReader
Tests run: 2, Failures: 0, Errors: 0, Skipped: 0, Time elapsed: 4.982 sec
Forking command line: /bin/sh -c cd <https://builds.apache.org/job/HBase-TRUNK/ws/trunk> && /home/jenkins/tools/java/jdk1.6.0_27-32/jre/bin/java -enableassertions -Xmx1900m -Djava.security.egd=file:/dev/./urandom -jar <https://builds.apache.org/job/HBase-TRUNK/ws/trunk/target/surefire/surefirebooter4864409509645593357.jar> <https://builds.apache.org/job/HBase-TRUNK/ws/trunk/target/surefire/surefire2202600850137842677tmp> <https://builds.apache.org/job/HBase-TRUNK/ws/trunk/target/surefire/surefire_694971189497712980980tmp>
Running org.apache.hadoop.hbase.TestGlobalMemStoreSize
Tests run: 1, Failures: 0, Errors: 0, Skipped: 0, Time elapsed: 14.964 sec
Forking command line: /bin/sh -c cd <https://builds.apache.org/job/HBase-TRUNK/ws/trunk> && /home/jenkins/tools/java/jdk1.6.0_27-32/jre/bin/java -enableassertions -Xmx1900m -Djava.security.egd=file:/dev/./urandom -jar <https://builds.apache.org/job/HBase-TRUNK/ws/trunk/target/surefire/surefirebooter5332280740214099245.jar> <https://builds.apache.org/job/HBase-TRUNK/ws/trunk/target/surefire/surefire4812153799027015637tmp> <https://builds.apache.org/job/HBase-TRUNK/ws/trunk/target/surefire/surefire_706845096730156589809tmp>
Running org.apache.hadoop.hbase.mapreduce.TestImportExport
Tests run: 2, Failures: 0, Errors: 0, Skipped: 0, Time elapsed: 46.647 sec
Forking command line: /bin/sh -c cd <https://builds.apache.org/job/HBase-TRUNK/ws/trunk> && /home/jenkins/tools/java/jdk1.6.0_27-32/jre/bin/java -enableassertions -Xmx1900m -Djava.security.egd=file:/dev/./urandom -jar <https://builds.apache.org/job/HBase-TRUNK/ws/trunk/target/surefire/surefirebooter5531404003372181557.jar> <https://builds.apache.org/job/HBase-TRUNK/ws/trunk/target/surefire/surefire9177867258917740652tmp> <https://builds.apache.org/job/HBase-TRUNK/ws/trunk/target/surefire/surefire_717775699445780148156tmp>
Running org.apache.hadoop.hbase.mapreduce.TestImportTsv
Tests run: 8, Failures: 0, Errors: 0, Skipped: 0, Time elapsed: 84.4 sec
Forking command line: /bin/sh -c cd <https://builds.apache.org/job/HBase-TRUNK/ws/trunk> && /home/jenkins/tools/java/jdk1.6.0_27-32/jre/bin/java -enableassertions -Xmx1900m -Djava.security.egd=file:/dev/./urandom -jar <https://builds.apache.org/job/HBase-TRUNK/ws/trunk/target/surefire/surefirebooter8891773340145194357.jar> <https://builds.apache.org/job/HBase-TRUNK/ws/trunk/target/surefire/surefire523026861015819554tmp> <https://builds.apache.org/job/HBase-TRUNK/ws/trunk/target/surefire/surefire_726274157913110159574tmp>
Running org.apache.hadoop.hbase.thrift2.TestThriftHBaseServiceHandler
Tests run: 12, Failures: 0, Errors: 0, Skipped: 0, Time elapsed: 12.872 sec
Forking command line: /bin/sh -c cd <https://builds.apache.org/job/HBase-TRUNK/ws/trunk> && /home/jenkins/tools/java/jdk1.6.0_27-32/jre/bin/java -enableassertions -Xmx1900m -Djava.security.egd=file:/dev/./urandom -jar <https://builds.apache.org/job/HBase-TRUNK/ws/trunk/target/surefire/surefirebooter4719467317924801778.jar> <https://builds.apache.org/job/HBase-TRUNK/ws/trunk/target/surefire/surefire8970431170062640150tmp> <https://builds.apache.org/job/HBase-TRUNK/ws/trunk/target/surefire/surefire_735934258883543573682tmp>
Running org.apache.hadoop.hbase.catalog.TestMetaReaderEditorNoCluster
Tests run: 1, Failures: 0, Errors: 0, Skipped: 0, Time elapsed: 4.206 sec
Forking command line: /bin/sh -c cd <https://builds.apache.org/job/HBase-TRUNK/ws/trunk> && /home/jenkins/tools/java/jdk1.6.0_27-32/jre/bin/java -enableassertions -Xmx1900m -Djava.security.egd=file:/dev/./urandom -jar <https://builds.apache.org/job/HBase-TRUNK/ws/trunk/target/surefire/surefirebooter180143012346380329.jar> <https://builds.apache.org/job/HBase-TRUNK/ws/trunk/target/surefire/surefire5292399048542972457tmp> <https://builds.apache.org/job/HBase-TRUNK/ws/trunk/target/surefire/surefire_743141762021237930778tmp>
Running org.apache.hadoop.hbase.catalog.TestMetaReaderEditor
Tests run: 5, Failures: 0, Errors: 0, Skipped: 0, Time elapsed: 22.397 sec
Forking command line: /bin/sh -c cd <https://builds.apache.org/job/HBase-TRUNK/ws/trunk> && /home/jenkins/tools/java/jdk1.6.0_27-32/jre/bin/java -enableassertions -Xmx1900m -Djava.security.egd=file:/dev/./urandom -jar <https://builds.apache.org/job/HBase-TRUNK/ws/trunk/target/surefire/surefirebooter149939827874377569.jar> <https://builds.apache.org/job/HBase-TRUNK/ws/trunk/target/surefire/surefire4299984465172980029tmp> <https://builds.apache.org/job/HBase-TRUNK/ws/trunk/target/surefire/surefire_758470857564566214925tmp>
Running org.apache.hadoop.hbase.catalog.TestCatalogTracker
Tests run: 9, Failures: 0, Errors: 0, Skipped: 1, Time elapsed: 5.422 sec
Forking command line: /bin/sh -c cd <https://builds.apache.org/job/HBase-TRUNK/ws/trunk> && /home/jenkins/tools/java/jdk1.6.0_27-32/jre/bin/java -enableassertions -Xmx1900m -Djava.security.egd=file:/dev/./urandom -jar <https://builds.apache.org/job/HBase-TRUNK/ws/trunk/target/surefire/surefirebooter8456916071499337536.jar> <https://builds.apache.org/job/HBase-TRUNK/ws/trunk/target/surefire/surefire4945248426371414051tmp> <https://builds.apache.org/job/HBase-TRUNK/ws/trunk/target/surefire/surefire_763616841510236698139tmp>
Running org.apache.hadoop.hbase.TestAcidGuarantees
Tests run: 3, Failures: 0, Errors: 0, Skipped: 0, Time elapsed: 95.484 sec
Forking command line: /bin/sh -c cd <https://builds.apache.org/job/HBase-TRUNK/ws/trunk> && /home/jenkins/tools/java/jdk1.6.0_27-32/jre/bin/java -enableassertions -Xmx1900m -Djava.security.egd=file:/dev/./urandom -jar <https://builds.apache.org/job/HBase-TRUNK/ws/trunk/target/surefire/surefirebooter1895318914969211104.jar> <https://builds.apache.org/job/HBase-TRUNK/ws/trunk/target/surefire/surefire9051823012707985723tmp> <https://builds.apache.org/job/HBase-TRUNK/ws/trunk/target/surefire/surefire_774589457462067595636tmp>
Running org.apache.hadoop.hbase.client.TestTimestampsFilter
Tests run: 3, Failures: 0, Errors: 0, Skipped: 0, Time elapsed: 22.095 sec
Forking command line: /bin/sh -c cd <https://builds.apache.org/job/HBase-TRUNK/ws/trunk> && /home/jenkins/tools/java/jdk1.6.0_27-32/jre/bin/java -enableassertions -Xmx1900m -Djava.security.egd=file:/dev/./urandom -jar <https://builds.apache.org/job/HBase-TRUNK/ws/trunk/target/surefire/surefirebooter6376065807841193004.jar> <https://builds.apache.org/job/HBase-TRUNK/ws/trunk/target/surefire/surefire8900797327020442861tmp> <https://builds.apache.org/job/HBase-TRUNK/ws/trunk/target/surefire/surefire_781147400325770121418tmp>
Running org.apache.hadoop.hbase.client.TestMetaScanner
Tests run: 1, Failures: 0, Errors: 0, Skipped: 0, Time elapsed: 12.245 sec
Forking command line: /bin/sh -c cd <https://builds.apache.org/job/HBase-TRUNK/ws/trunk> && /home/jenkins/tools/java/jdk1.6.0_27-32/jre/bin/java -enableassertions -Xmx1900m -Djava.security.egd=file:/dev/./urandom -jar <https://builds.apache.org/job/HBase-TRUNK/ws/trunk/target/surefire/surefirebooter8562674558637119453.jar> <https://builds.apache.org/job/HBase-TRUNK/ws/trunk/target/surefire/surefire1723836958699765293tmp> <https://builds.apache.org/job/HBase-TRUNK/ws/trunk/target/surefire/surefire_791631018416643523372tmp>
Running org.apache.hadoop.hbase.client.TestHCM
Tests run: 7, Failures: 0, Errors: 0, Skipped: 0, Time elapsed: 17.804 sec
Forking command line: /bin/sh -c cd <https://builds.apache.org/job/HBase-TRUNK/ws/trunk> && /home/jenkins/tools/java/jdk1.6.0_27-32/jre/bin/java -enableassertions -Xmx1900m -Djava.security.egd=file:/dev/./urandom -jar <https://builds.apache.org/job/HBase-TRUNK/ws/trunk/target/surefire/surefirebooter755547412974309315.jar> <https://builds.apache.org/job/HBase-TRUNK/ws/trunk/target/surefire/surefire966933935359876059tmp> <https://builds.apache.org/job/HBase-TRUNK/ws/trunk/target/surefire/surefire_802849116890565523957tmp>
Running org.apache.hadoop.hbase.client.TestHTableUtil
Tests run: 2, Failures: 0, Errors: 0, Skipped: 0, Time elapsed: 15.788 sec
Forking command line: /bin/sh -c cd <https://builds.apache.org/job/HBase-TRUNK/ws/trunk> && /home/jenkins/tools/java/jdk1.6.0_27-32/jre/bin/java -enableassertions -Xmx1900m -Djava.security.egd=file:/dev/./urandom -jar <https://builds.apache.org/job/HBase-TRUNK/ws/trunk/target/surefire/surefirebooter5826799795296960504.jar> <https://builds.apache.org/job/HBase-TRUNK/ws/trunk/target/surefire/surefire1567056517278556677tmp> <https://builds.apache.org/job/HBase-TRUNK/ws/trunk/target/surefire/surefire_815736732457533919444tmp>
Running org.apache.hadoop.hbase.client.TestMetaMigrationRemovingHTD
Tests run: 3, Failures: 0, Errors: 0, Skipped: 0, Time elapsed: 24.531 sec
Forking command line: /bin/sh -c cd <https://builds.apache.org/job/HBase-TRUNK/ws/trunk> && /home/jenkins/tools/java/jdk1.6.0_27-32/jre/bin/java -enableassertions -Xmx1900m -Djava.security.egd=file:/dev/./urandom -jar <https://builds.apache.org/job/HBase-TRUNK/ws/trunk/target/surefire/surefirebooter5756193206091353763.jar> <https://builds.apache.org/job/HBase-TRUNK/ws/trunk/target/surefire/surefire6677464696925942780tmp> <https://builds.apache.org/job/HBase-TRUNK/ws/trunk/target/surefire/surefire_823397153088637215769tmp>
Running org.apache.hadoop.hbase.client.replication.TestReplicationAdmin
Tests run: 1, Failures: 0, Errors: 0, Skipped: 0, Time elapsed: 0.888 sec
Forking command line: /bin/sh -c cd <https://builds.apache.org/job/HBase-TRUNK/ws/trunk> && /home/jenkins/tools/java/jdk1.6.0_27-32/jre/bin/java -enableassertions -Xmx1900m -Djava.security.egd=file:/dev/./urandom -jar <https://builds.apache.org/job/HBase-TRUNK/ws/trunk/target/surefire/surefirebooter4425758696771196428.jar> <https://builds.apache.org/job/HBase-TRUNK/ws/trunk/target/surefire/surefire4294287412678758738tmp> <https://builds.apache.org/job/HBase-TRUNK/ws/trunk/target/surefire/surefire_83788031920534328422tmp>
Running org.apache.hadoop.hbase.client.TestHTablePool$TestHTableReusablePool
Tests run: 9, Failures: 0, Errors: 0, Skipped: 0, Time elapsed: 5.163 sec
Running org.apache.hadoop.hbase.client.TestHTablePool$TestHTableThreadLocalPool
Tests run: 9, Failures: 0, Errors: 0, Skipped: 0, Time elapsed: 24.92 sec
Forking command line: /bin/sh -c cd <https://builds.apache.org/job/HBase-TRUNK/ws/trunk> && /home/jenkins/tools/java/jdk1.6.0_27-32/jre/bin/java -enableassertions -Xmx1900m -Djava.security.egd=file:/dev/./urandom -jar <https://builds.apache.org/job/HBase-TRUNK/ws/trunk/target/surefire/surefirebooter7221597790610234302.jar> <https://builds.apache.org/job/HBase-TRUNK/ws/trunk/target/surefire/surefire998236511236952543tmp> <https://builds.apache.org/job/HBase-TRUNK/ws/trunk/target/surefire/surefire_841832151640725582194tmp>
Running org.apache.hadoop.hbase.metrics.TestMetricsMBeanBase
Tests run: 2, Failures: 0, Errors: 0, Skipped: 0, Time elapsed: 1.116 sec
Forking command line: /bin/sh -c cd <https://builds.apache.org/job/HBase-TRUNK/ws/trunk> && /home/jenkins/tools/java/jdk1.6.0_27-32/jre/bin/java -enableassertions -Xmx1900m -Djava.security.egd=file:/dev/./urandom -jar <https://builds.apache.org/job/HBase-TRUNK/ws/trunk/target/surefire/surefirebooter471516709332687340.jar> <https://builds.apache.org/job/HBase-TRUNK/ws/trunk/target/surefire/surefire5640239436975547600tmp> <https://builds.apache.org/job/HBase-TRUNK/ws/trunk/target/surefire/surefire_858087026097008175609tmp>
Running org.apache.hadoop.hbase.client.TestMultiParallel
Tests run: 11, Failures: 0, Errors: 0, Skipped: 0, Time elapsed: 31.55 sec
Forking command line: /bin/sh -c cd <https://builds.apache.org/job/HBase-TRUNK/ws/trunk> && /home/jenkins/tools/java/jdk1.6.0_27-32/jre/bin/java -enableassertions -Xmx1900m -Djava.security.egd=file:/dev/./urandom -jar <https://builds.apache.org/job/HBase-TRUNK/ws/trunk/target/surefire/surefirebooter1438874697857440416.jar> <https://builds.apache.org/job/HBase-TRUNK/ws/trunk/target/surefire/surefire2659608285436003008tmp> <https://builds.apache.org/job/HBase-TRUNK/ws/trunk/target/surefire/surefire_861410239049782209418tmp>
Running org.apache.hadoop.hbase.constraint.TestConstraint
Tests run: 5, Failures: 0, Errors: 0, Skipped: 0, Time elapsed: 26.276 sec
Forking command line: /bin/sh -c cd <https://builds.apache.org/job/HBase-TRUNK/ws/trunk> && /home/jenkins/tools/java/jdk1.6.0_27-32/jre/bin/java -enableassertions -Xmx1900m -Djava.security.egd=file:/dev/./urandom -jar <https://builds.apache.org/job/HBase-TRUNK/ws/trunk/target/surefire/surefirebooter3029454148745156560.jar> <https://builds.apache.org/job/HBase-TRUNK/ws/trunk/target/surefire/surefire8018020933228413172tmp> <https://builds.apache.org/job/HBase-TRUNK/ws/trunk/target/surefire/surefire_875041965834874171974tmp>
Running org.apache.hadoop.hbase.rest.TestGzipFilter
Tests run: 3, Failures: 0, Errors: 0, Skipped: 0, Time elapsed: 12.617 sec
Forking command line: /bin/sh -c cd <https://builds.apache.org/job/HBase-TRUNK/ws/trunk> && /home/jenkins/tools/java/jdk1.6.0_27-32/jre/bin/java -enableassertions -Xmx1900m -Djava.security.egd=file:/dev/./urandom -jar <https://builds.apache.org/job/HBase-TRUNK/ws/trunk/target/surefire/surefirebooter684336853413821120.jar> <https://builds.apache.org/job/HBase-TRUNK/ws/trunk/target/surefire/surefire8323255569975175443tmp> <https://builds.apache.org/job/HBase-TRUNK/ws/trunk/target/surefire/surefire_884215209664478315555tmp>
Running org.apache.hadoop.hbase.rest.TestMultiRowResource
Tests run: 3, Failures: 0, Errors: 0, Skipped: 0, Time elapsed: 14.206 sec
Forking command line: /bin/sh -c cd <https://builds.apache.org/job/HBase-TRUNK/ws/trunk> && /home/jenkins/tools/java/jdk1.6.0_27-32/jre/bin/java -enableassertions -Xmx1900m -Djava.security.egd=file:/dev/./urandom -jar <https://builds.apache.org/job/HBase-TRUNK/ws/trunk/target/surefire/surefirebooter1322370189981235436.jar> <https://builds.apache.org/job/HBase-TRUNK/ws/trunk/target/surefire/surefire8381391010499821278tmp> <https://builds.apache.org/job/HBase-TRUNK/ws/trunk/target/surefire/surefire_896903007535877894487tmp>
Running org.apache.hadoop.hbase.rest.TestScannersWithFilters
Tests run: 10, Failures: 0, Errors: 0, Skipped: 0, Time elapsed: 18.04 sec
Forking command line: /bin/sh -c cd <https://builds.apache.org/job/HBase-TRUNK/ws/trunk> && /home/jenkins/tools/java/jdk1.6.0_27-32/jre/bin/java -enableassertions -Xmx1900m -Djava.security.egd=file:/dev/./urandom -jar <https://builds.apache.org/job/HBase-TRUNK/ws/trunk/target/surefire/surefirebooter8309990607758562137.jar> <https://builds.apache.org/job/HBase-TRUNK/ws/trunk/target/surefire/surefire5964102262325785147tmp> <https://builds.apache.org/job/HBase-TRUNK/ws/trunk/target/surefire/surefire_906468002755918231211tmp>
Running org.apache.hadoop.hbase.rest.TestRowResource
Tests run: 11, Failures: 0, Errors: 0, Skipped: 0, Time elapsed: 15.356 sec
Forking command line: /bin/sh -c cd <https://builds.apache.org/job/HBase-TRUNK/ws/trunk> && /home/jenkins/tools/java/jdk1.6.0_27-32/jre/bin/java -enableassertions -Xmx1900m -Djava.security.egd=file:/dev/./urandom -jar <https://builds.apache.org/job/HBase-TRUNK/ws/trunk/target/surefire/surefirebooter6504791271119504347.jar> <https://builds.apache.org/job/HBase-TRUNK/ws/trunk/target/surefire/surefire782899124024851754tmp> <https://builds.apache.org/job/HBase-TRUNK/ws/trunk/target/surefire/surefire_913638365906378934656tmp>
Running org.apache.hadoop.hbase.rest.client.TestRemoteAdmin
Tests run: 1, Failures: 0, Errors: 0, Skipped: 0, Time elapsed: 17.17 sec
Forking command line: /bin/sh -c cd <https://builds.apache.org/job/HBase-TRUNK/ws/trunk> && /home/jenkins/tools/java/jdk1.6.0_27-32/jre/bin/java -enableassertions -Xmx1900m -Djava.security.egd=file:/dev/./urandom -jar <https://builds.apache.org/job/HBase-TRUNK/ws/trunk/target/surefire/surefirebooter9001652901293725649.jar> <https://builds.apache.org/job/HBase-TRUNK/ws/trunk/target/surefire/surefire7767294073983620213tmp> <https://builds.apache.org/job/HBase-TRUNK/ws/trunk/target/surefire/surefire_928912630711575923793tmp>
Running org.apache.hadoop.hbase.rest.client.TestRemoteTable
Tests run: 3, Failures: 0, Errors: 0, Skipped: 0, Time elapsed: 13.172 sec
Forking command line: /bin/sh -c cd <https://builds.apache.org/job/HBase-TRUNK/ws/trunk> && /home/jenkins/tools/java/jdk1.6.0_27-32/jre/bin/java -enableassertions -Xmx1900m -Djava.security.egd=file:/dev/./urandom -jar <https://builds.apache.org/job/HBase-TRUNK/ws/trunk/target/surefire/surefirebooter4837038793646747557.jar> <https://builds.apache.org/job/HBase-TRUNK/ws/trunk/target/surefire/surefire5407146822419352818tmp> <https://builds.apache.org/job/HBase-TRUNK/ws/trunk/target/surefire/surefire_935423356431648113868tmp>
Running org.apache.hadoop.hbase.rest.TestVersionResource
Tests run: 7, Failures: 0, Errors: 0, Skipped: 0, Time elapsed: 11.565 sec
Forking command line: /bin/sh -c cd <https://builds.apache.org/job/HBase-TRUNK/ws/trunk> && /home/jenkins/tools/java/jdk1.6.0_27-32/jre/bin/java -enableassertions -Xmx1900m -Djava.security.egd=file:/dev/./urandom -jar <https://builds.apache.org/job/HBase-TRUNK/ws/trunk/target/surefire/surefirebooter1037161735342431351.jar> <https://builds.apache.org/job/HBase-TRUNK/ws/trunk/target/surefire/surefire7196257770400677368tmp> <https://builds.apache.org/job/HBase-TRUNK/ws/trunk/target/surefire/surefire_948361176853410834730tmp>
Running org.apache.hadoop.hbase.rest.TestTableResource
Tests run: 8, Failures: 0, Errors: 0, Skipped: 0, Time elapsed: 23.445 sec
Forking command line: /bin/sh -c cd <https://builds.apache.org/job/HBase-TRUNK/ws/trunk> && /home/jenkins/tools/java/jdk1.6.0_27-32/jre/bin/java -enableassertions -Xmx1900m -Djava.security.egd=file:/dev/./urandom -jar <https://builds.apache.org/job/HBase-TRUNK/ws/trunk/target/surefire/surefirebooter6447568879492492549.jar> <https://builds.apache.org/job/HBase-TRUNK/ws/trunk/target/surefire/surefire2826552933316143069tmp> <https://builds.apache.org/job/HBase-TRUNK/ws/trunk/target/surefire/surefire_954249627708375807633tmp>
Running org.apache.hadoop.hbase.rest.TestScannerResource
Tests run: 5, Failures: 0, Errors: 0, Skipped: 0, Time elapsed: 31.844 sec
Forking command line: /bin/sh -c cd <https://builds.apache.org/job/HBase-TRUNK/ws/trunk> && /home/jenkins/tools/java/jdk1.6.0_27-32/jre/bin/java -enableassertions -Xmx1900m -Djava.security.egd=file:/dev/./urandom -jar <https://builds.apache.org/job/HBase-TRUNK/ws/trunk/target/surefire/surefirebooter7533329403586447762.jar> <https://builds.apache.org/job/HBase-TRUNK/ws/trunk/target/surefire/surefire7019616530272507681tmp> <https://builds.apache.org/job/HBase-TRUNK/ws/trunk/target/surefire/surefire_961039653864533480614tmp>
Running org.apache.hadoop.hbase.rest.TestStatusResource
Tests run: 2, Failures: 0, Errors: 0, Skipped: 0, Time elapsed: 11.078 sec
Forking command line: /bin/sh -c cd <https://builds.apache.org/job/HBase-TRUNK/ws/trunk> && /home/jenkins/tools/java/jdk1.6.0_27-32/jre/bin/java -enableassertions -Xmx1900m -Djava.security.egd=file:/dev/./urandom -jar <https://builds.apache.org/job/HBase-TRUNK/ws/trunk/target/surefire/surefirebooter5223439883209589856.jar> <https://builds.apache.org/job/HBase-TRUNK/ws/trunk/target/surefire/surefire960559343876103200tmp> <https://builds.apache.org/job/HBase-TRUNK/ws/trunk/target/surefire/surefire_978444085108634155252tmp>
Running org.apache.hadoop.hbase.rest.TestSchemaResource
Tests run: 2, Failures: 0, Errors: 0, Skipped: 0, Time elapsed: 17.706 sec
Forking command line: /bin/sh -c cd <https://builds.apache.org/job/HBase-TRUNK/ws/trunk> && /home/jenkins/tools/java/jdk1.6.0_27-32/jre/bin/java -enableassertions -Xmx1900m -Djava.security.egd=file:/dev/./urandom -jar <https://builds.apache.org/job/HBase-TRUNK/ws/trunk/target/surefire/surefirebooter1049007131176111363.jar> <https://builds.apache.org/job/HBase-TRUNK/ws/trunk/target/surefire/surefire468439936905963123tmp> <https://builds.apache.org/job/HBase-TRUNK/ws/trunk/target/surefire/surefire_987076792097644950815tmp>
Running org.apache.hadoop.hbase.io.encoding.TestLoadAndSwitchEncodeOnDisk
Tests run: 1, Failures: 0, Errors: 0, Skipped: 0, Time elapsed: 26.309 sec
Forking command line: /bin/sh -c cd <https://builds.apache.org/job/HBase-TRUNK/ws/trunk> && /home/jenkins/tools/java/jdk1.6.0_27-32/jre/bin/java -enableassertions -Xmx1900m -Djava.security.egd=file:/dev/./urandom -jar <https://builds.apache.org/job/HBase-TRUNK/ws/trunk/target/surefire/surefirebooter29681805694882919.jar> <https://builds.apache.org/job/HBase-TRUNK/ws/trunk/target/surefire/surefire6810876011108656287tmp> <https://builds.apache.org/job/HBase-TRUNK/ws/trunk/target/surefire/surefire_994076435471195496292tmp>
Running org.apache.hadoop.hbase.io.hfile.TestHFileSeek
Tests run: 1, Failures: 0, Errors: 0, Skipped: 0, Time elapsed: 8.129 sec
Forking command line: /bin/sh -c cd <https://builds.apache.org/job/HBase-TRUNK/ws/trunk> && /home/jenkins/tools/java/jdk1.6.0_27-32/jre/bin/java -enableassertions -Xmx1900m -Djava.security.egd=file:/dev/./urandom -jar <https://builds.apache.org/job/HBase-TRUNK/ws/trunk/target/surefire/surefirebooter4357437740845755869.jar> <https://builds.apache.org/job/HBase-TRUNK/ws/trunk/target/surefire/surefire2955413146392291427tmp> <https://builds.apache.org/job/HBase-TRUNK/ws/trunk/target/surefire/surefire_1008620153044922400229tmp>
Running org.apache.hadoop.hbase.thrift.TestThriftServer
Tests run: 1, Failures: 0, Errors: 0, Skipped: 0, Time elapsed: 63.632 sec
Running org.apache.hadoop.hbase.io.hfile.slab.TestSlabCache
Tests run: 7, Failures: 0, Errors: 0, Skipped: 0, Time elapsed: 19.984 sec
Forking command line: /bin/sh -c cd <https://builds.apache.org/job/HBase-TRUNK/ws/trunk> && /home/jenkins/tools/java/jdk1.6.0_27-32/jre/bin/java -enableassertions -Xmx1900m -Djava.security.egd=file:/dev/./urandom -jar <https://builds.apache.org/job/HBase-TRUNK/ws/trunk/target/surefire/surefirebooter5345626656305842418.jar> <https://builds.apache.org/job/HBase-TRUNK/ws/trunk/target/surefire/surefire2981023359142289575tmp> <https://builds.apache.org/job/HBase-TRUNK/ws/trunk/target/surefire/surefire_1018689452173184601371tmp>
Forking command line: /bin/sh -c cd <https://builds.apache.org/job/HBase-TRUNK/ws/trunk> && /home/jenkins/tools/java/jdk1.6.0_27-32/jre/bin/java -enableassertions -Xmx1900m -Djava.security.egd=file:/dev/./urandom -jar <https://builds.apache.org/job/HBase-TRUNK/ws/trunk/target/surefire/surefirebooter5786322131341875986.jar> <https://builds.apache.org/job/HBase-TRUNK/ws/trunk/target/surefire/surefire9018815178215469253tmp> <https://builds.apache.org/job/HBase-TRUNK/ws/trunk/target/surefire/surefire_1027819563621474331015tmp>
Running org.apache.hadoop.hbase.io.hfile.TestChecksum
Tests run: 3, Failures: 0, Errors: 0, Skipped: 0, Time elapsed: 0.888 sec
Forking command line: /bin/sh -c cd <https://builds.apache.org/job/HBase-TRUNK/ws/trunk> && /home/jenkins/tools/java/jdk1.6.0_27-32/jre/bin/java -enableassertions -Xmx1900m -Djava.security.egd=file:/dev/./urandom -jar <https://builds.apache.org/job/HBase-TRUNK/ws/trunk/target/surefire/surefirebooter6216820786580159534.jar> <https://builds.apache.org/job/HBase-TRUNK/ws/trunk/target/surefire/surefire3241091005476340927tmp> <https://builds.apache.org/job/HBase-TRUNK/ws/trunk/target/surefire/surefire_1034128655975892514886tmp>
Running org.apache.hadoop.hbase.io.hfile.TestHFileBlockIndex
Tests run: 10, Failures: 0, Errors: 0, Skipped: 0, Time elapsed: 11.794 sec
Forking command line: /bin/sh -c cd <https://builds.apache.org/job/HBase-TRUNK/ws/trunk> && /home/jenkins/tools/java/jdk1.6.0_27-32/jre/bin/java -enableassertions -Xmx1900m -Djava.security.egd=file:/dev/./urandom -jar <https://builds.apache.org/job/HBase-TRUNK/ws/trunk/target/surefire/surefirebooter280811228148248281.jar> <https://builds.apache.org/job/HBase-TRUNK/ws/trunk/target/surefire/surefire9089740508539142883tmp> <https://builds.apache.org/job/HBase-TRUNK/ws/trunk/target/surefire/surefire_1048087877748094018656tmp>
Running org.apache.hadoop.hbase.io.hfile.TestLruBlockCache
Tests run: 16, Failures: 0, Errors: 0, Skipped: 0, Time elapsed: 0.762 sec
Forking command line: /bin/sh -c cd <https://builds.apache.org/job/HBase-TRUNK/ws/trunk> && /home/jenkins/tools/java/jdk1.6.0_27-32/jre/bin/java -enableassertions -Xmx1900m -Djava.security.egd=file:/dev/./urandom -jar <https://builds.apache.org/job/HBase-TRUNK/ws/trunk/target/surefire/surefirebooter2818726433806167572.jar> <https://builds.apache.org/job/HBase-TRUNK/ws/trunk/target/surefire/surefire1593454340312579146tmp> <https://builds.apache.org/job/HBase-TRUNK/ws/trunk/target/surefire/surefire_105370137222815504291tmp>
Running org.apache.hadoop.hbase.io.hfile.TestHFilePerformance
Tests run: 1, Failures: 0, Errors: 0, Skipped: 0, Time elapsed: 6.559 sec
Forking command line: /bin/sh -c cd <https://builds.apache.org/job/HBase-TRUNK/ws/trunk> && /home/jenkins/tools/java/jdk1.6.0_27-32/jre/bin/java -enableassertions -Xmx1900m -Djava.security.egd=file:/dev/./urandom -jar <https://builds.apache.org/job/HBase-TRUNK/ws/trunk/target/surefire/surefirebooter4398331035202537592.jar> <https://builds.apache.org/job/HBase-TRUNK/ws/trunk/target/surefire/surefire4296946099943394617tmp> <https://builds.apache.org/job/HBase-TRUNK/ws/trunk/target/surefire/surefire_1067082448499880232271tmp>
Running org.apache.hadoop.hbase.io.hfile.TestFixedFileTrailer
Tests run: 2, Failures: 0, Errors: 0, Skipped: 0, Time elapsed: 0.627 sec
Forking command line: /bin/sh -c cd <https://builds.apache.org/job/HBase-TRUNK/ws/trunk> && /home/jenkins/tools/java/jdk1.6.0_27-32/jre/bin/java -enableassertions -Xmx1900m -Djava.security.egd=file:/dev/./urandom -jar <https://builds.apache.org/job/HBase-TRUNK/ws/trunk/target/surefire/surefirebooter4249606617377752910.jar> <https://builds.apache.org/job/HBase-TRUNK/ws/trunk/target/surefire/surefire3843800601075482034tmp> <https://builds.apache.org/job/HBase-TRUNK/ws/trunk/target/surefire/surefire_107424362866499045772tmp>
Running org.apache.hadoop.hbase.io.hfile.TestHFileBlockCompatibility
Tests run: 10, Failures: 0, Errors: 0, Skipped: 0, Time elapsed: 1.158 sec
Forking command line: /bin/sh -c cd <https://builds.apache.org/job/HBase-TRUNK/ws/trunk> && /home/jenkins/tools/java/jdk1.6.0_27-32/jre/bin/java -enableassertions -Xmx1900m -Djava.security.egd=file:/dev/./urandom -jar <https://builds.apache.org/job/HBase-TRUNK/ws/trunk/target/surefire/surefirebooter4663929546327322026.jar> <https://builds.apache.org/job/HBase-TRUNK/ws/trunk/target/surefire/surefire5107247168580460259tmp> <https://builds.apache.org/job/HBase-TRUNK/ws/trunk/target/surefire/surefire_1089016434611136928134tmp>
Running org.apache.hadoop.hbase.io.hfile.slab.TestSingleSizeCache
Tests run: 5, Failures: 0, Errors: 0, Skipped: 0, Time elapsed: 25.108 sec
Forking command line: /bin/sh -c cd <https://builds.apache.org/job/HBase-TRUNK/ws/trunk> && /home/jenkins/tools/java/jdk1.6.0_27-32/jre/bin/java -enableassertions -Xmx1900m -Djava.security.egd=file:/dev/./urandom -jar <https://builds.apache.org/job/HBase-TRUNK/ws/trunk/target/surefire/surefirebooter4045649972607216692.jar> <https://builds.apache.org/job/HBase-TRUNK/ws/trunk/target/surefire/surefire8468597124871490688tmp> <https://builds.apache.org/job/HBase-TRUNK/ws/trunk/target/surefire/surefire_109429326163111915181tmp>
Running org.apache.hadoop.hbase.io.hfile.TestHFileBlock
Tests run: 16, Failures: 0, Errors: 0, Skipped: 0, Time elapsed: 48.872 sec
Forking command line: /bin/sh -c cd <https://builds.apache.org/job/HBase-TRUNK/ws/trunk> && /home/jenkins/tools/java/jdk1.6.0_27-32/jre/bin/java -enableassertions -Xmx1900m -Djava.security.egd=file:/dev/./urandom -jar <https://builds.apache.org/job/HBase-TRUNK/ws/trunk/target/surefire/surefirebooter2962509299667017037.jar> <https://builds.apache.org/job/HBase-TRUNK/ws/trunk/target/surefire/surefire3427192444532436140tmp> <https://builds.apache.org/job/HBase-TRUNK/ws/trunk/target/surefire/surefire_110346675728767285886tmp>
Running org.apache.hadoop.hbase.io.hfile.TestForceCacheImportantBlocks
Tests run: 4, Failures: 0, Errors: 0, Skipped: 0, Time elapsed: 64.47 sec
Forking command line: /bin/sh -c cd <https://builds.apache.org/job/HBase-TRUNK/ws/trunk> && /home/jenkins/tools/java/jdk1.6.0_27-32/jre/bin/java -enableassertions -Xmx1900m -Djava.security.egd=file:/dev/./urandom -jar <https://builds.apache.org/job/HBase-TRUNK/ws/trunk/target/surefire/surefirebooter1726936368610900492.jar> <https://builds.apache.org/job/HBase-TRUNK/ws/trunk/target/surefire/surefire3862822950005284087tmp> <https://builds.apache.org/job/HBase-TRUNK/ws/trunk/target/surefire/surefire_1112497689841500921017tmp>
Running org.apache.hadoop.hbase.io.hfile.TestCacheOnWrite
Tests run: 36, Failures: 0, Errors: 0, Skipped: 0, Time elapsed: 34.676 sec
Forking command line: /bin/sh -c cd <https://builds.apache.org/job/HBase-TRUNK/ws/trunk> && /home/jenkins/tools/java/jdk1.6.0_27-32/jre/bin/java -enableassertions -Xmx1900m -Djava.security.egd=file:/dev/./urandom -jar <https://builds.apache.org/job/HBase-TRUNK/ws/trunk/target/surefire/surefirebooter3004598801958072708.jar> <https://builds.apache.org/job/HBase-TRUNK/ws/trunk/target/surefire/surefire4239481030877485895tmp> <https://builds.apache.org/job/HBase-TRUNK/ws/trunk/target/surefire/surefire_112169540753153205184tmp>
Running org.apache.hadoop.hbase.replication.regionserver.TestReplicationSourceManager
Tests run: 1, Failures: 0, Errors: 0, Skipped: 0, Time elapsed: 1.2 sec
Forking command line: /bin/sh -c cd <https://builds.apache.org/job/HBase-TRUNK/ws/trunk> && /home/jenkins/tools/java/jdk1.6.0_27-32/jre/bin/java -enableassertions -Xmx1900m -Djava.security.egd=file:/dev/./urandom -jar <https://builds.apache.org/job/HBase-TRUNK/ws/trunk/target/surefire/surefirebooter3773891605810251343.jar> <https://builds.apache.org/job/HBase-TRUNK/ws/trunk/target/surefire/surefire7368010307105155836tmp> <https://builds.apache.org/job/HBase-TRUNK/ws/trunk/target/surefire/surefire_1134435859054146896643tmp>
Running org.apache.hadoop.hbase.avro.TestAvroServer
Tests run: 3, Failures: 0, Errors: 0, Skipped: 0, Time elapsed: 30.175 sec
Forking command line: /bin/sh -c cd <https://builds.apache.org/job/HBase-TRUNK/ws/trunk> && /home/jenkins/tools/java/jdk1.6.0_27-32/jre/bin/java -enableassertions -Xmx1900m -Djava.security.egd=file:/dev/./urandom -jar <https://builds.apache.org/job/HBase-TRUNK/ws/trunk/target/surefire/surefirebooter4733778834993927758.jar> <https://builds.apache.org/job/HBase-TRUNK/ws/trunk/target/surefire/surefire8536605223156194608tmp> <https://builds.apache.org/job/HBase-TRUNK/ws/trunk/target/surefire/surefire_1142677459560039125354tmp>
Running org.apache.hadoop.hbase.replication.TestReplicationSource
Tests run: 1, Failures: 0, Errors: 0, Skipped: 0, Time elapsed: 2.369 sec
Forking command line: /bin/sh -c cd <https://builds.apache.org/job/HBase-TRUNK/ws/trunk> && /home/jenkins/tools/java/jdk1.6.0_27-32/jre/bin/java -enableassertions -Xmx1900m -Djava.security.egd=file:/dev/./urandom -jar <https://builds.apache.org/job/HBase-TRUNK/ws/trunk/target/surefire/surefirebooter811069159510835974.jar> <https://builds.apache.org/job/HBase-TRUNK/ws/trunk/target/surefire/surefire8272150335241079945tmp> <https://builds.apache.org/job/HBase-TRUNK/ws/trunk/target/surefire/surefire_115805029349255969962tmp>
Running org.apache.hadoop.hbase.replication.TestReplicationPeer
Tests run: 1, Failures: 0, Errors: 0, Skipped: 0, Time elapsed: 1.781 sec
Forking command line: /bin/sh -c cd <https://builds.apache.org/job/HBase-TRUNK/ws/trunk> && /home/jenkins/tools/java/jdk1.6.0_27-32/jre/bin/java -enableassertions -Xmx1900m -Djava.security.egd=file:/dev/./urandom -jar <https://builds.apache.org/job/HBase-TRUNK/ws/trunk/target/surefire/surefirebooter5164121437124329182.jar> <https://builds.apache.org/job/HBase-TRUNK/ws/trunk/target/surefire/surefire5166985827458331715tmp> <https://builds.apache.org/job/HBase-TRUNK/ws/trunk/target/surefire/surefire_116755821058945868273tmp>
Running org.apache.hadoop.hbase.replication.TestReplicationZookeeper
Tests run: 1, Failures: 0, Errors: 0, Skipped: 0, Time elapsed: 0.689 sec
Forking command line: /bin/sh -c cd <https://builds.apache.org/job/HBase-TRUNK/ws/trunk> && /home/jenkins/tools/java/jdk1.6.0_27-32/jre/bin/java -enableassertions -Xmx1900m -Djava.security.egd=file:/dev/./urandom -jar <https://builds.apache.org/job/HBase-TRUNK/ws/trunk/target/surefire/surefirebooter4532017444718195801.jar> <https://builds.apache.org/job/HBase-TRUNK/ws/trunk/target/surefire/surefire2170423386156546880tmp> <https://builds.apache.org/job/HBase-TRUNK/ws/trunk/target/surefire/surefire_1171813045333633618572tmp>
Running org.apache.hadoop.hbase.ipc.TestDelayedRpc
Tests run: 4, Failures: 0, Errors: 0, Skipped: 0, Time elapsed: 2.638 sec
Running org.apache.hadoop.hbase.replication.regionserver.TestReplicationSink
Tests run: 5, Failures: 0, Errors: 0, Skipped: 0, Time elapsed: 31.688 sec
Results :
Tests run: 605, Failures: 0, Errors: 0, Skipped: 2
[INFO] ------------------------------------------------------------------------
[INFO] BUILD FAILURE
[INFO] ------------------------------------------------------------------------
[INFO] Total time: 34:51.949s
[INFO] Finished at: Sat Apr 14 04:54:25 UTC 2012
[INFO] Final Memory: 79M/765M
[INFO] ------------------------------------------------------------------------
[ERROR] Failed to execute goal org.apache.maven.plugins:maven-surefire-plugin:2.12-TRUNK-HBASE-2:test (secondPartTestsExecution) on project hbase: Failure or timeout -> [Help 1]
org.apache.maven.lifecycle.LifecycleExecutionException: Failed to execute goal org.apache.maven.plugins:maven-surefire-plugin:2.12-TRUNK-HBASE-2:test (secondPartTestsExecution) on project hbase: Failure or timeout
at org.apache.maven.lifecycle.internal.MojoExecutor.execute(MojoExecutor.java:217)
at org.apache.maven.lifecycle.internal.MojoExecutor.execute(MojoExecutor.java:153)
at org.apache.maven.lifecycle.internal.MojoExecutor.execute(MojoExecutor.java:145)
at org.apache.maven.lifecycle.internal.LifecycleModuleBuilder.buildProject(LifecycleModuleBuilder.java:84)
at org.apache.maven.lifecycle.internal.LifecycleModuleBuilder.buildProject(LifecycleModuleBuilder.java:59)
at org.apache.maven.lifecycle.internal.LifecycleStarter.singleThreadedBuild(LifecycleStarter.java:183)
at org.apache.maven.lifecycle.internal.LifecycleStarter.execute(LifecycleStarter.java:161)
at org.apache.maven.DefaultMaven.doExecute(DefaultMaven.java:319)
at org.apache.maven.DefaultMaven.execute(DefaultMaven.java:156)
at org.apache.maven.cli.MavenCli.execute(MavenCli.java:537)
at org.apache.maven.cli.MavenCli.doMain(MavenCli.java:196)
at org.apache.maven.cli.MavenCli.main(MavenCli.java:141)
at sun.reflect.NativeMethodAccessorImpl.invoke0(Native Method)
at sun.reflect.NativeMethodAccessorImpl.invoke(NativeMethodAccessorImpl.java:39)
at sun.reflect.DelegatingMethodAccessorImpl.invoke(DelegatingMethodAccessorImpl.java:25)
at java.lang.reflect.Method.invoke(Method.java:597)
at org.codehaus.plexus.classworlds.launcher.Launcher.launchEnhanced(Launcher.java:290)
at org.codehaus.plexus.classworlds.launcher.Launcher.launch(Launcher.java:230)
at org.codehaus.plexus.classworlds.launcher.Launcher.mainWithExitCode(Launcher.java:409)
at org.codehaus.plexus.classworlds.launcher.Launcher.main(Launcher.java:352)
Caused by: org.apache.maven.plugin.MojoExecutionException: Failure or timeout
at org.apache.maven.plugin.surefire.SurefirePlugin.assertNoFailureOrTimeout(SurefirePlugin.java:643)
at org.apache.maven.plugin.surefire.SurefirePlugin.handleSummary(SurefirePlugin.java:624)
at org.apache.maven.plugin.surefire.AbstractSurefireMojo.executeAfterPreconditionsChecked(AbstractSurefireMojo.java:137)
at org.apache.maven.plugin.surefire.AbstractSurefireMojo.execute(AbstractSurefireMojo.java:98)
at org.apache.maven.plugin.DefaultBuildPluginManager.executeMojo(DefaultBuildPluginManager.java:101)
at org.apache.maven.lifecycle.internal.MojoExecutor.execute(MojoExecutor.java:209)
... 19 more
[ERROR]
[ERROR]
[ERROR] For more information about the errors and possible solutions, please read the following articles:
[ERROR] [Help 1] http://cwiki.apache.org/confluence/display/MAVEN/MojoExecutionException
Build step 'Invoke top-level Maven targets' marked build as failure
Archiving artifacts
Recording test results
Build failed in Jenkins: HBase-TRUNK #2760
Posted by Apache Jenkins Server <je...@builds.apache.org>.
See <https://builds.apache.org/job/HBase-TRUNK/2760/>
------------------------------------------
[...truncated 17800 lines...]
Tests run: 1, Failures: 0, Errors: 0, Skipped: 0, Time elapsed: 2.64 sec
Forking command line: /bin/sh -c cd /x1/jenkins/jenkins-slave/workspace/HBase-TRUNK/trunk && /x1/jenkins/tools/java/jdk1.6.0_27-32/jre/bin/java -enableassertions -Xmx1900m -Djava.security.egd=file:/dev/./urandom -jar /x1/jenkins/jenkins-slave/workspace/HBase-TRUNK/trunk/target/surefire/surefirebooter3576998812760212068.jar /x1/jenkins/jenkins-slave/workspace/HBase-TRUNK/trunk/target/surefire/surefire3708663123610005582tmp /x1/jenkins/jenkins-slave/workspace/HBase-TRUNK/trunk/target/surefire/surefire_533773073124951128850tmp
Running org.apache.hadoop.hbase.mapreduce.TestImportTsv
Tests run: 8, Failures: 0, Errors: 0, Skipped: 0, Time elapsed: 79.059 sec
Forking command line: /bin/sh -c cd /x1/jenkins/jenkins-slave/workspace/HBase-TRUNK/trunk && /x1/jenkins/tools/java/jdk1.6.0_27-32/jre/bin/java -enableassertions -Xmx1900m -Djava.security.egd=file:/dev/./urandom -jar /x1/jenkins/jenkins-slave/workspace/HBase-TRUNK/trunk/target/surefire/surefirebooter704795911678458034.jar /x1/jenkins/jenkins-slave/workspace/HBase-TRUNK/trunk/target/surefire/surefire2032269265467676668tmp /x1/jenkins/jenkins-slave/workspace/HBase-TRUNK/trunk/target/surefire/surefire_542776587877317834402tmp
Running org.apache.hadoop.hbase.regionserver.wal.TestWALReplay
Tests run: 5, Failures: 0, Errors: 0, Skipped: 0, Time elapsed: 30.029 sec
Running org.apache.hadoop.hbase.regionserver.wal.TestWALReplayCompressed
Tests run: 5, Failures: 0, Errors: 0, Skipped: 0, Time elapsed: 32.035 sec
Forking command line: /bin/sh -c cd /x1/jenkins/jenkins-slave/workspace/HBase-TRUNK/trunk && /x1/jenkins/tools/java/jdk1.6.0_27-32/jre/bin/java -enableassertions -Xmx1900m -Djava.security.egd=file:/dev/./urandom -jar /x1/jenkins/jenkins-slave/workspace/HBase-TRUNK/trunk/target/surefire/surefirebooter1754641898355705582.jar /x1/jenkins/jenkins-slave/workspace/HBase-TRUNK/trunk/target/surefire/surefire5376545628001629589tmp /x1/jenkins/jenkins-slave/workspace/HBase-TRUNK/trunk/target/surefire/surefire_554626144491481712864tmp
Forking command line: /bin/sh -c cd /x1/jenkins/jenkins-slave/workspace/HBase-TRUNK/trunk && /x1/jenkins/tools/java/jdk1.6.0_27-32/jre/bin/java -enableassertions -Xmx1900m -Djava.security.egd=file:/dev/./urandom -jar /x1/jenkins/jenkins-slave/workspace/HBase-TRUNK/trunk/target/surefire/surefirebooter7867619218882463292.jar /x1/jenkins/jenkins-slave/workspace/HBase-TRUNK/trunk/target/surefire/surefire1576035120226470921tmp /x1/jenkins/jenkins-slave/workspace/HBase-TRUNK/trunk/target/surefire/surefire_568750466347840518079tmp
Running org.apache.hadoop.hbase.regionserver.TestAtomicOperation
Tests run: 5, Failures: 0, Errors: 0, Skipped: 0, Time elapsed: 18.705 sec
Forking command line: /bin/sh -c cd /x1/jenkins/jenkins-slave/workspace/HBase-TRUNK/trunk && /x1/jenkins/tools/java/jdk1.6.0_27-32/jre/bin/java -enableassertions -Xmx1900m -Djava.security.egd=file:/dev/./urandom -jar /x1/jenkins/jenkins-slave/workspace/HBase-TRUNK/trunk/target/surefire/surefirebooter5960421943847074690.jar /x1/jenkins/jenkins-slave/workspace/HBase-TRUNK/trunk/target/surefire/surefire5037902987437621772tmp /x1/jenkins/jenkins-slave/workspace/HBase-TRUNK/trunk/target/surefire/surefire_572730763657632089292tmp
Running org.apache.hadoop.hbase.regionserver.TestRegionServerMetrics
Tests run: 2, Failures: 0, Errors: 0, Skipped: 0, Time elapsed: 44.6 sec
Forking command line: /bin/sh -c cd /x1/jenkins/jenkins-slave/workspace/HBase-TRUNK/trunk && /x1/jenkins/tools/java/jdk1.6.0_27-32/jre/bin/java -enableassertions -Xmx1900m -Djava.security.egd=file:/dev/./urandom -jar /x1/jenkins/jenkins-slave/workspace/HBase-TRUNK/trunk/target/surefire/surefirebooter3401036050167356205.jar /x1/jenkins/jenkins-slave/workspace/HBase-TRUNK/trunk/target/surefire/surefire8183628476281996669tmp /x1/jenkins/jenkins-slave/workspace/HBase-TRUNK/trunk/target/surefire/surefire_58414774824186556820tmp
Running org.apache.hadoop.hbase.regionserver.TestServerCustomProtocol
Tests run: 7, Failures: 0, Errors: 0, Skipped: 0, Time elapsed: 14.395 sec
Forking command line: /bin/sh -c cd /x1/jenkins/jenkins-slave/workspace/HBase-TRUNK/trunk && /x1/jenkins/tools/java/jdk1.6.0_27-32/jre/bin/java -enableassertions -Xmx1900m -Djava.security.egd=file:/dev/./urandom -jar /x1/jenkins/jenkins-slave/workspace/HBase-TRUNK/trunk/target/surefire/surefirebooter3633962307222447890.jar /x1/jenkins/jenkins-slave/workspace/HBase-TRUNK/trunk/target/surefire/surefire892586162657875864tmp /x1/jenkins/jenkins-slave/workspace/HBase-TRUNK/trunk/target/surefire/surefire_592521579292057268601tmp
Running org.apache.hadoop.hbase.regionserver.TestParallelPut
Tests run: 2, Failures: 0, Errors: 0, Skipped: 0, Time elapsed: 3.362 sec
Forking command line: /bin/sh -c cd /x1/jenkins/jenkins-slave/workspace/HBase-TRUNK/trunk && /x1/jenkins/tools/java/jdk1.6.0_27-32/jre/bin/java -enableassertions -Xmx1900m -Djava.security.egd=file:/dev/./urandom -jar /x1/jenkins/jenkins-slave/workspace/HBase-TRUNK/trunk/target/surefire/surefirebooter2740890005549607909.jar /x1/jenkins/jenkins-slave/workspace/HBase-TRUNK/trunk/target/surefire/surefire3420253890851431647tmp /x1/jenkins/jenkins-slave/workspace/HBase-TRUNK/trunk/target/surefire/surefire_605929333100296581933tmp
Running org.apache.hadoop.hbase.regionserver.TestFSErrorsExposed
Tests run: 3, Failures: 0, Errors: 0, Skipped: 0, Time elapsed: 28.871 sec
Forking command line: /bin/sh -c cd /x1/jenkins/jenkins-slave/workspace/HBase-TRUNK/trunk && /x1/jenkins/tools/java/jdk1.6.0_27-32/jre/bin/java -enableassertions -Xmx1900m -Djava.security.egd=file:/dev/./urandom -jar /x1/jenkins/jenkins-slave/workspace/HBase-TRUNK/trunk/target/surefire/surefirebooter4714233239643619898.jar /x1/jenkins/jenkins-slave/workspace/HBase-TRUNK/trunk/target/surefire/surefire6804647099348797646tmp /x1/jenkins/jenkins-slave/workspace/HBase-TRUNK/trunk/target/surefire/surefire_614125113039051534459tmp
Running org.apache.hadoop.hbase.regionserver.TestRpcMetrics
Tests run: 1, Failures: 0, Errors: 0, Skipped: 0, Time elapsed: 2.084 sec
Forking command line: /bin/sh -c cd /x1/jenkins/jenkins-slave/workspace/HBase-TRUNK/trunk && /x1/jenkins/tools/java/jdk1.6.0_27-32/jre/bin/java -enableassertions -Xmx1900m -Djava.security.egd=file:/dev/./urandom -jar /x1/jenkins/jenkins-slave/workspace/HBase-TRUNK/trunk/target/surefire/surefirebooter2214550707187901085.jar /x1/jenkins/jenkins-slave/workspace/HBase-TRUNK/trunk/target/surefire/surefire8996048178251370052tmp /x1/jenkins/jenkins-slave/workspace/HBase-TRUNK/trunk/target/surefire/surefire_622698375243957461373tmp
Running org.apache.hadoop.hbase.regionserver.handler.TestCloseRegionHandler
Tests run: 3, Failures: 0, Errors: 0, Skipped: 0, Time elapsed: 1.075 sec
Forking command line: /bin/sh -c cd /x1/jenkins/jenkins-slave/workspace/HBase-TRUNK/trunk && /x1/jenkins/tools/java/jdk1.6.0_27-32/jre/bin/java -enableassertions -Xmx1900m -Djava.security.egd=file:/dev/./urandom -jar /x1/jenkins/jenkins-slave/workspace/HBase-TRUNK/trunk/target/surefire/surefirebooter2994458494987979068.jar /x1/jenkins/jenkins-slave/workspace/HBase-TRUNK/trunk/target/surefire/surefire4647292213162273005tmp /x1/jenkins/jenkins-slave/workspace/HBase-TRUNK/trunk/target/surefire/surefire_637666487853174179487tmp
Running org.apache.hadoop.hbase.regionserver.TestSeekOptimizations
Tests run: 6, Failures: 0, Errors: 0, Skipped: 0, Time elapsed: 2.589 sec
Forking command line: /bin/sh -c cd /x1/jenkins/jenkins-slave/workspace/HBase-TRUNK/trunk && /x1/jenkins/tools/java/jdk1.6.0_27-32/jre/bin/java -enableassertions -Xmx1900m -Djava.security.egd=file:/dev/./urandom -jar /x1/jenkins/jenkins-slave/workspace/HBase-TRUNK/trunk/target/surefire/surefirebooter3340223529573358479.jar /x1/jenkins/jenkins-slave/workspace/HBase-TRUNK/trunk/target/surefire/surefire3585331767953365312tmp /x1/jenkins/jenkins-slave/workspace/HBase-TRUNK/trunk/target/surefire/surefire_643148310922751128276tmp
Running org.apache.hadoop.hbase.regionserver.handler.TestOpenRegionHandler
Tests run: 3, Failures: 0, Errors: 0, Skipped: 0, Time elapsed: 0.856 sec
Forking command line: /bin/sh -c cd /x1/jenkins/jenkins-slave/workspace/HBase-TRUNK/trunk && /x1/jenkins/tools/java/jdk1.6.0_27-32/jre/bin/java -enableassertions -Xmx1900m -Djava.security.egd=file:/dev/./urandom -jar /x1/jenkins/jenkins-slave/workspace/HBase-TRUNK/trunk/target/surefire/surefirebooter4888115513676301459.jar /x1/jenkins/jenkins-slave/workspace/HBase-TRUNK/trunk/target/surefire/surefire3780646022016571742tmp /x1/jenkins/jenkins-slave/workspace/HBase-TRUNK/trunk/target/surefire/surefire_657184065213182975152tmp
Running org.apache.hadoop.hbase.regionserver.TestBlocksRead
Tests run: 4, Failures: 0, Errors: 0, Skipped: 0, Time elapsed: 0.915 sec
Forking command line: /bin/sh -c cd /x1/jenkins/jenkins-slave/workspace/HBase-TRUNK/trunk && /x1/jenkins/tools/java/jdk1.6.0_27-32/jre/bin/java -enableassertions -Xmx1900m -Djava.security.egd=file:/dev/./urandom -jar /x1/jenkins/jenkins-slave/workspace/HBase-TRUNK/trunk/target/surefire/surefirebooter6730371888670266238.jar /x1/jenkins/jenkins-slave/workspace/HBase-TRUNK/trunk/target/surefire/surefire6421880035304279132tmp /x1/jenkins/jenkins-slave/workspace/HBase-TRUNK/trunk/target/surefire/surefire_662120131367811465368tmp
Running org.apache.hadoop.hbase.regionserver.TestStoreScanner
Tests run: 16, Failures: 0, Errors: 0, Skipped: 0, Time elapsed: 0.038 sec
Forking command line: /bin/sh -c cd /x1/jenkins/jenkins-slave/workspace/HBase-TRUNK/trunk && /x1/jenkins/tools/java/jdk1.6.0_27-32/jre/bin/java -enableassertions -Xmx1900m -Djava.security.egd=file:/dev/./urandom -jar /x1/jenkins/jenkins-slave/workspace/HBase-TRUNK/trunk/target/surefire/surefirebooter7899648937580862621.jar /x1/jenkins/jenkins-slave/workspace/HBase-TRUNK/trunk/target/surefire/surefire2464431737675896697tmp /x1/jenkins/jenkins-slave/workspace/HBase-TRUNK/trunk/target/surefire/surefire_678821452234619193011tmp
Running org.apache.hadoop.hbase.regionserver.TestSplitLogWorker
Tests run: 5, Failures: 0, Errors: 0, Skipped: 0, Time elapsed: 2.19 sec
Forking command line: /bin/sh -c cd /x1/jenkins/jenkins-slave/workspace/HBase-TRUNK/trunk && /x1/jenkins/tools/java/jdk1.6.0_27-32/jre/bin/java -enableassertions -Xmx1900m -Djava.security.egd=file:/dev/./urandom -jar /x1/jenkins/jenkins-slave/workspace/HBase-TRUNK/trunk/target/surefire/surefirebooter1748943704287390913.jar /x1/jenkins/jenkins-slave/workspace/HBase-TRUNK/trunk/target/surefire/surefire1190395141617193644tmp /x1/jenkins/jenkins-slave/workspace/HBase-TRUNK/trunk/target/surefire/surefire_68471523212206758808tmp
Running org.apache.hadoop.hbase.regionserver.metrics.TestSchemaMetrics
Tests run: 6, Failures: 0, Errors: 0, Skipped: 0, Time elapsed: 10.853 sec
Forking command line: /bin/sh -c cd /x1/jenkins/jenkins-slave/workspace/HBase-TRUNK/trunk && /x1/jenkins/tools/java/jdk1.6.0_27-32/jre/bin/java -enableassertions -Xmx1900m -Djava.security.egd=file:/dev/./urandom -jar /x1/jenkins/jenkins-slave/workspace/HBase-TRUNK/trunk/target/surefire/surefirebooter8820455963218261025.jar /x1/jenkins/jenkins-slave/workspace/HBase-TRUNK/trunk/target/surefire/surefire2721006555664870691tmp /x1/jenkins/jenkins-slave/workspace/HBase-TRUNK/trunk/target/surefire/surefire_694355254444600786750tmp
Running org.apache.hadoop.hbase.regionserver.TestStoreFileBlockCacheSummary
Tests run: 1, Failures: 0, Errors: 0, Skipped: 0, Time elapsed: 14.99 sec
Forking command line: /bin/sh -c cd /x1/jenkins/jenkins-slave/workspace/HBase-TRUNK/trunk && /x1/jenkins/tools/java/jdk1.6.0_27-32/jre/bin/java -enableassertions -Xmx1900m -Djava.security.egd=file:/dev/./urandom -jar /x1/jenkins/jenkins-slave/workspace/HBase-TRUNK/trunk/target/surefire/surefirebooter5485280020954830328.jar /x1/jenkins/jenkins-slave/workspace/HBase-TRUNK/trunk/target/surefire/surefire161110798078509374tmp /x1/jenkins/jenkins-slave/workspace/HBase-TRUNK/trunk/target/surefire/surefire_705505695363252972269tmp
Running org.apache.hadoop.hbase.regionserver.TestMasterAddressManager
Tests run: 1, Failures: 0, Errors: 0, Skipped: 0, Time elapsed: 0.552 sec
Forking command line: /bin/sh -c cd /x1/jenkins/jenkins-slave/workspace/HBase-TRUNK/trunk && /x1/jenkins/tools/java/jdk1.6.0_27-32/jre/bin/java -enableassertions -Xmx1900m -Djava.security.egd=file:/dev/./urandom -jar /x1/jenkins/jenkins-slave/workspace/HBase-TRUNK/trunk/target/surefire/surefirebooter5117892602295116558.jar /x1/jenkins/jenkins-slave/workspace/HBase-TRUNK/trunk/target/surefire/surefire7522553291761746996tmp /x1/jenkins/jenkins-slave/workspace/HBase-TRUNK/trunk/target/surefire/surefire_713295029073966698534tmp
Running org.apache.hadoop.hbase.regionserver.TestMultiColumnScanner
Tests run: 12, Failures: 0, Errors: 0, Skipped: 0, Time elapsed: 27.954 sec
Forking command line: /bin/sh -c cd /x1/jenkins/jenkins-slave/workspace/HBase-TRUNK/trunk && /x1/jenkins/tools/java/jdk1.6.0_27-32/jre/bin/java -enableassertions -Xmx1900m -Djava.security.egd=file:/dev/./urandom -jar /x1/jenkins/jenkins-slave/workspace/HBase-TRUNK/trunk/target/surefire/surefirebooter6838117390542480938.jar /x1/jenkins/jenkins-slave/workspace/HBase-TRUNK/trunk/target/surefire/surefire7396739608922524386tmp /x1/jenkins/jenkins-slave/workspace/HBase-TRUNK/trunk/target/surefire/surefire_728593152834524201734tmp
Running org.apache.hadoop.hbase.ipc.TestDelayedRpc
Tests run: 4, Failures: 0, Errors: 0, Skipped: 0, Time elapsed: 2.376 sec
Forking command line: /bin/sh -c cd /x1/jenkins/jenkins-slave/workspace/HBase-TRUNK/trunk && /x1/jenkins/tools/java/jdk1.6.0_27-32/jre/bin/java -enableassertions -Xmx1900m -Djava.security.egd=file:/dev/./urandom -jar /x1/jenkins/jenkins-slave/workspace/HBase-TRUNK/trunk/target/surefire/surefirebooter1678545540605682921.jar /x1/jenkins/jenkins-slave/workspace/HBase-TRUNK/trunk/target/surefire/surefire7104884622035597107tmp /x1/jenkins/jenkins-slave/workspace/HBase-TRUNK/trunk/target/surefire/surefire_734053022184671761252tmp
Running org.apache.hadoop.hbase.TestGlobalMemStoreSize
Tests run: 1, Failures: 0, Errors: 0, Skipped: 0, Time elapsed: 14.521 sec
Forking command line: /bin/sh -c cd /x1/jenkins/jenkins-slave/workspace/HBase-TRUNK/trunk && /x1/jenkins/tools/java/jdk1.6.0_27-32/jre/bin/java -enableassertions -Xmx1900m -Djava.security.egd=file:/dev/./urandom -jar /x1/jenkins/jenkins-slave/workspace/HBase-TRUNK/trunk/target/surefire/surefirebooter2603781812632116719.jar /x1/jenkins/jenkins-slave/workspace/HBase-TRUNK/trunk/target/surefire/surefire1154380791004683532tmp /x1/jenkins/jenkins-slave/workspace/HBase-TRUNK/trunk/target/surefire/surefire_745859038943528898906tmp
Running org.apache.hadoop.hbase.regionserver.TestHRegion
Tests run: 62, Failures: 0, Errors: 0, Skipped: 0, Time elapsed: 47.735 sec
Forking command line: /bin/sh -c cd /x1/jenkins/jenkins-slave/workspace/HBase-TRUNK/trunk && /x1/jenkins/tools/java/jdk1.6.0_27-32/jre/bin/java -enableassertions -Xmx1900m -Djava.security.egd=file:/dev/./urandom -jar /x1/jenkins/jenkins-slave/workspace/HBase-TRUNK/trunk/target/surefire/surefirebooter8613163996258230929.jar /x1/jenkins/jenkins-slave/workspace/HBase-TRUNK/trunk/target/surefire/surefire1207113695449883830tmp /x1/jenkins/jenkins-slave/workspace/HBase-TRUNK/trunk/target/surefire/surefire_753992017672366807790tmp
Running org.apache.hadoop.hbase.constraint.TestConstraint
Tests run: 5, Failures: 0, Errors: 0, Skipped: 0, Time elapsed: 29.463 sec
Running org.apache.hadoop.hbase.rest.TestSchemaResource
Tests run: 2, Failures: 0, Errors: 0, Skipped: 0, Time elapsed: 20.628 sec
Forking command line: /bin/sh -c cd /x1/jenkins/jenkins-slave/workspace/HBase-TRUNK/trunk && /x1/jenkins/tools/java/jdk1.6.0_27-32/jre/bin/java -enableassertions -Xmx1900m -Djava.security.egd=file:/dev/./urandom -jar /x1/jenkins/jenkins-slave/workspace/HBase-TRUNK/trunk/target/surefire/surefirebooter4581990834189044256.jar /x1/jenkins/jenkins-slave/workspace/HBase-TRUNK/trunk/target/surefire/surefire632860464058187685tmp /x1/jenkins/jenkins-slave/workspace/HBase-TRUNK/trunk/target/surefire/surefire_768977236487489843289tmp
Forking command line: /bin/sh -c cd /x1/jenkins/jenkins-slave/workspace/HBase-TRUNK/trunk && /x1/jenkins/tools/java/jdk1.6.0_27-32/jre/bin/java -enableassertions -Xmx1900m -Djava.security.egd=file:/dev/./urandom -jar /x1/jenkins/jenkins-slave/workspace/HBase-TRUNK/trunk/target/surefire/surefirebooter5193847936065869210.jar /x1/jenkins/jenkins-slave/workspace/HBase-TRUNK/trunk/target/surefire/surefire8740493189000022452tmp /x1/jenkins/jenkins-slave/workspace/HBase-TRUNK/trunk/target/surefire/surefire_776743763270444070592tmp
Running org.apache.hadoop.hbase.rest.client.TestRemoteTable
Tests run: 3, Failures: 0, Errors: 0, Skipped: 0, Time elapsed: 14.662 sec
Running org.apache.hadoop.hbase.rest.client.TestRemoteAdmin
Tests run: 1, Failures: 0, Errors: 0, Skipped: 0, Time elapsed: 15.045 sec
Forking command line: /bin/sh -c cd /x1/jenkins/jenkins-slave/workspace/HBase-TRUNK/trunk && /x1/jenkins/tools/java/jdk1.6.0_27-32/jre/bin/java -enableassertions -Xmx1900m -Djava.security.egd=file:/dev/./urandom -jar /x1/jenkins/jenkins-slave/workspace/HBase-TRUNK/trunk/target/surefire/surefirebooter5588987531104763498.jar /x1/jenkins/jenkins-slave/workspace/HBase-TRUNK/trunk/target/surefire/surefire7736790193124748527tmp /x1/jenkins/jenkins-slave/workspace/HBase-TRUNK/trunk/target/surefire/surefire_782479125400398542410tmp
Forking command line: /bin/sh -c cd /x1/jenkins/jenkins-slave/workspace/HBase-TRUNK/trunk && /x1/jenkins/tools/java/jdk1.6.0_27-32/jre/bin/java -enableassertions -Xmx1900m -Djava.security.egd=file:/dev/./urandom -jar /x1/jenkins/jenkins-slave/workspace/HBase-TRUNK/trunk/target/surefire/surefirebooter5211211665459262338.jar /x1/jenkins/jenkins-slave/workspace/HBase-TRUNK/trunk/target/surefire/surefire2716800013519952338tmp /x1/jenkins/jenkins-slave/workspace/HBase-TRUNK/trunk/target/surefire/surefire_796432982485651429tmp
Running org.apache.hadoop.hbase.rest.TestMultiRowResource
Tests run: 3, Failures: 0, Errors: 0, Skipped: 0, Time elapsed: 13.881 sec
Forking command line: /bin/sh -c cd /x1/jenkins/jenkins-slave/workspace/HBase-TRUNK/trunk && /x1/jenkins/tools/java/jdk1.6.0_27-32/jre/bin/java -enableassertions -Xmx1900m -Djava.security.egd=file:/dev/./urandom -jar /x1/jenkins/jenkins-slave/workspace/HBase-TRUNK/trunk/target/surefire/surefirebooter4989091074494402974.jar /x1/jenkins/jenkins-slave/workspace/HBase-TRUNK/trunk/target/surefire/surefire5453267820740453376tmp /x1/jenkins/jenkins-slave/workspace/HBase-TRUNK/trunk/target/surefire/surefire_804997463309201067363tmp
Running org.apache.hadoop.hbase.rest.TestTableResource
Tests run: 8, Failures: 0, Errors: 0, Skipped: 0, Time elapsed: 20.903 sec
Forking command line: /bin/sh -c cd /x1/jenkins/jenkins-slave/workspace/HBase-TRUNK/trunk && /x1/jenkins/tools/java/jdk1.6.0_27-32/jre/bin/java -enableassertions -Xmx1900m -Djava.security.egd=file:/dev/./urandom -jar /x1/jenkins/jenkins-slave/workspace/HBase-TRUNK/trunk/target/surefire/surefirebooter5476001679901138077.jar /x1/jenkins/jenkins-slave/workspace/HBase-TRUNK/trunk/target/surefire/surefire7045930494389639393tmp /x1/jenkins/jenkins-slave/workspace/HBase-TRUNK/trunk/target/surefire/surefire_813582550549865323077tmp
Running org.apache.hadoop.hbase.rest.TestGzipFilter
Tests run: 3, Failures: 0, Errors: 0, Skipped: 0, Time elapsed: 14.167 sec
Forking command line: /bin/sh -c cd /x1/jenkins/jenkins-slave/workspace/HBase-TRUNK/trunk && /x1/jenkins/tools/java/jdk1.6.0_27-32/jre/bin/java -enableassertions -Xmx1900m -Djava.security.egd=file:/dev/./urandom -jar /x1/jenkins/jenkins-slave/workspace/HBase-TRUNK/trunk/target/surefire/surefirebooter1978288019206754479.jar /x1/jenkins/jenkins-slave/workspace/HBase-TRUNK/trunk/target/surefire/surefire8889326102667360135tmp /x1/jenkins/jenkins-slave/workspace/HBase-TRUNK/trunk/target/surefire/surefire_824024931782467993583tmp
Running org.apache.hadoop.hbase.rest.TestRowResource
Tests run: 11, Failures: 0, Errors: 0, Skipped: 0, Time elapsed: 15.105 sec
Forking command line: /bin/sh -c cd /x1/jenkins/jenkins-slave/workspace/HBase-TRUNK/trunk && /x1/jenkins/tools/java/jdk1.6.0_27-32/jre/bin/java -enableassertions -Xmx1900m -Djava.security.egd=file:/dev/./urandom -jar /x1/jenkins/jenkins-slave/workspace/HBase-TRUNK/trunk/target/surefire/surefirebooter8112003123437296013.jar /x1/jenkins/jenkins-slave/workspace/HBase-TRUNK/trunk/target/surefire/surefire1729676686515839432tmp /x1/jenkins/jenkins-slave/workspace/HBase-TRUNK/trunk/target/surefire/surefire_834413417978724653939tmp
Running org.apache.hadoop.hbase.rest.TestVersionResource
Tests run: 7, Failures: 0, Errors: 0, Skipped: 0, Time elapsed: 10.853 sec
Forking command line: /bin/sh -c cd /x1/jenkins/jenkins-slave/workspace/HBase-TRUNK/trunk && /x1/jenkins/tools/java/jdk1.6.0_27-32/jre/bin/java -enableassertions -Xmx1900m -Djava.security.egd=file:/dev/./urandom -jar /x1/jenkins/jenkins-slave/workspace/HBase-TRUNK/trunk/target/surefire/surefirebooter1050872663602068605.jar /x1/jenkins/jenkins-slave/workspace/HBase-TRUNK/trunk/target/surefire/surefire7973644661870618248tmp /x1/jenkins/jenkins-slave/workspace/HBase-TRUNK/trunk/target/surefire/surefire_844551883894220169895tmp
Running org.apache.hadoop.hbase.rest.TestScannerResource
Tests run: 5, Failures: 0, Errors: 0, Skipped: 0, Time elapsed: 30.476 sec
Running org.apache.hadoop.hbase.rest.TestStatusResource
Tests run: 2, Failures: 0, Errors: 0, Skipped: 0, Time elapsed: 10.998 sec
Forking command line: /bin/sh -c cd /x1/jenkins/jenkins-slave/workspace/HBase-TRUNK/trunk && /x1/jenkins/tools/java/jdk1.6.0_27-32/jre/bin/java -enableassertions -Xmx1900m -Djava.security.egd=file:/dev/./urandom -jar /x1/jenkins/jenkins-slave/workspace/HBase-TRUNK/trunk/target/surefire/surefirebooter3771675483987725454.jar /x1/jenkins/jenkins-slave/workspace/HBase-TRUNK/trunk/target/surefire/surefire7379129054601168981tmp /x1/jenkins/jenkins-slave/workspace/HBase-TRUNK/trunk/target/surefire/surefire_856118647581254539196tmp
Forking command line: /bin/sh -c cd /x1/jenkins/jenkins-slave/workspace/HBase-TRUNK/trunk && /x1/jenkins/tools/java/jdk1.6.0_27-32/jre/bin/java -enableassertions -Xmx1900m -Djava.security.egd=file:/dev/./urandom -jar /x1/jenkins/jenkins-slave/workspace/HBase-TRUNK/trunk/target/surefire/surefirebooter443082514664507470.jar /x1/jenkins/jenkins-slave/workspace/HBase-TRUNK/trunk/target/surefire/surefire8721201805899891452tmp /x1/jenkins/jenkins-slave/workspace/HBase-TRUNK/trunk/target/surefire/surefire_863624910305544531952tmp
Running org.apache.hadoop.hbase.metrics.TestMetricsMBeanBase
Tests run: 2, Failures: 0, Errors: 0, Skipped: 0, Time elapsed: 1.087 sec
Forking command line: /bin/sh -c cd /x1/jenkins/jenkins-slave/workspace/HBase-TRUNK/trunk && /x1/jenkins/tools/java/jdk1.6.0_27-32/jre/bin/java -enableassertions -Xmx1900m -Djava.security.egd=file:/dev/./urandom -jar /x1/jenkins/jenkins-slave/workspace/HBase-TRUNK/trunk/target/surefire/surefirebooter8989582848620823798.jar /x1/jenkins/jenkins-slave/workspace/HBase-TRUNK/trunk/target/surefire/surefire6267138853690701544tmp /x1/jenkins/jenkins-slave/workspace/HBase-TRUNK/trunk/target/surefire/surefire_873371130366638511222tmp
Running org.apache.hadoop.hbase.io.hfile.TestHFileBlockIndex
Tests run: 10, Failures: 0, Errors: 0, Skipped: 0, Time elapsed: 6.904 sec
Forking command line: /bin/sh -c cd /x1/jenkins/jenkins-slave/workspace/HBase-TRUNK/trunk && /x1/jenkins/tools/java/jdk1.6.0_27-32/jre/bin/java -enableassertions -Xmx1900m -Djava.security.egd=file:/dev/./urandom -jar /x1/jenkins/jenkins-slave/workspace/HBase-TRUNK/trunk/target/surefire/surefirebooter883479180138992723.jar /x1/jenkins/jenkins-slave/workspace/HBase-TRUNK/trunk/target/surefire/surefire1277726974801506422tmp /x1/jenkins/jenkins-slave/workspace/HBase-TRUNK/trunk/target/surefire/surefire_888581236100060640612tmp
Running org.apache.hadoop.hbase.io.hfile.TestHFileSeek
Tests run: 1, Failures: 0, Errors: 0, Skipped: 0, Time elapsed: 6.539 sec
Forking command line: /bin/sh -c cd /x1/jenkins/jenkins-slave/workspace/HBase-TRUNK/trunk && /x1/jenkins/tools/java/jdk1.6.0_27-32/jre/bin/java -enableassertions -Xmx1900m -Djava.security.egd=file:/dev/./urandom -jar /x1/jenkins/jenkins-slave/workspace/HBase-TRUNK/trunk/target/surefire/surefirebooter4695888924389200951.jar /x1/jenkins/jenkins-slave/workspace/HBase-TRUNK/trunk/target/surefire/surefire2451079553933379994tmp /x1/jenkins/jenkins-slave/workspace/HBase-TRUNK/trunk/target/surefire/surefire_899147908847135868369tmp
Running org.apache.hadoop.hbase.rest.TestScannersWithFilters
Tests run: 10, Failures: 0, Errors: 0, Skipped: 0, Time elapsed: 16.043 sec
Forking command line: /bin/sh -c cd /x1/jenkins/jenkins-slave/workspace/HBase-TRUNK/trunk && /x1/jenkins/tools/java/jdk1.6.0_27-32/jre/bin/java -enableassertions -Xmx1900m -Djava.security.egd=file:/dev/./urandom -jar /x1/jenkins/jenkins-slave/workspace/HBase-TRUNK/trunk/target/surefire/surefirebooter7461888912840851897.jar /x1/jenkins/jenkins-slave/workspace/HBase-TRUNK/trunk/target/surefire/surefire2150303343555088933tmp /x1/jenkins/jenkins-slave/workspace/HBase-TRUNK/trunk/target/surefire/surefire_906808261307035716949tmp
Running org.apache.hadoop.hbase.io.hfile.TestLruBlockCache
Tests run: 16, Failures: 0, Errors: 0, Skipped: 0, Time elapsed: 0.665 sec
Forking command line: /bin/sh -c cd /x1/jenkins/jenkins-slave/workspace/HBase-TRUNK/trunk && /x1/jenkins/tools/java/jdk1.6.0_27-32/jre/bin/java -enableassertions -Xmx1900m -Djava.security.egd=file:/dev/./urandom -jar /x1/jenkins/jenkins-slave/workspace/HBase-TRUNK/trunk/target/surefire/surefirebooter8937493985445566712.jar /x1/jenkins/jenkins-slave/workspace/HBase-TRUNK/trunk/target/surefire/surefire3330487602190184910tmp /x1/jenkins/jenkins-slave/workspace/HBase-TRUNK/trunk/target/surefire/surefire_917153628555609331960tmp
Running org.apache.hadoop.hbase.io.hfile.TestFixedFileTrailer
Tests run: 2, Failures: 0, Errors: 0, Skipped: 0, Time elapsed: 0.492 sec
Forking command line: /bin/sh -c cd /x1/jenkins/jenkins-slave/workspace/HBase-TRUNK/trunk && /x1/jenkins/tools/java/jdk1.6.0_27-32/jre/bin/java -enableassertions -Xmx1900m -Djava.security.egd=file:/dev/./urandom -jar /x1/jenkins/jenkins-slave/workspace/HBase-TRUNK/trunk/target/surefire/surefirebooter6928614331734650710.jar /x1/jenkins/jenkins-slave/workspace/HBase-TRUNK/trunk/target/surefire/surefire6150616609278585520tmp /x1/jenkins/jenkins-slave/workspace/HBase-TRUNK/trunk/target/surefire/surefire_921373015761340118161tmp
Running org.apache.hadoop.hbase.io.hfile.TestHFilePerformance
Tests run: 1, Failures: 0, Errors: 0, Skipped: 0, Time elapsed: 4.784 sec
Forking command line: /bin/sh -c cd /x1/jenkins/jenkins-slave/workspace/HBase-TRUNK/trunk && /x1/jenkins/tools/java/jdk1.6.0_27-32/jre/bin/java -enableassertions -Xmx1900m -Djava.security.egd=file:/dev/./urandom -jar /x1/jenkins/jenkins-slave/workspace/HBase-TRUNK/trunk/target/surefire/surefirebooter1435757462485458365.jar /x1/jenkins/jenkins-slave/workspace/HBase-TRUNK/trunk/target/surefire/surefire3144722953024981381tmp /x1/jenkins/jenkins-slave/workspace/HBase-TRUNK/trunk/target/surefire/surefire_938484884290115424471tmp
Running org.apache.hadoop.hbase.io.hfile.TestHFileBlockCompatibility
Tests run: 10, Failures: 0, Errors: 0, Skipped: 0, Time elapsed: 0.899 sec
Forking command line: /bin/sh -c cd /x1/jenkins/jenkins-slave/workspace/HBase-TRUNK/trunk && /x1/jenkins/tools/java/jdk1.6.0_27-32/jre/bin/java -enableassertions -Xmx1900m -Djava.security.egd=file:/dev/./urandom -jar /x1/jenkins/jenkins-slave/workspace/HBase-TRUNK/trunk/target/surefire/surefirebooter7945538444897483320.jar /x1/jenkins/jenkins-slave/workspace/HBase-TRUNK/trunk/target/surefire/surefire3803875845325806620tmp /x1/jenkins/jenkins-slave/workspace/HBase-TRUNK/trunk/target/surefire/surefire_942324555797192435243tmp
Running org.apache.hadoop.hbase.io.hfile.TestCacheOnWrite
Tests run: 36, Failures: 0, Errors: 0, Skipped: 0, Time elapsed: 24.249 sec
Forking command line: /bin/sh -c cd /x1/jenkins/jenkins-slave/workspace/HBase-TRUNK/trunk && /x1/jenkins/tools/java/jdk1.6.0_27-32/jre/bin/java -enableassertions -Xmx1900m -Djava.security.egd=file:/dev/./urandom -jar /x1/jenkins/jenkins-slave/workspace/HBase-TRUNK/trunk/target/surefire/surefirebooter3829570269795756201.jar /x1/jenkins/jenkins-slave/workspace/HBase-TRUNK/trunk/target/surefire/surefire1480457547665427306tmp /x1/jenkins/jenkins-slave/workspace/HBase-TRUNK/trunk/target/surefire/surefire_957081556502604034323tmp
Running org.apache.hadoop.hbase.io.hfile.TestChecksum
Tests run: 3, Failures: 0, Errors: 0, Skipped: 0, Time elapsed: 0.792 sec
Forking command line: /bin/sh -c cd /x1/jenkins/jenkins-slave/workspace/HBase-TRUNK/trunk && /x1/jenkins/tools/java/jdk1.6.0_27-32/jre/bin/java -enableassertions -Xmx1900m -Djava.security.egd=file:/dev/./urandom -jar /x1/jenkins/jenkins-slave/workspace/HBase-TRUNK/trunk/target/surefire/surefirebooter2726715535095454857.jar /x1/jenkins/jenkins-slave/workspace/HBase-TRUNK/trunk/target/surefire/surefire886642487816761476tmp /x1/jenkins/jenkins-slave/workspace/HBase-TRUNK/trunk/target/surefire/surefire_9684787764480472221tmp
Running org.apache.hadoop.hbase.io.hfile.TestForceCacheImportantBlocks
Tests run: 4, Failures: 0, Errors: 0, Skipped: 0, Time elapsed: 35.38 sec
Forking command line: /bin/sh -c cd /x1/jenkins/jenkins-slave/workspace/HBase-TRUNK/trunk && /x1/jenkins/tools/java/jdk1.6.0_27-32/jre/bin/java -enableassertions -Xmx1900m -Djava.security.egd=file:/dev/./urandom -jar /x1/jenkins/jenkins-slave/workspace/HBase-TRUNK/trunk/target/surefire/surefirebooter9202367439691422588.jar /x1/jenkins/jenkins-slave/workspace/HBase-TRUNK/trunk/target/surefire/surefire1349623800074339966tmp /x1/jenkins/jenkins-slave/workspace/HBase-TRUNK/trunk/target/surefire/surefire_977538274940352341138tmp
Running org.apache.hadoop.hbase.io.hfile.slab.TestSlabCache
Tests run: 7, Failures: 0, Errors: 0, Skipped: 0, Time elapsed: 8.813 sec
Forking command line: /bin/sh -c cd /x1/jenkins/jenkins-slave/workspace/HBase-TRUNK/trunk && /x1/jenkins/tools/java/jdk1.6.0_27-32/jre/bin/java -enableassertions -Xmx1900m -Djava.security.egd=file:/dev/./urandom -jar /x1/jenkins/jenkins-slave/workspace/HBase-TRUNK/trunk/target/surefire/surefirebooter5931106919740324190.jar /x1/jenkins/jenkins-slave/workspace/HBase-TRUNK/trunk/target/surefire/surefire9030871246331141997tmp /x1/jenkins/jenkins-slave/workspace/HBase-TRUNK/trunk/target/surefire/surefire_984508409057397633232tmp
Running org.apache.hadoop.hbase.io.hfile.slab.TestSingleSizeCache
Tests run: 5, Failures: 0, Errors: 0, Skipped: 0, Time elapsed: 14.124 sec
Forking command line: /bin/sh -c cd /x1/jenkins/jenkins-slave/workspace/HBase-TRUNK/trunk && /x1/jenkins/tools/java/jdk1.6.0_27-32/jre/bin/java -enableassertions -Xmx1900m -Djava.security.egd=file:/dev/./urandom -jar /x1/jenkins/jenkins-slave/workspace/HBase-TRUNK/trunk/target/surefire/surefirebooter1043562935111485812.jar /x1/jenkins/jenkins-slave/workspace/HBase-TRUNK/trunk/target/surefire/surefire3737303836427013783tmp /x1/jenkins/jenkins-slave/workspace/HBase-TRUNK/trunk/target/surefire/surefire_997131641847164363503tmp
Running org.apache.hadoop.hbase.io.hfile.TestHFileBlock
Tests run: 16, Failures: 0, Errors: 0, Skipped: 0, Time elapsed: 45.813 sec
Forking command line: /bin/sh -c cd /x1/jenkins/jenkins-slave/workspace/HBase-TRUNK/trunk && /x1/jenkins/tools/java/jdk1.6.0_27-32/jre/bin/java -enableassertions -Xmx1900m -Djava.security.egd=file:/dev/./urandom -jar /x1/jenkins/jenkins-slave/workspace/HBase-TRUNK/trunk/target/surefire/surefirebooter6341974359021239878.jar /x1/jenkins/jenkins-slave/workspace/HBase-TRUNK/trunk/target/surefire/surefire7303559182144698819tmp /x1/jenkins/jenkins-slave/workspace/HBase-TRUNK/trunk/target/surefire/surefire_1008348690285847253874tmp
Running org.apache.hadoop.hbase.replication.TestReplicationZookeeper
Tests run: 1, Failures: 0, Errors: 0, Skipped: 0, Time elapsed: 0.539 sec
Forking command line: /bin/sh -c cd /x1/jenkins/jenkins-slave/workspace/HBase-TRUNK/trunk && /x1/jenkins/tools/java/jdk1.6.0_27-32/jre/bin/java -enableassertions -Xmx1900m -Djava.security.egd=file:/dev/./urandom -jar /x1/jenkins/jenkins-slave/workspace/HBase-TRUNK/trunk/target/surefire/surefirebooter2476128769456997153.jar /x1/jenkins/jenkins-slave/workspace/HBase-TRUNK/trunk/target/surefire/surefire8420818828421898976tmp /x1/jenkins/jenkins-slave/workspace/HBase-TRUNK/trunk/target/surefire/surefire_1018529789849322154630tmp
Running org.apache.hadoop.hbase.io.encoding.TestLoadAndSwitchEncodeOnDisk
Tests run: 1, Failures: 0, Errors: 0, Skipped: 0, Time elapsed: 23.712 sec
Forking command line: /bin/sh -c cd /x1/jenkins/jenkins-slave/workspace/HBase-TRUNK/trunk && /x1/jenkins/tools/java/jdk1.6.0_27-32/jre/bin/java -enableassertions -Xmx1900m -Djava.security.egd=file:/dev/./urandom -jar /x1/jenkins/jenkins-slave/workspace/HBase-TRUNK/trunk/target/surefire/surefirebooter4705893397566048898.jar /x1/jenkins/jenkins-slave/workspace/HBase-TRUNK/trunk/target/surefire/surefire1186061954230651944tmp /x1/jenkins/jenkins-slave/workspace/HBase-TRUNK/trunk/target/surefire/surefire_1028565847162998146919tmp
Running org.apache.hadoop.hbase.replication.regionserver.TestReplicationSourceManager
Tests run: 1, Failures: 0, Errors: 0, Skipped: 0, Time elapsed: 1.037 sec
Forking command line: /bin/sh -c cd /x1/jenkins/jenkins-slave/workspace/HBase-TRUNK/trunk && /x1/jenkins/tools/java/jdk1.6.0_27-32/jre/bin/java -enableassertions -Xmx1900m -Djava.security.egd=file:/dev/./urandom -jar /x1/jenkins/jenkins-slave/workspace/HBase-TRUNK/trunk/target/surefire/surefirebooter8034931425728357046.jar /x1/jenkins/jenkins-slave/workspace/HBase-TRUNK/trunk/target/surefire/surefire6733294518506328803tmp /x1/jenkins/jenkins-slave/workspace/HBase-TRUNK/trunk/target/surefire/surefire_103251153604378552625tmp
Running org.apache.hadoop.hbase.replication.TestReplicationSource
Tests run: 1, Failures: 0, Errors: 0, Skipped: 0, Time elapsed: 1.84 sec
Forking command line: /bin/sh -c cd /x1/jenkins/jenkins-slave/workspace/HBase-TRUNK/trunk && /x1/jenkins/tools/java/jdk1.6.0_27-32/jre/bin/java -enableassertions -Xmx1900m -Djava.security.egd=file:/dev/./urandom -jar /x1/jenkins/jenkins-slave/workspace/HBase-TRUNK/trunk/target/surefire/surefirebooter1125002058304203021.jar /x1/jenkins/jenkins-slave/workspace/HBase-TRUNK/trunk/target/surefire/surefire5229242372122824115tmp /x1/jenkins/jenkins-slave/workspace/HBase-TRUNK/trunk/target/surefire/surefire_1043949579555601091855tmp
Running org.apache.hadoop.hbase.replication.TestReplicationPeer
Tests run: 1, Failures: 0, Errors: 0, Skipped: 0, Time elapsed: 1.493 sec
Forking command line: /bin/sh -c cd /x1/jenkins/jenkins-slave/workspace/HBase-TRUNK/trunk && /x1/jenkins/tools/java/jdk1.6.0_27-32/jre/bin/java -enableassertions -Xmx1900m -Djava.security.egd=file:/dev/./urandom -jar /x1/jenkins/jenkins-slave/workspace/HBase-TRUNK/trunk/target/surefire/surefirebooter8515473654157304457.jar /x1/jenkins/jenkins-slave/workspace/HBase-TRUNK/trunk/target/surefire/surefire4344385847479128099tmp /x1/jenkins/jenkins-slave/workspace/HBase-TRUNK/trunk/target/surefire/surefire_1053846755554858402042tmp
Running org.apache.hadoop.hbase.util.TestFSTableDescriptors
Tests run: 10, Failures: 0, Errors: 0, Skipped: 0, Time elapsed: 0.871 sec
Forking command line: /bin/sh -c cd /x1/jenkins/jenkins-slave/workspace/HBase-TRUNK/trunk && /x1/jenkins/tools/java/jdk1.6.0_27-32/jre/bin/java -enableassertions -Xmx1900m -Djava.security.egd=file:/dev/./urandom -jar /x1/jenkins/jenkins-slave/workspace/HBase-TRUNK/trunk/target/surefire/surefirebooter7426475147179912120.jar /x1/jenkins/jenkins-slave/workspace/HBase-TRUNK/trunk/target/surefire/surefire188847798549200880tmp /x1/jenkins/jenkins-slave/workspace/HBase-TRUNK/trunk/target/surefire/surefire_1064147568573130523242tmp
Running org.apache.hadoop.hbase.util.TestIdLock
Tests run: 1, Failures: 0, Errors: 0, Skipped: 0, Time elapsed: 15.281 sec
Forking command line: /bin/sh -c cd /x1/jenkins/jenkins-slave/workspace/HBase-TRUNK/trunk && /x1/jenkins/tools/java/jdk1.6.0_27-32/jre/bin/java -enableassertions -Xmx1900m -Djava.security.egd=file:/dev/./urandom -jar /x1/jenkins/jenkins-slave/workspace/HBase-TRUNK/trunk/target/surefire/surefirebooter654684317668448549.jar /x1/jenkins/jenkins-slave/workspace/HBase-TRUNK/trunk/target/surefire/surefire2251542289532774814tmp /x1/jenkins/jenkins-slave/workspace/HBase-TRUNK/trunk/target/surefire/surefire_1078266943289116439305tmp
Running org.apache.hadoop.hbase.util.TestEnvironmentEdgeManager
Tests run: 2, Failures: 0, Errors: 0, Skipped: 0, Time elapsed: 0.312 sec
Forking command line: /bin/sh -c cd /x1/jenkins/jenkins-slave/workspace/HBase-TRUNK/trunk && /x1/jenkins/tools/java/jdk1.6.0_27-32/jre/bin/java -enableassertions -Xmx1900m -Djava.security.egd=file:/dev/./urandom -jar /x1/jenkins/jenkins-slave/workspace/HBase-TRUNK/trunk/target/surefire/surefirebooter2049530506083316098.jar /x1/jenkins/jenkins-slave/workspace/HBase-TRUNK/trunk/target/surefire/surefire8954237619887095559tmp /x1/jenkins/jenkins-slave/workspace/HBase-TRUNK/trunk/target/surefire/surefire_1084167623606713754583tmp
Running org.apache.hadoop.hbase.replication.regionserver.TestReplicationSink
Tests run: 5, Failures: 0, Errors: 0, Skipped: 0, Time elapsed: 28.533 sec
Forking command line: /bin/sh -c cd /x1/jenkins/jenkins-slave/workspace/HBase-TRUNK/trunk && /x1/jenkins/tools/java/jdk1.6.0_27-32/jre/bin/java -enableassertions -Xmx1900m -Djava.security.egd=file:/dev/./urandom -jar /x1/jenkins/jenkins-slave/workspace/HBase-TRUNK/trunk/target/surefire/surefirebooter8753790108917665900.jar /x1/jenkins/jenkins-slave/workspace/HBase-TRUNK/trunk/target/surefire/surefire2121265957286539503tmp /x1/jenkins/jenkins-slave/workspace/HBase-TRUNK/trunk/target/surefire/surefire_1092896034028647792909tmp
Running org.apache.hadoop.hbase.util.TestMergeTable
Tests run: 1, Failures: 0, Errors: 0, Skipped: 0, Time elapsed: 24.918 sec
Forking command line: /bin/sh -c cd /x1/jenkins/jenkins-slave/workspace/HBase-TRUNK/trunk && /x1/jenkins/tools/java/jdk1.6.0_27-32/jre/bin/java -enableassertions -Xmx1900m -Djava.security.egd=file:/dev/./urandom -jar /x1/jenkins/jenkins-slave/workspace/HBase-TRUNK/trunk/target/surefire/surefirebooter8103532351903144676.jar /x1/jenkins/jenkins-slave/workspace/HBase-TRUNK/trunk/target/surefire/surefire6630713349694282450tmp /x1/jenkins/jenkins-slave/workspace/HBase-TRUNK/trunk/target/surefire/surefire_1102168927430053845677tmp
Running org.apache.hadoop.hbase.util.TestFSUtils
Tests run: 3, Failures: 0, Errors: 0, Skipped: 0, Time elapsed: 20.299 sec
Forking command line: /bin/sh -c cd /x1/jenkins/jenkins-slave/workspace/HBase-TRUNK/trunk && /x1/jenkins/tools/java/jdk1.6.0_27-32/jre/bin/java -enableassertions -Xmx1900m -Djava.security.egd=file:/dev/./urandom -jar /x1/jenkins/jenkins-slave/workspace/HBase-TRUNK/trunk/target/surefire/surefirebooter7185971272215089578.jar /x1/jenkins/jenkins-slave/workspace/HBase-TRUNK/trunk/target/surefire/surefire3462881842572895751tmp /x1/jenkins/jenkins-slave/workspace/HBase-TRUNK/trunk/target/surefire/surefire_1112403303016190835635tmp
Running org.apache.hadoop.hbase.util.TestPoolMap$TestRoundRobinPoolType
Tests run: 3, Failures: 0, Errors: 0, Skipped: 0, Time elapsed: 0.007 sec
Running org.apache.hadoop.hbase.util.TestPoolMap$TestThreadLocalPoolType
Tests run: 3, Failures: 0, Errors: 0, Skipped: 0, Time elapsed: 0.003 sec
Running org.apache.hadoop.hbase.util.TestPoolMap$TestReusablePoolType
Tests run: 3, Failures: 0, Errors: 0, Skipped: 0, Time elapsed: 0.024 sec
Forking command line: /bin/sh -c cd /x1/jenkins/jenkins-slave/workspace/HBase-TRUNK/trunk && /x1/jenkins/tools/java/jdk1.6.0_27-32/jre/bin/java -enableassertions -Xmx1900m -Djava.security.egd=file:/dev/./urandom -jar /x1/jenkins/jenkins-slave/workspace/HBase-TRUNK/trunk/target/surefire/surefirebooter2372474352826596032.jar /x1/jenkins/jenkins-slave/workspace/HBase-TRUNK/trunk/target/surefire/surefire1554530914446147991tmp /x1/jenkins/jenkins-slave/workspace/HBase-TRUNK/trunk/target/surefire/surefire_1126773661036198439043tmp
Running org.apache.hadoop.hbase.util.TestRegionSplitter
Tests run: 5, Failures: 0, Errors: 0, Skipped: 0, Time elapsed: 18.994 sec
Forking command line: /bin/sh -c cd /x1/jenkins/jenkins-slave/workspace/HBase-TRUNK/trunk && /x1/jenkins/tools/java/jdk1.6.0_27-32/jre/bin/java -enableassertions -Xmx1900m -Djava.security.egd=file:/dev/./urandom -jar /x1/jenkins/jenkins-slave/workspace/HBase-TRUNK/trunk/target/surefire/surefirebooter5809796522336585888.jar /x1/jenkins/jenkins-slave/workspace/HBase-TRUNK/trunk/target/surefire/surefire7393405708163638082tmp /x1/jenkins/jenkins-slave/workspace/HBase-TRUNK/trunk/target/surefire/surefire_1132781161963455531224tmp
Running org.apache.hadoop.hbase.util.hbck.TestOfflineMetaRebuildBase
Tests run: 1, Failures: 0, Errors: 0, Skipped: 0, Time elapsed: 20.425 sec
Forking command line: /bin/sh -c cd /x1/jenkins/jenkins-slave/workspace/HBase-TRUNK/trunk && /x1/jenkins/tools/java/jdk1.6.0_27-32/jre/bin/java -enableassertions -Xmx1900m -Djava.security.egd=file:/dev/./urandom -jar /x1/jenkins/jenkins-slave/workspace/HBase-TRUNK/trunk/target/surefire/surefirebooter2450895106627037031.jar /x1/jenkins/jenkins-slave/workspace/HBase-TRUNK/trunk/target/surefire/surefire1664903076735484263tmp /x1/jenkins/jenkins-slave/workspace/HBase-TRUNK/trunk/target/surefire/surefire_114832134226443508183tmp
Running org.apache.hadoop.hbase.util.hbck.TestOfflineMetaRebuildOverlap
Tests run: 1, Failures: 0, Errors: 0, Skipped: 0, Time elapsed: 17.297 sec
Forking command line: /bin/sh -c cd /x1/jenkins/jenkins-slave/workspace/HBase-TRUNK/trunk && /x1/jenkins/tools/java/jdk1.6.0_27-32/jre/bin/java -enableassertions -Xmx1900m -Djava.security.egd=file:/dev/./urandom -jar /x1/jenkins/jenkins-slave/workspace/HBase-TRUNK/trunk/target/surefire/surefirebooter8413591778462289146.jar /x1/jenkins/jenkins-slave/workspace/HBase-TRUNK/trunk/target/surefire/surefire319504312553165951tmp /x1/jenkins/jenkins-slave/workspace/HBase-TRUNK/trunk/target/surefire/surefire_1153686905859499020322tmp
Running org.apache.hadoop.hbase.util.hbck.TestOfflineMetaRebuildHole
Tests run: 1, Failures: 0, Errors: 0, Skipped: 0, Time elapsed: 18.622 sec
Forking command line: /bin/sh -c cd /x1/jenkins/jenkins-slave/workspace/HBase-TRUNK/trunk && /x1/jenkins/tools/java/jdk1.6.0_27-32/jre/bin/java -enableassertions -Xmx1900m -Djava.security.egd=file:/dev/./urandom -jar /x1/jenkins/jenkins-slave/workspace/HBase-TRUNK/trunk/target/surefire/surefirebooter499515589595492348.jar /x1/jenkins/jenkins-slave/workspace/HBase-TRUNK/trunk/target/surefire/surefire5047219238904316330tmp /x1/jenkins/jenkins-slave/workspace/HBase-TRUNK/trunk/target/surefire/surefire_1165750753112543695175tmp
Running org.apache.hadoop.hbase.util.TestDefaultEnvironmentEdge
Tests run: 1, Failures: 0, Errors: 0, Skipped: 0, Time elapsed: 0.296 sec
Forking command line: /bin/sh -c cd /x1/jenkins/jenkins-slave/workspace/HBase-TRUNK/trunk && /x1/jenkins/tools/java/jdk1.6.0_27-32/jre/bin/java -enableassertions -Xmx1900m -Djava.security.egd=file:/dev/./urandom -jar /x1/jenkins/jenkins-slave/workspace/HBase-TRUNK/trunk/target/surefire/surefirebooter5315439168367899275.jar /x1/jenkins/jenkins-slave/workspace/HBase-TRUNK/trunk/target/surefire/surefire6485345203797930327tmp /x1/jenkins/jenkins-slave/workspace/HBase-TRUNK/trunk/target/surefire/surefire_1175720312789761660505tmp
Running org.apache.hadoop.hbase.TestInfoServers
Tests run: 2, Failures: 0, Errors: 0, Skipped: 0, Time elapsed: 10.234 sec
Results :
Tests run: 605, Failures: 0, Errors: 0, Skipped: 2
[INFO] ------------------------------------------------------------------------
[INFO] BUILD FAILURE
[INFO] ------------------------------------------------------------------------
[INFO] Total time: 38:23.757s
[INFO] Finished at: Sat Apr 14 03:29:12 UTC 2012
[INFO] Final Memory: 81M/992M
[INFO] ------------------------------------------------------------------------
[ERROR] Failed to execute goal org.apache.maven.plugins:maven-surefire-plugin:2.12-TRUNK-HBASE-2:test (secondPartTestsExecution) on project hbase: Failure or timeout -> [Help 1]
org.apache.maven.lifecycle.LifecycleExecutionException: Failed to execute goal org.apache.maven.plugins:maven-surefire-plugin:2.12-TRUNK-HBASE-2:test (secondPartTestsExecution) on project hbase: Failure or timeout
at org.apache.maven.lifecycle.internal.MojoExecutor.execute(MojoExecutor.java:217)
at org.apache.maven.lifecycle.internal.MojoExecutor.execute(MojoExecutor.java:153)
at org.apache.maven.lifecycle.internal.MojoExecutor.execute(MojoExecutor.java:145)
at org.apache.maven.lifecycle.internal.LifecycleModuleBuilder.buildProject(LifecycleModuleBuilder.java:84)
at org.apache.maven.lifecycle.internal.LifecycleModuleBuilder.buildProject(LifecycleModuleBuilder.java:59)
at org.apache.maven.lifecycle.internal.LifecycleStarter.singleThreadedBuild(LifecycleStarter.java:183)
at org.apache.maven.lifecycle.internal.LifecycleStarter.execute(LifecycleStarter.java:161)
at org.apache.maven.DefaultMaven.doExecute(DefaultMaven.java:319)
at org.apache.maven.DefaultMaven.execute(DefaultMaven.java:156)
at org.apache.maven.cli.MavenCli.execute(MavenCli.java:537)
at org.apache.maven.cli.MavenCli.doMain(MavenCli.java:196)
at org.apache.maven.cli.MavenCli.main(MavenCli.java:141)
at sun.reflect.NativeMethodAccessorImpl.invoke0(Native Method)
at sun.reflect.NativeMethodAccessorImpl.invoke(NativeMethodAccessorImpl.java:39)
at sun.reflect.DelegatingMethodAccessorImpl.invoke(DelegatingMethodAccessorImpl.java:25)
at java.lang.reflect.Method.invoke(Method.java:597)
at org.codehaus.plexus.classworlds.launcher.Launcher.launchEnhanced(Launcher.java:290)
at org.codehaus.plexus.classworlds.launcher.Launcher.launch(Launcher.java:230)
at org.codehaus.plexus.classworlds.launcher.Launcher.mainWithExitCode(Launcher.java:409)
at org.codehaus.plexus.classworlds.launcher.Launcher.main(Launcher.java:352)
Caused by: org.apache.maven.plugin.MojoExecutionException: Failure or timeout
at org.apache.maven.plugin.surefire.SurefirePlugin.assertNoFailureOrTimeout(SurefirePlugin.java:643)
at org.apache.maven.plugin.surefire.SurefirePlugin.handleSummary(SurefirePlugin.java:624)
at org.apache.maven.plugin.surefire.AbstractSurefireMojo.executeAfterPreconditionsChecked(AbstractSurefireMojo.java:137)
at org.apache.maven.plugin.surefire.AbstractSurefireMojo.execute(AbstractSurefireMojo.java:98)
at org.apache.maven.plugin.DefaultBuildPluginManager.executeMojo(DefaultBuildPluginManager.java:101)
at org.apache.maven.lifecycle.internal.MojoExecutor.execute(MojoExecutor.java:209)
... 19 more
[ERROR]
[ERROR]
[ERROR] For more information about the errors and possible solutions, please read the following articles:
[ERROR] [Help 1] http://cwiki.apache.org/confluence/display/MAVEN/MojoExecutionException
Build step 'Invoke top-level Maven targets' marked build as failure
Archiving artifacts
Recording test results
Build failed in Jenkins: HBase-TRUNK #2759
Posted by Apache Jenkins Server <je...@builds.apache.org>.
See <https://builds.apache.org/job/HBase-TRUNK/2759/changes>
Changes:
[mbautin] [jira] [HBASE-5684] Make ProcessBasedLocalHBaseCluster run HDFS and make it more
robust
Summary:
Currently ProcessBasedLocalHBaseCluster runs on top of raw local filesystem. We
need it to start a process-based HDFS cluster as well. We also need to make the
whole thing more stable so we can use it in unit tests.
Also all logs of local HBase cluster daemons are now tailed to the primary log
of the unit test with the appropriate prefixes to make debugging easier.
This is a trunk diff. The 89-fb version is D2709.
Test Plan:
Run the new unit test multiple times (10x or 50x).
Run all unit tests.
Reviewers: tedyu, stack, lhofhansl, nspiegelberg, amirshim, JIRA
Reviewed By: tedyu
Differential Revision: https://reviews.facebook.net/D2757
------------------------------------------
[...truncated 17802 lines...]
Forking command line: /bin/sh -c cd <https://builds.apache.org/job/HBase-TRUNK/ws/trunk> && /home/jenkins/tools/java/jdk1.6.0_27-32/jre/bin/java -enableassertions -Xmx1900m -Djava.security.egd=file:/dev/./urandom -jar <https://builds.apache.org/job/HBase-TRUNK/ws/trunk/target/surefire/surefirebooter8347721698930860840.jar> <https://builds.apache.org/job/HBase-TRUNK/ws/trunk/target/surefire/surefire378806157258461310tmp> <https://builds.apache.org/job/HBase-TRUNK/ws/trunk/target/surefire/surefire_535782869117048118970tmp>
Running org.apache.hadoop.hbase.client.TestHTablePool$TestHTableReusablePool
Tests run: 9, Failures: 0, Errors: 0, Skipped: 0, Time elapsed: 5.137 sec
Running org.apache.hadoop.hbase.client.TestHTablePool$TestHTableThreadLocalPool
Tests run: 9, Failures: 0, Errors: 0, Skipped: 0, Time elapsed: 21.673 sec
Forking command line: /bin/sh -c cd <https://builds.apache.org/job/HBase-TRUNK/ws/trunk> && /home/jenkins/tools/java/jdk1.6.0_27-32/jre/bin/java -enableassertions -Xmx1900m -Djava.security.egd=file:/dev/./urandom -jar <https://builds.apache.org/job/HBase-TRUNK/ws/trunk/target/surefire/surefirebooter1679681304240144565.jar> <https://builds.apache.org/job/HBase-TRUNK/ws/trunk/target/surefire/surefire5489047787528557472tmp> <https://builds.apache.org/job/HBase-TRUNK/ws/trunk/target/surefire/surefire_545534344571233246450tmp>
Running org.apache.hadoop.hbase.master.TestActiveMasterManager
Tests run: 2, Failures: 0, Errors: 0, Skipped: 0, Time elapsed: 0.931 sec
Forking command line: /bin/sh -c cd <https://builds.apache.org/job/HBase-TRUNK/ws/trunk> && /home/jenkins/tools/java/jdk1.6.0_27-32/jre/bin/java -enableassertions -Xmx1900m -Djava.security.egd=file:/dev/./urandom -jar <https://builds.apache.org/job/HBase-TRUNK/ws/trunk/target/surefire/surefirebooter6964985421194598220.jar> <https://builds.apache.org/job/HBase-TRUNK/ws/trunk/target/surefire/surefire7682300341201914313tmp> <https://builds.apache.org/job/HBase-TRUNK/ws/trunk/target/surefire/surefire_555939398118821654410tmp>
Running org.apache.hadoop.hbase.master.TestMasterStatusServlet
Tests run: 5, Failures: 0, Errors: 0, Skipped: 0, Time elapsed: 1.034 sec
Forking command line: /bin/sh -c cd <https://builds.apache.org/job/HBase-TRUNK/ws/trunk> && /home/jenkins/tools/java/jdk1.6.0_27-32/jre/bin/java -enableassertions -Xmx1900m -Djava.security.egd=file:/dev/./urandom -jar <https://builds.apache.org/job/HBase-TRUNK/ws/trunk/target/surefire/surefirebooter50450387846580805.jar> <https://builds.apache.org/job/HBase-TRUNK/ws/trunk/target/surefire/surefire7572447008382475467tmp> <https://builds.apache.org/job/HBase-TRUNK/ws/trunk/target/surefire/surefire_567291363890154007594tmp>
Running org.apache.hadoop.hbase.master.TestHMasterRPCException
Tests run: 1, Failures: 0, Errors: 0, Skipped: 0, Time elapsed: 1.35 sec
Forking command line: /bin/sh -c cd <https://builds.apache.org/job/HBase-TRUNK/ws/trunk> && /home/jenkins/tools/java/jdk1.6.0_27-32/jre/bin/java -enableassertions -Xmx1900m -Djava.security.egd=file:/dev/./urandom -jar <https://builds.apache.org/job/HBase-TRUNK/ws/trunk/target/surefire/surefirebooter4442343684902898038.jar> <https://builds.apache.org/job/HBase-TRUNK/ws/trunk/target/surefire/surefire4955777115035885302tmp> <https://builds.apache.org/job/HBase-TRUNK/ws/trunk/target/surefire/surefire_576914306255407523426tmp>
Running org.apache.hadoop.hbase.master.TestLogsCleaner
Tests run: 1, Failures: 0, Errors: 0, Skipped: 0, Time elapsed: 3.106 sec
Forking command line: /bin/sh -c cd <https://builds.apache.org/job/HBase-TRUNK/ws/trunk> && /home/jenkins/tools/java/jdk1.6.0_27-32/jre/bin/java -enableassertions -Xmx1900m -Djava.security.egd=file:/dev/./urandom -jar <https://builds.apache.org/job/HBase-TRUNK/ws/trunk/target/surefire/surefirebooter6513922922223123048.jar> <https://builds.apache.org/job/HBase-TRUNK/ws/trunk/target/surefire/surefire221497197745197952tmp> <https://builds.apache.org/job/HBase-TRUNK/ws/trunk/target/surefire/surefire_582811468547447645383tmp>
Running org.apache.hadoop.hbase.master.TestOpenedRegionHandler
Tests run: 2, Failures: 0, Errors: 0, Skipped: 0, Time elapsed: 14.509 sec
Forking command line: /bin/sh -c cd <https://builds.apache.org/job/HBase-TRUNK/ws/trunk> && /home/jenkins/tools/java/jdk1.6.0_27-32/jre/bin/java -enableassertions -Xmx1900m -Djava.security.egd=file:/dev/./urandom -jar <https://builds.apache.org/job/HBase-TRUNK/ws/trunk/target/surefire/surefirebooter3121332595848574439.jar> <https://builds.apache.org/job/HBase-TRUNK/ws/trunk/target/surefire/surefire6612525661822506430tmp> <https://builds.apache.org/job/HBase-TRUNK/ws/trunk/target/surefire/surefire_59394514745182524477tmp>
Running org.apache.hadoop.hbase.master.TestZKBasedOpenCloseRegion
Tests run: 3, Failures: 0, Errors: 0, Skipped: 0, Time elapsed: 20.649 sec
Forking command line: /bin/sh -c cd <https://builds.apache.org/job/HBase-TRUNK/ws/trunk> && /home/jenkins/tools/java/jdk1.6.0_27-32/jre/bin/java -enableassertions -Xmx1900m -Djava.security.egd=file:/dev/./urandom -jar <https://builds.apache.org/job/HBase-TRUNK/ws/trunk/target/surefire/surefirebooter1143647265056291468.jar> <https://builds.apache.org/job/HBase-TRUNK/ws/trunk/target/surefire/surefire7541320790886195679tmp> <https://builds.apache.org/job/HBase-TRUNK/ws/trunk/target/surefire/surefire_605764498198199274831tmp>
Running org.apache.hadoop.hbase.master.TestDefaultLoadBalancer
Tests run: 4, Failures: 0, Errors: 0, Skipped: 0, Time elapsed: 1.444 sec
Forking command line: /bin/sh -c cd <https://builds.apache.org/job/HBase-TRUNK/ws/trunk> && /home/jenkins/tools/java/jdk1.6.0_27-32/jre/bin/java -enableassertions -Xmx1900m -Djava.security.egd=file:/dev/./urandom -jar <https://builds.apache.org/job/HBase-TRUNK/ws/trunk/target/surefire/surefirebooter5330240033906193929.jar> <https://builds.apache.org/job/HBase-TRUNK/ws/trunk/target/surefire/surefire8623034738754949090tmp> <https://builds.apache.org/job/HBase-TRUNK/ws/trunk/target/surefire/surefire_614450727551580979007tmp>
Running org.apache.hadoop.hbase.master.TestClockSkewDetection
Tests run: 1, Failures: 0, Errors: 0, Skipped: 0, Time elapsed: 0.282 sec
Forking command line: /bin/sh -c cd <https://builds.apache.org/job/HBase-TRUNK/ws/trunk> && /home/jenkins/tools/java/jdk1.6.0_27-32/jre/bin/java -enableassertions -Xmx1900m -Djava.security.egd=file:/dev/./urandom -jar <https://builds.apache.org/job/HBase-TRUNK/ws/trunk/target/surefire/surefirebooter6581523944906333964.jar> <https://builds.apache.org/job/HBase-TRUNK/ws/trunk/target/surefire/surefire8200685233408930315tmp> <https://builds.apache.org/job/HBase-TRUNK/ws/trunk/target/surefire/surefire_62146914709940736767tmp>
Running org.apache.hadoop.hbase.master.TestMaster
Tests run: 1, Failures: 0, Errors: 0, Skipped: 0, Time elapsed: 17.401 sec
Forking command line: /bin/sh -c cd <https://builds.apache.org/job/HBase-TRUNK/ws/trunk> && /home/jenkins/tools/java/jdk1.6.0_27-32/jre/bin/java -enableassertions -Xmx1900m -Djava.security.egd=file:/dev/./urandom -jar <https://builds.apache.org/job/HBase-TRUNK/ws/trunk/target/surefire/surefirebooter2198809116458452671.jar> <https://builds.apache.org/job/HBase-TRUNK/ws/trunk/target/surefire/surefire5054001353486247494tmp> <https://builds.apache.org/job/HBase-TRUNK/ws/trunk/target/surefire/surefire_634315825977311044195tmp>
Running org.apache.hadoop.hbase.master.TestSplitLogManager
Tests run: 12, Failures: 0, Errors: 0, Skipped: 0, Time elapsed: 14.584 sec
Forking command line: /bin/sh -c cd <https://builds.apache.org/job/HBase-TRUNK/ws/trunk> && /home/jenkins/tools/java/jdk1.6.0_27-32/jre/bin/java -enableassertions -Xmx1900m -Djava.security.egd=file:/dev/./urandom -jar <https://builds.apache.org/job/HBase-TRUNK/ws/trunk/target/surefire/surefirebooter1115673094420218912.jar> <https://builds.apache.org/job/HBase-TRUNK/ws/trunk/target/surefire/surefire1180770984463047587tmp> <https://builds.apache.org/job/HBase-TRUNK/ws/trunk/target/surefire/surefire_648927944459413873598tmp>
Running org.apache.hadoop.hbase.metrics.TestMetricsMBeanBase
Tests run: 2, Failures: 0, Errors: 0, Skipped: 0, Time elapsed: 1.118 sec
Forking command line: /bin/sh -c cd <https://builds.apache.org/job/HBase-TRUNK/ws/trunk> && /home/jenkins/tools/java/jdk1.6.0_27-32/jre/bin/java -enableassertions -Xmx1900m -Djava.security.egd=file:/dev/./urandom -jar <https://builds.apache.org/job/HBase-TRUNK/ws/trunk/target/surefire/surefirebooter2269379140130235998.jar> <https://builds.apache.org/job/HBase-TRUNK/ws/trunk/target/surefire/surefire6683153397858998611tmp> <https://builds.apache.org/job/HBase-TRUNK/ws/trunk/target/surefire/surefire_653180728600510274282tmp>
Running org.apache.hadoop.hbase.TestGlobalMemStoreSize
Tests run: 1, Failures: 0, Errors: 0, Skipped: 0, Time elapsed: 15.525 sec
Forking command line: /bin/sh -c cd <https://builds.apache.org/job/HBase-TRUNK/ws/trunk> && /home/jenkins/tools/java/jdk1.6.0_27-32/jre/bin/java -enableassertions -Xmx1900m -Djava.security.egd=file:/dev/./urandom -jar <https://builds.apache.org/job/HBase-TRUNK/ws/trunk/target/surefire/surefirebooter4034370596043004881.jar> <https://builds.apache.org/job/HBase-TRUNK/ws/trunk/target/surefire/surefire5230455017480100812tmp> <https://builds.apache.org/job/HBase-TRUNK/ws/trunk/target/surefire/surefire_662392941003507539702tmp>
Running org.apache.hadoop.hbase.replication.TestReplicationZookeeper
Tests run: 1, Failures: 0, Errors: 0, Skipped: 0, Time elapsed: 0.654 sec
Forking command line: /bin/sh -c cd <https://builds.apache.org/job/HBase-TRUNK/ws/trunk> && /home/jenkins/tools/java/jdk1.6.0_27-32/jre/bin/java -enableassertions -Xmx1900m -Djava.security.egd=file:/dev/./urandom -jar <https://builds.apache.org/job/HBase-TRUNK/ws/trunk/target/surefire/surefirebooter5369341770502205273.jar> <https://builds.apache.org/job/HBase-TRUNK/ws/trunk/target/surefire/surefire4601026258750357993tmp> <https://builds.apache.org/job/HBase-TRUNK/ws/trunk/target/surefire/surefire_674961413071767005006tmp>
Running org.apache.hadoop.hbase.replication.TestReplicationSource
Tests run: 1, Failures: 0, Errors: 0, Skipped: 0, Time elapsed: 2.729 sec
Forking command line: /bin/sh -c cd <https://builds.apache.org/job/HBase-TRUNK/ws/trunk> && /home/jenkins/tools/java/jdk1.6.0_27-32/jre/bin/java -enableassertions -Xmx1900m -Djava.security.egd=file:/dev/./urandom -jar <https://builds.apache.org/job/HBase-TRUNK/ws/trunk/target/surefire/surefirebooter1959255369467833511.jar> <https://builds.apache.org/job/HBase-TRUNK/ws/trunk/target/surefire/surefire1013337431106286457tmp> <https://builds.apache.org/job/HBase-TRUNK/ws/trunk/target/surefire/surefire_681381122491332535766tmp>
Running org.apache.hadoop.hbase.replication.TestReplicationPeer
Tests run: 1, Failures: 0, Errors: 0, Skipped: 0, Time elapsed: 1.43 sec
Forking command line: /bin/sh -c cd <https://builds.apache.org/job/HBase-TRUNK/ws/trunk> && /home/jenkins/tools/java/jdk1.6.0_27-32/jre/bin/java -enableassertions -Xmx1900m -Djava.security.egd=file:/dev/./urandom -jar <https://builds.apache.org/job/HBase-TRUNK/ws/trunk/target/surefire/surefirebooter4917580428595337867.jar> <https://builds.apache.org/job/HBase-TRUNK/ws/trunk/target/surefire/surefire1904748604714527059tmp> <https://builds.apache.org/job/HBase-TRUNK/ws/trunk/target/surefire/surefire_697123869758355734238tmp>
Running org.apache.hadoop.hbase.replication.regionserver.TestReplicationSink
Tests run: 5, Failures: 0, Errors: 0, Skipped: 0, Time elapsed: 28.643 sec
Forking command line: /bin/sh -c cd <https://builds.apache.org/job/HBase-TRUNK/ws/trunk> && /home/jenkins/tools/java/jdk1.6.0_27-32/jre/bin/java -enableassertions -Xmx1900m -Djava.security.egd=file:/dev/./urandom -jar <https://builds.apache.org/job/HBase-TRUNK/ws/trunk/target/surefire/surefirebooter8925268024067471758.jar> <https://builds.apache.org/job/HBase-TRUNK/ws/trunk/target/surefire/surefire7311089912110099060tmp> <https://builds.apache.org/job/HBase-TRUNK/ws/trunk/target/surefire/surefire_706959402240980129077tmp>
Running org.apache.hadoop.hbase.replication.regionserver.TestReplicationSourceManager
Tests run: 1, Failures: 0, Errors: 0, Skipped: 0, Time elapsed: 1.051 sec
Forking command line: /bin/sh -c cd <https://builds.apache.org/job/HBase-TRUNK/ws/trunk> && /home/jenkins/tools/java/jdk1.6.0_27-32/jre/bin/java -enableassertions -Xmx1900m -Djava.security.egd=file:/dev/./urandom -jar <https://builds.apache.org/job/HBase-TRUNK/ws/trunk/target/surefire/surefirebooter2165711425584945719.jar> <https://builds.apache.org/job/HBase-TRUNK/ws/trunk/target/surefire/surefire168868747129569327tmp> <https://builds.apache.org/job/HBase-TRUNK/ws/trunk/target/surefire/surefire_715117799067306012479tmp>
Running org.apache.hadoop.hbase.TestMultiVersions
Tests run: 3, Failures: 0, Errors: 0, Skipped: 0, Time elapsed: 23.41 sec
Forking command line: /bin/sh -c cd <https://builds.apache.org/job/HBase-TRUNK/ws/trunk> && /home/jenkins/tools/java/jdk1.6.0_27-32/jre/bin/java -enableassertions -Xmx1900m -Djava.security.egd=file:/dev/./urandom -jar <https://builds.apache.org/job/HBase-TRUNK/ws/trunk/target/surefire/surefirebooter391943271897722421.jar> <https://builds.apache.org/job/HBase-TRUNK/ws/trunk/target/surefire/surefire3578640747317223244tmp> <https://builds.apache.org/job/HBase-TRUNK/ws/trunk/target/surefire/surefire_728440745899809199593tmp>
Running org.apache.hadoop.hbase.catalog.TestMetaReaderEditorNoCluster
Tests run: 1, Failures: 0, Errors: 0, Skipped: 0, Time elapsed: 4.193 sec
Forking command line: /bin/sh -c cd <https://builds.apache.org/job/HBase-TRUNK/ws/trunk> && /home/jenkins/tools/java/jdk1.6.0_27-32/jre/bin/java -enableassertions -Xmx1900m -Djava.security.egd=file:/dev/./urandom -jar <https://builds.apache.org/job/HBase-TRUNK/ws/trunk/target/surefire/surefirebooter1591730169291571910.jar> <https://builds.apache.org/job/HBase-TRUNK/ws/trunk/target/surefire/surefire8073623391829026566tmp> <https://builds.apache.org/job/HBase-TRUNK/ws/trunk/target/surefire/surefire_731420695413111804609tmp>
Running org.apache.hadoop.hbase.catalog.TestMetaReaderEditor
Tests run: 5, Failures: 0, Errors: 0, Skipped: 0, Time elapsed: 22.519 sec
Forking command line: /bin/sh -c cd <https://builds.apache.org/job/HBase-TRUNK/ws/trunk> && /home/jenkins/tools/java/jdk1.6.0_27-32/jre/bin/java -enableassertions -Xmx1900m -Djava.security.egd=file:/dev/./urandom -jar <https://builds.apache.org/job/HBase-TRUNK/ws/trunk/target/surefire/surefirebooter832964641633359659.jar> <https://builds.apache.org/job/HBase-TRUNK/ws/trunk/target/surefire/surefire8728104539019855202tmp> <https://builds.apache.org/job/HBase-TRUNK/ws/trunk/target/surefire/surefire_741956249266669330266tmp>
Running org.apache.hadoop.hbase.catalog.TestCatalogTracker
Tests run: 9, Failures: 0, Errors: 0, Skipped: 1, Time elapsed: 5.428 sec
Forking command line: /bin/sh -c cd <https://builds.apache.org/job/HBase-TRUNK/ws/trunk> && /home/jenkins/tools/java/jdk1.6.0_27-32/jre/bin/java -enableassertions -Xmx1900m -Djava.security.egd=file:/dev/./urandom -jar <https://builds.apache.org/job/HBase-TRUNK/ws/trunk/target/surefire/surefirebooter2877057249458393426.jar> <https://builds.apache.org/job/HBase-TRUNK/ws/trunk/target/surefire/surefire7857706362858597289tmp> <https://builds.apache.org/job/HBase-TRUNK/ws/trunk/target/surefire/surefire_751387668663002345081tmp>
Running org.apache.hadoop.hbase.coprocessor.TestAggregateProtocol
Tests run: 45, Failures: 0, Errors: 0, Skipped: 0, Time elapsed: 16.992 sec
Forking command line: /bin/sh -c cd <https://builds.apache.org/job/HBase-TRUNK/ws/trunk> && /home/jenkins/tools/java/jdk1.6.0_27-32/jre/bin/java -enableassertions -Xmx1900m -Djava.security.egd=file:/dev/./urandom -jar <https://builds.apache.org/job/HBase-TRUNK/ws/trunk/target/surefire/surefirebooter4068436246015376387.jar> <https://builds.apache.org/job/HBase-TRUNK/ws/trunk/target/surefire/surefire1650657743897016827tmp> <https://builds.apache.org/job/HBase-TRUNK/ws/trunk/target/surefire/surefire_76450309050384395272tmp>
Running org.apache.hadoop.hbase.coprocessor.TestMasterObserver
Tests run: 3, Failures: 0, Errors: 0, Skipped: 0, Time elapsed: 26.657 sec
Forking command line: /bin/sh -c cd <https://builds.apache.org/job/HBase-TRUNK/ws/trunk> && /home/jenkins/tools/java/jdk1.6.0_27-32/jre/bin/java -enableassertions -Xmx1900m -Djava.security.egd=file:/dev/./urandom -jar <https://builds.apache.org/job/HBase-TRUNK/ws/trunk/target/surefire/surefirebooter1564086824778739337.jar> <https://builds.apache.org/job/HBase-TRUNK/ws/trunk/target/surefire/surefire5738210915514513788tmp> <https://builds.apache.org/job/HBase-TRUNK/ws/trunk/target/surefire/surefire_778538112917142588651tmp>
Running org.apache.hadoop.hbase.coprocessor.TestCoprocessorEndpoint
Tests run: 3, Failures: 0, Errors: 0, Skipped: 1, Time elapsed: 29.22 sec
Forking command line: /bin/sh -c cd <https://builds.apache.org/job/HBase-TRUNK/ws/trunk> && /home/jenkins/tools/java/jdk1.6.0_27-32/jre/bin/java -enableassertions -Xmx1900m -Djava.security.egd=file:/dev/./urandom -jar <https://builds.apache.org/job/HBase-TRUNK/ws/trunk/target/surefire/surefirebooter4914041186153172257.jar> <https://builds.apache.org/job/HBase-TRUNK/ws/trunk/target/surefire/surefire4916337463053394019tmp> <https://builds.apache.org/job/HBase-TRUNK/ws/trunk/target/surefire/surefire_788660205873750787207tmp>
Forking command line: /bin/sh -c cd <https://builds.apache.org/job/HBase-TRUNK/ws/trunk> && /home/jenkins/tools/java/jdk1.6.0_27-32/jre/bin/java -enableassertions -Xmx1900m -Djava.security.egd=file:/dev/./urandom -jar <https://builds.apache.org/job/HBase-TRUNK/ws/trunk/target/surefire/surefirebooter6381610782686654086.jar> <https://builds.apache.org/job/HBase-TRUNK/ws/trunk/target/surefire/surefire776303453864320017tmp> <https://builds.apache.org/job/HBase-TRUNK/ws/trunk/target/surefire/surefire_791984015576546753593tmp>
Running org.apache.hadoop.hbase.coprocessor.TestClassLoading
Tests run: 6, Failures: 0, Errors: 0, Skipped: 0, Time elapsed: 31.703 sec
Forking command line: /bin/sh -c cd <https://builds.apache.org/job/HBase-TRUNK/ws/trunk> && /home/jenkins/tools/java/jdk1.6.0_27-32/jre/bin/java -enableassertions -Xmx1900m -Djava.security.egd=file:/dev/./urandom -jar <https://builds.apache.org/job/HBase-TRUNK/ws/trunk/target/surefire/surefirebooter6373620076928471534.jar> <https://builds.apache.org/job/HBase-TRUNK/ws/trunk/target/surefire/surefire4547822130363715540tmp> <https://builds.apache.org/job/HBase-TRUNK/ws/trunk/target/surefire/surefire_806697182102818714383tmp>
Running org.apache.hadoop.hbase.coprocessor.TestRegionObserverInterface
Tests run: 6, Failures: 0, Errors: 0, Skipped: 0, Time elapsed: 34.192 sec
Forking command line: /bin/sh -c cd <https://builds.apache.org/job/HBase-TRUNK/ws/trunk> && /home/jenkins/tools/java/jdk1.6.0_27-32/jre/bin/java -enableassertions -Xmx1900m -Djava.security.egd=file:/dev/./urandom -jar <https://builds.apache.org/job/HBase-TRUNK/ws/trunk/target/surefire/surefirebooter7629998173299972243.jar> <https://builds.apache.org/job/HBase-TRUNK/ws/trunk/target/surefire/surefire2562064577003091746tmp> <https://builds.apache.org/job/HBase-TRUNK/ws/trunk/target/surefire/surefire_815566298994452042891tmp>
Running org.apache.hadoop.hbase.coprocessor.TestMasterCoprocessorExceptionWithRemove
Tests run: 1, Failures: 0, Errors: 0, Skipped: 0, Time elapsed: 14.776 sec
Forking command line: /bin/sh -c cd <https://builds.apache.org/job/HBase-TRUNK/ws/trunk> && /home/jenkins/tools/java/jdk1.6.0_27-32/jre/bin/java -enableassertions -Xmx1900m -Djava.security.egd=file:/dev/./urandom -jar <https://builds.apache.org/job/HBase-TRUNK/ws/trunk/target/surefire/surefirebooter3626888581888092304.jar> <https://builds.apache.org/job/HBase-TRUNK/ws/trunk/target/surefire/surefire1273042641551492703tmp> <https://builds.apache.org/job/HBase-TRUNK/ws/trunk/target/surefire/surefire_823010167471660063979tmp>
Running org.apache.hadoop.hbase.coprocessor.TestRegionServerCoprocessorExceptionWithRemove
Tests run: 1, Failures: 0, Errors: 0, Skipped: 0, Time elapsed: 18.94 sec
Forking command line: /bin/sh -c cd <https://builds.apache.org/job/HBase-TRUNK/ws/trunk> && /home/jenkins/tools/java/jdk1.6.0_27-32/jre/bin/java -enableassertions -Xmx1900m -Djava.security.egd=file:/dev/./urandom -jar <https://builds.apache.org/job/HBase-TRUNK/ws/trunk/target/surefire/surefirebooter2486864251784811426.jar> <https://builds.apache.org/job/HBase-TRUNK/ws/trunk/target/surefire/surefire3519692097494794280tmp> <https://builds.apache.org/job/HBase-TRUNK/ws/trunk/target/surefire/surefire_838818510750974380942tmp>
Running org.apache.hadoop.hbase.coprocessor.TestMasterCoprocessorExceptionWithAbort
Tests run: 1, Failures: 0, Errors: 0, Skipped: 0, Time elapsed: 25.344 sec
Forking command line: /bin/sh -c cd <https://builds.apache.org/job/HBase-TRUNK/ws/trunk> && /home/jenkins/tools/java/jdk1.6.0_27-32/jre/bin/java -enableassertions -Xmx1900m -Djava.security.egd=file:/dev/./urandom -jar <https://builds.apache.org/job/HBase-TRUNK/ws/trunk/target/surefire/surefirebooter9168156149826716399.jar> <https://builds.apache.org/job/HBase-TRUNK/ws/trunk/target/surefire/surefire5961856654045192905tmp> <https://builds.apache.org/job/HBase-TRUNK/ws/trunk/target/surefire/surefire_847177652198580628466tmp>
Running org.apache.hadoop.hbase.coprocessor.TestWALObserver
Tests run: 3, Failures: 0, Errors: 0, Skipped: 0, Time elapsed: 16.387 sec
Running org.apache.hadoop.hbase.coprocessor.TestRegionServerCoprocessorExceptionWithAbort
Tests run: 1, Failures: 0, Errors: 0, Skipped: 0, Time elapsed: 14.09 sec
Forking command line: /bin/sh -c cd <https://builds.apache.org/job/HBase-TRUNK/ws/trunk> && /home/jenkins/tools/java/jdk1.6.0_27-32/jre/bin/java -enableassertions -Xmx1900m -Djava.security.egd=file:/dev/./urandom -jar <https://builds.apache.org/job/HBase-TRUNK/ws/trunk/target/surefire/surefirebooter1381312624037646320.jar> <https://builds.apache.org/job/HBase-TRUNK/ws/trunk/target/surefire/surefire7563471259878270758tmp> <https://builds.apache.org/job/HBase-TRUNK/ws/trunk/target/surefire/surefire_853641806554969784022tmp>
Forking command line: /bin/sh -c cd <https://builds.apache.org/job/HBase-TRUNK/ws/trunk> && /home/jenkins/tools/java/jdk1.6.0_27-32/jre/bin/java -enableassertions -Xmx1900m -Djava.security.egd=file:/dev/./urandom -jar <https://builds.apache.org/job/HBase-TRUNK/ws/trunk/target/surefire/surefirebooter1346342875952841522.jar> <https://builds.apache.org/job/HBase-TRUNK/ws/trunk/target/surefire/surefire1774134943054190392tmp> <https://builds.apache.org/job/HBase-TRUNK/ws/trunk/target/surefire/surefire_862131678460680142796tmp>
Running org.apache.hadoop.hbase.coprocessor.TestRegionObserverBypass
Tests run: 2, Failures: 0, Errors: 0, Skipped: 0, Time elapsed: 12.467 sec
Forking command line: /bin/sh -c cd <https://builds.apache.org/job/HBase-TRUNK/ws/trunk> && /home/jenkins/tools/java/jdk1.6.0_27-32/jre/bin/java -enableassertions -Xmx1900m -Djava.security.egd=file:/dev/./urandom -jar <https://builds.apache.org/job/HBase-TRUNK/ws/trunk/target/surefire/surefirebooter2429420026882050630.jar> <https://builds.apache.org/job/HBase-TRUNK/ws/trunk/target/surefire/surefire4141909654590430475tmp> <https://builds.apache.org/job/HBase-TRUNK/ws/trunk/target/surefire/surefire_876155907330274774263tmp>
Running org.apache.hadoop.hbase.thrift2.TestThriftHBaseServiceHandler
Tests run: 12, Failures: 0, Errors: 0, Skipped: 0, Time elapsed: 12.318 sec
Forking command line: /bin/sh -c cd <https://builds.apache.org/job/HBase-TRUNK/ws/trunk> && /home/jenkins/tools/java/jdk1.6.0_27-32/jre/bin/java -enableassertions -Xmx1900m -Djava.security.egd=file:/dev/./urandom -jar <https://builds.apache.org/job/HBase-TRUNK/ws/trunk/target/surefire/surefirebooter1337186589915580960.jar> <https://builds.apache.org/job/HBase-TRUNK/ws/trunk/target/surefire/surefire5474106681493600523tmp> <https://builds.apache.org/job/HBase-TRUNK/ws/trunk/target/surefire/surefire_88172827958707248597tmp>
Running org.apache.hadoop.hbase.avro.TestAvroServer
Tests run: 3, Failures: 0, Errors: 0, Skipped: 0, Time elapsed: 26.893 sec
Forking command line: /bin/sh -c cd <https://builds.apache.org/job/HBase-TRUNK/ws/trunk> && /home/jenkins/tools/java/jdk1.6.0_27-32/jre/bin/java -enableassertions -Xmx1900m -Djava.security.egd=file:/dev/./urandom -jar <https://builds.apache.org/job/HBase-TRUNK/ws/trunk/target/surefire/surefirebooter3000742504600413463.jar> <https://builds.apache.org/job/HBase-TRUNK/ws/trunk/target/surefire/surefire6343496034164439108tmp> <https://builds.apache.org/job/HBase-TRUNK/ws/trunk/target/surefire/surefire_896669903285172025946tmp>
Running org.apache.hadoop.hbase.monitoring.TestTaskMonitor
Tests run: 3, Failures: 0, Errors: 0, Skipped: 0, Time elapsed: 0.299 sec
Forking command line: /bin/sh -c cd <https://builds.apache.org/job/HBase-TRUNK/ws/trunk> && /home/jenkins/tools/java/jdk1.6.0_27-32/jre/bin/java -enableassertions -Xmx1900m -Djava.security.egd=file:/dev/./urandom -jar <https://builds.apache.org/job/HBase-TRUNK/ws/trunk/target/surefire/surefirebooter5868784204668378851.jar> <https://builds.apache.org/job/HBase-TRUNK/ws/trunk/target/surefire/surefire3544029280158107722tmp> <https://builds.apache.org/job/HBase-TRUNK/ws/trunk/target/surefire/surefire_905557583224592062358tmp>
Running org.apache.hadoop.hbase.monitoring.TestMemoryBoundedLogMessageBuffer
Tests run: 2, Failures: 0, Errors: 0, Skipped: 0, Time elapsed: 0.232 sec
Forking command line: /bin/sh -c cd <https://builds.apache.org/job/HBase-TRUNK/ws/trunk> && /home/jenkins/tools/java/jdk1.6.0_27-32/jre/bin/java -enableassertions -Xmx1900m -Djava.security.egd=file:/dev/./urandom -jar <https://builds.apache.org/job/HBase-TRUNK/ws/trunk/target/surefire/surefirebooter1595496684621726516.jar> <https://builds.apache.org/job/HBase-TRUNK/ws/trunk/target/surefire/surefire6295339648249984008tmp> <https://builds.apache.org/job/HBase-TRUNK/ws/trunk/target/surefire/surefire_916536799061084878718tmp>
Running org.apache.hadoop.hbase.thrift.TestThriftServer
Tests run: 1, Failures: 0, Errors: 0, Skipped: 0, Time elapsed: 66.052 sec
Forking command line: /bin/sh -c cd <https://builds.apache.org/job/HBase-TRUNK/ws/trunk> && /home/jenkins/tools/java/jdk1.6.0_27-32/jre/bin/java -enableassertions -Xmx1900m -Djava.security.egd=file:/dev/./urandom -jar <https://builds.apache.org/job/HBase-TRUNK/ws/trunk/target/surefire/surefirebooter4261651661702288621.jar> <https://builds.apache.org/job/HBase-TRUNK/ws/trunk/target/surefire/surefire8033161132521695111tmp> <https://builds.apache.org/job/HBase-TRUNK/ws/trunk/target/surefire/surefire_927480049486777967180tmp>
Running org.apache.hadoop.hbase.regionserver.TestMasterAddressManager
Tests run: 1, Failures: 0, Errors: 0, Skipped: 0, Time elapsed: 0.73 sec
Forking command line: /bin/sh -c cd <https://builds.apache.org/job/HBase-TRUNK/ws/trunk> && /home/jenkins/tools/java/jdk1.6.0_27-32/jre/bin/java -enableassertions -Xmx1900m -Djava.security.egd=file:/dev/./urandom -jar <https://builds.apache.org/job/HBase-TRUNK/ws/trunk/target/surefire/surefirebooter1084376511952982945.jar> <https://builds.apache.org/job/HBase-TRUNK/ws/trunk/target/surefire/surefire1766418203967460297tmp> <https://builds.apache.org/job/HBase-TRUNK/ws/trunk/target/surefire/surefire_93224856413288599390tmp>
Running org.apache.hadoop.hbase.regionserver.TestHRegion
Tests run: 62, Failures: 0, Errors: 0, Skipped: 0, Time elapsed: 53.865 sec
Forking command line: /bin/sh -c cd <https://builds.apache.org/job/HBase-TRUNK/ws/trunk> && /home/jenkins/tools/java/jdk1.6.0_27-32/jre/bin/java -enableassertions -Xmx1900m -Djava.security.egd=file:/dev/./urandom -jar <https://builds.apache.org/job/HBase-TRUNK/ws/trunk/target/surefire/surefirebooter5879711938251953320.jar> <https://builds.apache.org/job/HBase-TRUNK/ws/trunk/target/surefire/surefire2707605719547866735tmp> <https://builds.apache.org/job/HBase-TRUNK/ws/trunk/target/surefire/surefire_948729574547010246405tmp>
Running org.apache.hadoop.hbase.regionserver.TestSplitLogWorker
Tests run: 5, Failures: 0, Errors: 0, Skipped: 0, Time elapsed: 2.234 sec
Forking command line: /bin/sh -c cd <https://builds.apache.org/job/HBase-TRUNK/ws/trunk> && /home/jenkins/tools/java/jdk1.6.0_27-32/jre/bin/java -enableassertions -Xmx1900m -Djava.security.egd=file:/dev/./urandom -jar <https://builds.apache.org/job/HBase-TRUNK/ws/trunk/target/surefire/surefirebooter5537938585733863843.jar> <https://builds.apache.org/job/HBase-TRUNK/ws/trunk/target/surefire/surefire499570263689136305tmp> <https://builds.apache.org/job/HBase-TRUNK/ws/trunk/target/surefire/surefire_954625778121809570894tmp>
Running org.apache.hadoop.hbase.regionserver.TestServerCustomProtocol
Tests run: 7, Failures: 1, Errors: 0, Skipped: 0, Time elapsed: 16.11 sec <<< FAILURE!
Forking command line: /bin/sh -c cd <https://builds.apache.org/job/HBase-TRUNK/ws/trunk> && /home/jenkins/tools/java/jdk1.6.0_27-32/jre/bin/java -enableassertions -Xmx1900m -Djava.security.egd=file:/dev/./urandom -jar <https://builds.apache.org/job/HBase-TRUNK/ws/trunk/target/surefire/surefirebooter3747871564072410329.jar> <https://builds.apache.org/job/HBase-TRUNK/ws/trunk/target/surefire/surefire253382899158796415tmp> <https://builds.apache.org/job/HBase-TRUNK/ws/trunk/target/surefire/surefire_96737440932387086399tmp>
Running org.apache.hadoop.hbase.regionserver.TestStoreFileBlockCacheSummary
Tests run: 1, Failures: 0, Errors: 0, Skipped: 0, Time elapsed: 15.067 sec
Forking command line: /bin/sh -c cd <https://builds.apache.org/job/HBase-TRUNK/ws/trunk> && /home/jenkins/tools/java/jdk1.6.0_27-32/jre/bin/java -enableassertions -Xmx1900m -Djava.security.egd=file:/dev/./urandom -jar <https://builds.apache.org/job/HBase-TRUNK/ws/trunk/target/surefire/surefirebooter882050481463443574.jar> <https://builds.apache.org/job/HBase-TRUNK/ws/trunk/target/surefire/surefire2716025595164589401tmp> <https://builds.apache.org/job/HBase-TRUNK/ws/trunk/target/surefire/surefire_976189853660580680337tmp>
Running org.apache.hadoop.hbase.regionserver.TestRegionServerMetrics
Tests run: 2, Failures: 0, Errors: 0, Skipped: 0, Time elapsed: 44.244 sec
Forking command line: /bin/sh -c cd <https://builds.apache.org/job/HBase-TRUNK/ws/trunk> && /home/jenkins/tools/java/jdk1.6.0_27-32/jre/bin/java -enableassertions -Xmx1900m -Djava.security.egd=file:/dev/./urandom -jar <https://builds.apache.org/job/HBase-TRUNK/ws/trunk/target/surefire/surefirebooter4424731225540639842.jar> <https://builds.apache.org/job/HBase-TRUNK/ws/trunk/target/surefire/surefire6654666696861941259tmp> <https://builds.apache.org/job/HBase-TRUNK/ws/trunk/target/surefire/surefire_986549971866603496470tmp>
Running org.apache.hadoop.hbase.regionserver.TestStore
Tests run: 12, Failures: 0, Errors: 0, Skipped: 0, Time elapsed: 9.635 sec
Forking command line: /bin/sh -c cd <https://builds.apache.org/job/HBase-TRUNK/ws/trunk> && /home/jenkins/tools/java/jdk1.6.0_27-32/jre/bin/java -enableassertions -Xmx1900m -Djava.security.egd=file:/dev/./urandom -jar <https://builds.apache.org/job/HBase-TRUNK/ws/trunk/target/surefire/surefirebooter8808755391624023641.jar> <https://builds.apache.org/job/HBase-TRUNK/ws/trunk/target/surefire/surefire3045538976185665771tmp> <https://builds.apache.org/job/HBase-TRUNK/ws/trunk/target/surefire/surefire_991249606166964890844tmp>
Running org.apache.hadoop.hbase.regionserver.TestBlocksRead
Tests run: 4, Failures: 0, Errors: 0, Skipped: 0, Time elapsed: 1.15 sec
Forking command line: /bin/sh -c cd <https://builds.apache.org/job/HBase-TRUNK/ws/trunk> && /home/jenkins/tools/java/jdk1.6.0_27-32/jre/bin/java -enableassertions -Xmx1900m -Djava.security.egd=file:/dev/./urandom -jar <https://builds.apache.org/job/HBase-TRUNK/ws/trunk/target/surefire/surefirebooter2115796397880066811.jar> <https://builds.apache.org/job/HBase-TRUNK/ws/trunk/target/surefire/surefire6899005821315444444tmp> <https://builds.apache.org/job/HBase-TRUNK/ws/trunk/target/surefire/surefire_1006441039979799347030tmp>
Running org.apache.hadoop.hbase.regionserver.TestAtomicOperation
Tests run: 5, Failures: 0, Errors: 0, Skipped: 0, Time elapsed: 27.471 sec
Forking command line: /bin/sh -c cd <https://builds.apache.org/job/HBase-TRUNK/ws/trunk> && /home/jenkins/tools/java/jdk1.6.0_27-32/jre/bin/java -enableassertions -Xmx1900m -Djava.security.egd=file:/dev/./urandom -jar <https://builds.apache.org/job/HBase-TRUNK/ws/trunk/target/surefire/surefirebooter5404169763253432155.jar> <https://builds.apache.org/job/HBase-TRUNK/ws/trunk/target/surefire/surefire2226945891126750068tmp> <https://builds.apache.org/job/HBase-TRUNK/ws/trunk/target/surefire/surefire_1016459325813564483388tmp>
Running org.apache.hadoop.hbase.regionserver.TestSeekOptimizations
Tests run: 6, Failures: 0, Errors: 0, Skipped: 0, Time elapsed: 2.893 sec
Forking command line: /bin/sh -c cd <https://builds.apache.org/job/HBase-TRUNK/ws/trunk> && /home/jenkins/tools/java/jdk1.6.0_27-32/jre/bin/java -enableassertions -Xmx1900m -Djava.security.egd=file:/dev/./urandom -jar <https://builds.apache.org/job/HBase-TRUNK/ws/trunk/target/surefire/surefirebooter5463685256658722544.jar> <https://builds.apache.org/job/HBase-TRUNK/ws/trunk/target/surefire/surefire8282053336595459899tmp> <https://builds.apache.org/job/HBase-TRUNK/ws/trunk/target/surefire/surefire_1025155642669452678309tmp>
Running org.apache.hadoop.hbase.regionserver.TestFSErrorsExposed
Tests run: 3, Failures: 0, Errors: 0, Skipped: 0, Time elapsed: 30.458 sec
Forking command line: /bin/sh -c cd <https://builds.apache.org/job/HBase-TRUNK/ws/trunk> && /home/jenkins/tools/java/jdk1.6.0_27-32/jre/bin/java -enableassertions -Xmx1900m -Djava.security.egd=file:/dev/./urandom -jar <https://builds.apache.org/job/HBase-TRUNK/ws/trunk/target/surefire/surefirebooter7358828662050742498.jar> <https://builds.apache.org/job/HBase-TRUNK/ws/trunk/target/surefire/surefire7745129013510929373tmp> <https://builds.apache.org/job/HBase-TRUNK/ws/trunk/target/surefire/surefire_1035087928200562629873tmp>
Running org.apache.hadoop.hbase.regionserver.handler.TestCloseRegionHandler
Tests run: 3, Failures: 0, Errors: 0, Skipped: 0, Time elapsed: 1.297 sec
Forking command line: /bin/sh -c cd <https://builds.apache.org/job/HBase-TRUNK/ws/trunk> && /home/jenkins/tools/java/jdk1.6.0_27-32/jre/bin/java -enableassertions -Xmx1900m -Djava.security.egd=file:/dev/./urandom -jar <https://builds.apache.org/job/HBase-TRUNK/ws/trunk/target/surefire/surefirebooter2901443489944227660.jar> <https://builds.apache.org/job/HBase-TRUNK/ws/trunk/target/surefire/surefire7116053478385989404tmp> <https://builds.apache.org/job/HBase-TRUNK/ws/trunk/target/surefire/surefire_1047574910629049859688tmp>
Running org.apache.hadoop.hbase.regionserver.handler.TestOpenRegionHandler
Tests run: 3, Failures: 0, Errors: 0, Skipped: 0, Time elapsed: 1.054 sec
Forking command line: /bin/sh -c cd <https://builds.apache.org/job/HBase-TRUNK/ws/trunk> && /home/jenkins/tools/java/jdk1.6.0_27-32/jre/bin/java -enableassertions -Xmx1900m -Djava.security.egd=file:/dev/./urandom -jar <https://builds.apache.org/job/HBase-TRUNK/ws/trunk/target/surefire/surefirebooter3293515694181277979.jar> <https://builds.apache.org/job/HBase-TRUNK/ws/trunk/target/surefire/surefire655065369623400549tmp> <https://builds.apache.org/job/HBase-TRUNK/ws/trunk/target/surefire/surefire_1053441439292937578497tmp>
Running org.apache.hadoop.hbase.regionserver.metrics.TestSchemaMetrics
Tests run: 6, Failures: 0, Errors: 0, Skipped: 0, Time elapsed: 15.13 sec
Forking command line: /bin/sh -c cd <https://builds.apache.org/job/HBase-TRUNK/ws/trunk> && /home/jenkins/tools/java/jdk1.6.0_27-32/jre/bin/java -enableassertions -Xmx1900m -Djava.security.egd=file:/dev/./urandom -jar <https://builds.apache.org/job/HBase-TRUNK/ws/trunk/target/surefire/surefirebooter7567581767992571488.jar> <https://builds.apache.org/job/HBase-TRUNK/ws/trunk/target/surefire/surefire3817551717806344467tmp> <https://builds.apache.org/job/HBase-TRUNK/ws/trunk/target/surefire/surefire_1063047468161386691880tmp>
Running org.apache.hadoop.hbase.regionserver.TestParallelPut
Tests run: 2, Failures: 0, Errors: 0, Skipped: 0, Time elapsed: 5.414 sec
Running org.apache.hadoop.hbase.regionserver.wal.TestHLogBench
Tests run: 1, Failures: 0, Errors: 0, Skipped: 0, Time elapsed: 1.392 sec
Forking command line: /bin/sh -c cd <https://builds.apache.org/job/HBase-TRUNK/ws/trunk> && /home/jenkins/tools/java/jdk1.6.0_27-32/jre/bin/java -enableassertions -Xmx1900m -Djava.security.egd=file:/dev/./urandom -jar <https://builds.apache.org/job/HBase-TRUNK/ws/trunk/target/surefire/surefirebooter1802898601383435966.jar> <https://builds.apache.org/job/HBase-TRUNK/ws/trunk/target/surefire/surefire4835922278782932037tmp> <https://builds.apache.org/job/HBase-TRUNK/ws/trunk/target/surefire/surefire_1073419543380554302708tmp>
Forking command line: /bin/sh -c cd <https://builds.apache.org/job/HBase-TRUNK/ws/trunk> && /home/jenkins/tools/java/jdk1.6.0_27-32/jre/bin/java -enableassertions -Xmx1900m -Djava.security.egd=file:/dev/./urandom -jar <https://builds.apache.org/job/HBase-TRUNK/ws/trunk/target/surefire/surefirebooter4394252382458602935.jar> <https://builds.apache.org/job/HBase-TRUNK/ws/trunk/target/surefire/surefire168741162439498623tmp> <https://builds.apache.org/job/HBase-TRUNK/ws/trunk/target/surefire/surefire_1087552529809612925585tmp>
Running org.apache.hadoop.hbase.regionserver.wal.TestLogRollingNoCluster
Tests run: 1, Failures: 0, Errors: 0, Skipped: 0, Time elapsed: 2.362 sec
Forking command line: /bin/sh -c cd <https://builds.apache.org/job/HBase-TRUNK/ws/trunk> && /home/jenkins/tools/java/jdk1.6.0_27-32/jre/bin/java -enableassertions -Xmx1900m -Djava.security.egd=file:/dev/./urandom -jar <https://builds.apache.org/job/HBase-TRUNK/ws/trunk/target/surefire/surefirebooter154244911097049171.jar> <https://builds.apache.org/job/HBase-TRUNK/ws/trunk/target/surefire/surefire5871509738272256680tmp> <https://builds.apache.org/job/HBase-TRUNK/ws/trunk/target/surefire/surefire_1091812068509338691935tmp>
Running org.apache.hadoop.hbase.regionserver.wal.TestLogRollAbort
Tests run: 1, Failures: 0, Errors: 0, Skipped: 0, Time elapsed: 18.319 sec
Forking command line: /bin/sh -c cd <https://builds.apache.org/job/HBase-TRUNK/ws/trunk> && /home/jenkins/tools/java/jdk1.6.0_27-32/jre/bin/java -enableassertions -Xmx1900m -Djava.security.egd=file:/dev/./urandom -jar <https://builds.apache.org/job/HBase-TRUNK/ws/trunk/target/surefire/surefirebooter117757478265860601.jar> <https://builds.apache.org/job/HBase-TRUNK/ws/trunk/target/surefire/surefire2426168414122544736tmp> <https://builds.apache.org/job/HBase-TRUNK/ws/trunk/target/surefire/surefire_1102289756903651147838tmp>
Running org.apache.hadoop.hbase.regionserver.wal.TestWALReplay
Tests run: 5, Failures: 0, Errors: 0, Skipped: 0, Time elapsed: 29.176 sec
Running org.apache.hadoop.hbase.regionserver.wal.TestWALReplayCompressed
Tests run: 5, Failures: 0, Errors: 0, Skipped: 0, Time elapsed: 30.549 sec
Forking command line: /bin/sh -c cd <https://builds.apache.org/job/HBase-TRUNK/ws/trunk> && /home/jenkins/tools/java/jdk1.6.0_27-32/jre/bin/java -enableassertions -Xmx1900m -Djava.security.egd=file:/dev/./urandom -jar <https://builds.apache.org/job/HBase-TRUNK/ws/trunk/target/surefire/surefirebooter697397720968857734.jar> <https://builds.apache.org/job/HBase-TRUNK/ws/trunk/target/surefire/surefire4495941204166227142tmp> <https://builds.apache.org/job/HBase-TRUNK/ws/trunk/target/surefire/surefire_1113110926167966346297tmp>
Running org.apache.hadoop.hbase.regionserver.TestStoreScanner
Tests run: 16, Failures: 0, Errors: 0, Skipped: 0, Time elapsed: 0.049 sec
Forking command line: /bin/sh -c cd <https://builds.apache.org/job/HBase-TRUNK/ws/trunk> && /home/jenkins/tools/java/jdk1.6.0_27-32/jre/bin/java -enableassertions -Xmx1900m -Djava.security.egd=file:/dev/./urandom -jar <https://builds.apache.org/job/HBase-TRUNK/ws/trunk/target/surefire/surefirebooter7203229403536384784.jar> <https://builds.apache.org/job/HBase-TRUNK/ws/trunk/target/surefire/surefire2667118143240528746tmp> <https://builds.apache.org/job/HBase-TRUNK/ws/trunk/target/surefire/surefire_1124837702760333631855tmp>
Running org.apache.hadoop.hbase.regionserver.TestRpcMetrics
Tests run: 1, Failures: 0, Errors: 0, Skipped: 0, Time elapsed: 2.167 sec
Forking command line: /bin/sh -c cd <https://builds.apache.org/job/HBase-TRUNK/ws/trunk> && /home/jenkins/tools/java/jdk1.6.0_27-32/jre/bin/java -enableassertions -Xmx1900m -Djava.security.egd=file:/dev/./urandom -jar <https://builds.apache.org/job/HBase-TRUNK/ws/trunk/target/surefire/surefirebooter6795925147574834851.jar> <https://builds.apache.org/job/HBase-TRUNK/ws/trunk/target/surefire/surefire5350093937058588098tmp> <https://builds.apache.org/job/HBase-TRUNK/ws/trunk/target/surefire/surefire_1134817378722197855777tmp>
Forking command line: /bin/sh -c cd <https://builds.apache.org/job/HBase-TRUNK/ws/trunk> && /home/jenkins/tools/java/jdk1.6.0_27-32/jre/bin/java -enableassertions -Xmx1900m -Djava.security.egd=file:/dev/./urandom -jar <https://builds.apache.org/job/HBase-TRUNK/ws/trunk/target/surefire/surefirebooter6137870973870072716.jar> <https://builds.apache.org/job/HBase-TRUNK/ws/trunk/target/surefire/surefire2145458111639358586tmp> <https://builds.apache.org/job/HBase-TRUNK/ws/trunk/target/surefire/surefire_1143424699526016652059tmp>
Running org.apache.hadoop.hbase.TestDrainingServer
Tests run: 2, Failures: 0, Errors: 0, Skipped: 0, Time elapsed: 16.558 sec
Forking command line: /bin/sh -c cd <https://builds.apache.org/job/HBase-TRUNK/ws/trunk> && /home/jenkins/tools/java/jdk1.6.0_27-32/jre/bin/java -enableassertions -Xmx1900m -Djava.security.egd=file:/dev/./urandom -jar <https://builds.apache.org/job/HBase-TRUNK/ws/trunk/target/surefire/surefirebooter6590883858959716527.jar> <https://builds.apache.org/job/HBase-TRUNK/ws/trunk/target/surefire/surefire5268462130965251922tmp> <https://builds.apache.org/job/HBase-TRUNK/ws/trunk/target/surefire/surefire_1151218356254889850939tmp>
Running org.apache.hadoop.hbase.regionserver.TestMultiColumnScanner
Tests run: 12, Failures: 0, Errors: 0, Skipped: 0, Time elapsed: 41.146 sec
Forking command line: /bin/sh -c cd <https://builds.apache.org/job/HBase-TRUNK/ws/trunk> && /home/jenkins/tools/java/jdk1.6.0_27-32/jre/bin/java -enableassertions -Xmx1900m -Djava.security.egd=file:/dev/./urandom -jar <https://builds.apache.org/job/HBase-TRUNK/ws/trunk/target/surefire/surefirebooter7121656720316614469.jar> <https://builds.apache.org/job/HBase-TRUNK/ws/trunk/target/surefire/surefire4940009465448608854tmp> <https://builds.apache.org/job/HBase-TRUNK/ws/trunk/target/surefire/surefire_1167336220066640323980tmp>
Running org.apache.hadoop.hbase.mapreduce.TestImportExport
Tests run: 2, Failures: 0, Errors: 0, Skipped: 0, Time elapsed: 48.954 sec
Forking command line: /bin/sh -c cd <https://builds.apache.org/job/HBase-TRUNK/ws/trunk> && /home/jenkins/tools/java/jdk1.6.0_27-32/jre/bin/java -enableassertions -Xmx1900m -Djava.security.egd=file:/dev/./urandom -jar <https://builds.apache.org/job/HBase-TRUNK/ws/trunk/target/surefire/surefirebooter645037484947503424.jar> <https://builds.apache.org/job/HBase-TRUNK/ws/trunk/target/surefire/surefire24193868012576742tmp> <https://builds.apache.org/job/HBase-TRUNK/ws/trunk/target/surefire/surefire_1177248000795693719730tmp>
Running org.apache.hadoop.hbase.mapreduce.TestHLogRecordReader
Tests run: 2, Failures: 0, Errors: 0, Skipped: 0, Time elapsed: 5.408 sec
Running org.apache.hadoop.hbase.mapreduce.TestImportTsv
Tests run: 8, Failures: 0, Errors: 0, Skipped: 0, Time elapsed: 78.975 sec
Results :
Failed tests: testRowRange(org.apache.hadoop.hbase.regionserver.TestServerCustomProtocol): Results should contain region test,bbb,1334370837452.48c4de3850b343dae4bd9c49d8c10117. for row 'bbb'
Tests run: 605, Failures: 1, Errors: 0, Skipped: 2
[INFO] ------------------------------------------------------------------------
[INFO] BUILD FAILURE
[INFO] ------------------------------------------------------------------------
[INFO] Total time: 34:10.465s
[INFO] Finished at: Sat Apr 14 02:40:48 UTC 2012
[INFO] Final Memory: 70M/802M
[INFO] ------------------------------------------------------------------------
[ERROR] Failed to execute goal org.apache.maven.plugins:maven-surefire-plugin:2.12-TRUNK-HBASE-2:test (secondPartTestsExecution) on project hbase: Failure or timeout -> [Help 1]
org.apache.maven.lifecycle.LifecycleExecutionException: Failed to execute goal org.apache.maven.plugins:maven-surefire-plugin:2.12-TRUNK-HBASE-2:test (secondPartTestsExecution) on project hbase: Failure or timeout
at org.apache.maven.lifecycle.internal.MojoExecutor.execute(MojoExecutor.java:217)
at org.apache.maven.lifecycle.internal.MojoExecutor.execute(MojoExecutor.java:153)
at org.apache.maven.lifecycle.internal.MojoExecutor.execute(MojoExecutor.java:145)
at org.apache.maven.lifecycle.internal.LifecycleModuleBuilder.buildProject(LifecycleModuleBuilder.java:84)
at org.apache.maven.lifecycle.internal.LifecycleModuleBuilder.buildProject(LifecycleModuleBuilder.java:59)
at org.apache.maven.lifecycle.internal.LifecycleStarter.singleThreadedBuild(LifecycleStarter.java:183)
at org.apache.maven.lifecycle.internal.LifecycleStarter.execute(LifecycleStarter.java:161)
at org.apache.maven.DefaultMaven.doExecute(DefaultMaven.java:319)
at org.apache.maven.DefaultMaven.execute(DefaultMaven.java:156)
at org.apache.maven.cli.MavenCli.execute(MavenCli.java:537)
at org.apache.maven.cli.MavenCli.doMain(MavenCli.java:196)
at org.apache.maven.cli.MavenCli.main(MavenCli.java:141)
at sun.reflect.NativeMethodAccessorImpl.invoke0(Native Method)
at sun.reflect.NativeMethodAccessorImpl.invoke(NativeMethodAccessorImpl.java:39)
at sun.reflect.DelegatingMethodAccessorImpl.invoke(DelegatingMethodAccessorImpl.java:25)
at java.lang.reflect.Method.invoke(Method.java:597)
at org.codehaus.plexus.classworlds.launcher.Launcher.launchEnhanced(Launcher.java:290)
at org.codehaus.plexus.classworlds.launcher.Launcher.launch(Launcher.java:230)
at org.codehaus.plexus.classworlds.launcher.Launcher.mainWithExitCode(Launcher.java:409)
at org.codehaus.plexus.classworlds.launcher.Launcher.main(Launcher.java:352)
Caused by: org.apache.maven.plugin.MojoExecutionException: Failure or timeout
at org.apache.maven.plugin.surefire.SurefirePlugin.assertNoFailureOrTimeout(SurefirePlugin.java:643)
at org.apache.maven.plugin.surefire.SurefirePlugin.handleSummary(SurefirePlugin.java:624)
at org.apache.maven.plugin.surefire.AbstractSurefireMojo.executeAfterPreconditionsChecked(AbstractSurefireMojo.java:137)
at org.apache.maven.plugin.surefire.AbstractSurefireMojo.execute(AbstractSurefireMojo.java:98)
at org.apache.maven.plugin.DefaultBuildPluginManager.executeMojo(DefaultBuildPluginManager.java:101)
at org.apache.maven.lifecycle.internal.MojoExecutor.execute(MojoExecutor.java:209)
... 19 more
[ERROR]
[ERROR]
[ERROR] For more information about the errors and possible solutions, please read the following articles:
[ERROR] [Help 1] http://cwiki.apache.org/confluence/display/MAVEN/MojoExecutionException
Build step 'Invoke top-level Maven targets' marked build as failure
Archiving artifacts
Recording test results
Updating HBASE-5684