You are viewing a plain text version of this content. The canonical link for it is here.
Posted to dev@poi.apache.org by Apache Jenkins Server <je...@builds.apache.org> on 2015/08/23 20:42:02 UTC

Build failed in Jenkins: POI #807

See <https://builds.apache.org/job/POI/807/changes>

Changes:

[centic] Specify the amount of memory for OOXMLLite as different environments fail sometimes currently and it should make the build more reproducible if we state how much memeory we want

[centic] Add empty.pptx to excludes in rat-check

------------------------------------------
Started by an SCM change
[EnvInject] - Loading node environment variables.
Building remotely on windows1 (Windows) in workspace <https://builds.apache.org/job/POI/ws/>
Updating http://svn.apache.org/repos/asf/poi/trunk at revision '2015-08-23T19:34:08.946 +0100'
U         sonar\ooxml-schema\pom.xml
U         sonar\ooxml-schema-security\pom.xml
U         build.xml
Fetching 'https://svn.apache.org/repos/asf/poi/site/forrest.properties' at -1 into 'F:\hudson\hudson-slave\workspace\POI\forrest.properties'
Fetching 'https://svn.apache.org/repos/asf/poi/site/src/documentation' at -1 into 'F:\hudson\hudson-slave\workspace\POI\src\documentation'
At revision 1697235
At revision 1697235
WARNING: clock of the subversion server appears to be out of sync. This can result in inconsistent check out behavior.
no change for http://svn.apache.org/repos/asf/poi/trunk/forrest.properties since the previous build
no change for https://svn.apache.org/repos/asf/poi/site/src/documentation since the previous build
[EnvInject] - Executing scripts and injecting environment variables after the SCM step.
[EnvInject] - Injecting as environment variables the properties content 
LANG=en_US.UTF-8

[EnvInject] - Variables injected successfully.
[POI] $ cmd.exe /C '"f:\hudson\tools\ant\latest\bin\ant.bat -Dcoverage.enabled=true clean jenkins && exit %%ERRORLEVEL%%"'
Buildfile: <https://builds.apache.org/job/POI/ws/build.xml>

clean:
   [delete] Deleting directory <https://builds.apache.org/job/POI/ws/build>

check-jars:

fetch-jars:

check-ooxml-jars:

fetch-ooxml-jars:

init:
    [mkdir] Created dir: <https://builds.apache.org/job/POI/ws/build>
    [mkdir] Created dir: <https://builds.apache.org/job/POI/ws/build\classes>
    [mkdir] Created dir: <https://builds.apache.org/job/POI/ws/build\test-classes>
    [mkdir] Created dir: <https://builds.apache.org/job/POI/ws/build\test-results>
    [mkdir] Created dir: <https://builds.apache.org/job/POI/ws/build\scratchpad-classes>
    [mkdir] Created dir: <https://builds.apache.org/job/POI/ws/build\scratchpad-test-classes>
    [mkdir] Created dir: <https://builds.apache.org/job/POI/ws/build\scratchpad-test-results>
    [mkdir] Created dir: <https://builds.apache.org/job/POI/ws/build\geometry-java>
    [mkdir] Created dir: <https://builds.apache.org/job/POI/ws/build\ooxml-classes>
    [mkdir] Created dir: <https://builds.apache.org/job/POI/ws/build\ooxml-test-classes>
    [mkdir] Created dir: <https://builds.apache.org/job/POI/ws/build\ooxml-test-results>
    [mkdir] Created dir: <https://builds.apache.org/job/POI/ws/build\excelant-classes>
    [mkdir] Created dir: <https://builds.apache.org/job/POI/ws/build\excelant-test-classes>
    [mkdir] Created dir: <https://builds.apache.org/job/POI/ws/build\excelant-test-results>
    [mkdir] Created dir: <https://builds.apache.org/job/POI/ws/build\examples-classes>
    [mkdir] Created dir: <https://builds.apache.org/job/POI/ws/build\integration-test-classes>
    [mkdir] Created dir: <https://builds.apache.org/job/POI/ws/build\integration-test-results>
    [mkdir] Created dir: <https://builds.apache.org/job/POI/ws/build\dist>
    [mkdir] Created dir: <https://builds.apache.org/job/POI/ws/build\tmp\site\build\site>
     [echo] Using Java: 1.6.0_27/1.6.0_27-b07/20.2-b06/Java HotSpot(TM) 64-Bit Server VM from Sun Microsystems Inc. on Windows Server 2008: 6.0

compile-main:
    [javac] Compiling 1176 source files to <https://builds.apache.org/job/POI/ws/build\classes>
    [javac] Note: Some input files use or override a deprecated API.
    [javac] Note: Recompile with -Xlint:deprecation for details.
    [javac] Note: Some input files use unchecked or unsafe operations.
    [javac] Note: Recompile with -Xlint:unchecked for details.
    [javac] Compiling 515 source files to <https://builds.apache.org/job/POI/ws/build\test-classes>
    [javac] Note: Some input files use or override a deprecated API.
    [javac] Note: Recompile with -Xlint:deprecation for details.
    [javac] Note: Some input files use unchecked or unsafe operations.
    [javac] Note: Recompile with -Xlint:unchecked for details.
     [copy] Copying 4 files to <https://builds.apache.org/job/POI/ws/build\classes>

check-ooxml-xsds:

fetch-ooxml-xsds:

generate-geometry:

compile-scratchpad:
    [javac] Compiling 504 source files to <https://builds.apache.org/job/POI/ws/build\scratchpad-classes>
    [javac] Note: Some input files use or override a deprecated API.
    [javac] Note: Recompile with -Xlint:deprecation for details.
    [javac] Note: Some input files use unchecked or unsafe operations.
    [javac] Note: Recompile with -Xlint:unchecked for details.
    [javac] Compiling 182 source files to <https://builds.apache.org/job/POI/ws/build\scratchpad-test-classes>
    [javac] Note: Some input files use or override a deprecated API.
    [javac] Note: Recompile with -Xlint:deprecation for details.
    [javac] Note: <https://builds.apache.org/job/POI/ws/src\scratchpad\testcases\org\apache\poi\hslf\TestReWriteSanity.java> uses unchecked or unsafe operations.
    [javac] Note: Recompile with -Xlint:unchecked for details.
     [copy] Copying 2 files to <https://builds.apache.org/job/POI/ws/build\scratchpad-classes>

check-compiled-ooxml-xsds:

compile-ooxml-xsds:

compile-ooxml:
    [javac] Compiling 350 source files to <https://builds.apache.org/job/POI/ws/build\ooxml-classes>
    [javac] Note: Some input files use or override a deprecated API.
    [javac] Note: Recompile with -Xlint:deprecation for details.
    [javac] Compiling 186 source files to <https://builds.apache.org/job/POI/ws/build\ooxml-test-classes>
    [javac] Note: Some input files use or override a deprecated API.
    [javac] Note: Recompile with -Xlint:deprecation for details.
     [copy] Copying 2 files to <https://builds.apache.org/job/POI/ws/build\ooxml-classes>

compile-examples:
    [javac] Compiling 137 source files to <https://builds.apache.org/job/POI/ws/build\examples-classes>
    [javac] Note: Some input files use or override a deprecated API.
    [javac] Note: Recompile with -Xlint:deprecation for details.
    [javac] Note: Some input files use unchecked or unsafe operations.
    [javac] Note: Recompile with -Xlint:unchecked for details.
     [copy] Copying 1 file to <https://builds.apache.org/job/POI/ws/build\examples-classes>

compile-excelant:
    [javac] Compiling 14 source files to <https://builds.apache.org/job/POI/ws/build\excelant-classes>
    [javac] Note: <https://builds.apache.org/job/POI/ws/src\excelant\java\org\apache\poi\ss\excelant\util\ExcelAntWorkbookUtil.java> uses or overrides a deprecated API.
    [javac] Note: Recompile with -Xlint:deprecation for details.
    [javac] Compiling 13 source files to <https://builds.apache.org/job/POI/ws/build\excelant-test-classes>
     [copy] Copying 1 file to <https://builds.apache.org/job/POI/ws/build\excelant-classes>

compile:

compile-ooxml-lite:
    [mkdir] Created dir: <https://builds.apache.org/job/POI/ws/build\ooxml-lite-merged>
      [jar] Building jar: <https://builds.apache.org/job/POI/ws/build\ooxml-lite-merged\ooxml-lite-merged.jar>
     [java] Collecting unit tests from <https://builds.apache.org/job/POI/ws/build\ooxml-test-classes>
     [java] Found 168 classes
     [java] ......................................................I..................................................................................................I....SLF4J: Failed to load class "org.slf4j.impl.StaticLoggerBinder".
     [java] SLF4J: Defaulting to no-operation (NOP) logger implementation
     [java] SLF4J: See http://www.slf4j.org/codes.html#StaticLoggerBinder for further details.
     [java] ....................................................................II..........JAXP: find factoryId =javax.xml.stream.XMLInputFactory
     [java] JAXP: found system property, value=com.sun.xml.internal.stream.XMLInputFactoryImpl
     [java] JAXP: created new instance of class com.sun.xml.internal.stream.XMLInputFactoryImpl using ClassLoader: null
     [java] ........................................................................................................................................Setting col: 0 and row 0
     [java] Setting col: 1 and row 1
     [java] ............................................................................................................................................................................................Warning - Row 13 has no cell 1, can't figure out test name
     [java] ........III.II.......I......................................................[Fatal Error] :1:1: The parser has encountered more than "4,096" entity expansions in this document; this is the limit imposed by the application.
     [java] ..[Fatal Error] :1:1: The parser has encountered more than "4,096" entity expansions in this document; this is the limit imposed by the application.
     [java] ..............I.....I...................I........E.....................................................................................................I.............................................................................................org.apache.poi.ss.usermodel.CellValue [12.0]
     [java] org.apache.poi.ss.usermodel.CellValue [12.0]
     [java] .....org.apache.poi.ss.usermodel.CellValue [1.0]
     [java] org.apache.poi.ss.usermodel.CellValue [1.0]
     [java] .org.apache.poi.ss.usermodel.CellValue [2.0]
     [java] org.apache.poi.ss.usermodel.CellValue [2.0]
     [java] .org.apache.poi.ss.usermodel.CellValue [2.0]
     [java] .org.apache.poi.ss.usermodel.CellValue [2.0]
     [java] .org.apache.poi.ss.usermodel.CellValue [2.0]
     [java] .org.apache.poi.ss.usermodel.CellValue [3.0]
     [java] ......................................................................................................................................................................................................................................................Done
     [java] ...........<?xml version="1.0" encoding="UTF-8"?>
     [java] <worksheet xmlns="http://schemas.openxmlformats.org/spreadsheetml/2006/main"><dimension ref="A1"/><sheetViews><sheetView workbookViewId="0" tabSelected="true"/></sheetViews><sheetFormatPr defaultRowHeight="15.0"/><sheetData/><pageMargins bottom="0.75" footer="0.3" header="0.3" left="0.7" right="0.7" top="0.75"/></worksheet>
     [java] ........................................Name: /word/document.xml - Content Type: application/vnd.openxmlformats-officedocument.wordprocessingml.document.main+xml
     [java] ................................................................................................................................................
     [java] Time: 255.736
     [java] There was 1 failure:
     [java] 1) bug58260(org.apache.poi.xssf.usermodel.TestXSSFBugs)
     [java] java.lang.OutOfMemoryError: GC overhead limit exceeded
     [java] 	at org.apache.xmlbeans.impl.store.Saver$TextSaver.resize(Saver.java:1700)
     [java] 	at org.apache.xmlbeans.impl.store.Saver$TextSaver.preEmit(Saver.java:1303)
     [java] 	at org.apache.xmlbeans.impl.store.Saver$TextSaver.emit(Saver.java:1190)
     [java] 	at org.apache.xmlbeans.impl.store.Saver$TextSaver.emitElement(Saver.java:962)
     [java] 	at org.apache.xmlbeans.impl.store.Saver.processElement(Saver.java:476)
     [java] 	at org.apache.xmlbeans.impl.store.Saver.process(Saver.java:307)
     [java] 	at org.apache.xmlbeans.impl.store.Saver$TextSaver.saveToString(Saver.java:1864)
     [java] 	at org.apache.xmlbeans.impl.store.Cursor._xmlText(Cursor.java:546)
     [java] 	at org.apache.xmlbeans.impl.store.Cursor.xmlText(Cursor.java:2436)
     [java] 	at org.apache.xmlbeans.impl.values.XmlObjectBase.xmlText(XmlObjectBase.java:1500)
     [java] 	at org.apache.poi.xssf.model.SharedStringsTable.getKey(SharedStringsTable.java:134)
     [java] 	at org.apache.poi.xssf.model.SharedStringsTable.addEntry(SharedStringsTable.java:180)
     [java] 	at org.apache.poi.xssf.usermodel.XSSFCell.setCellValue(XSSFCell.java:368)
     [java] 	at org.apache.poi.xssf.usermodel.XSSFCell.setCellValue(XSSFCell.java:332)
     [java] 	at org.apache.poi.ss.usermodel.BaseTestBugzillaIssues.bug58260(BaseTestBugzillaIssues.java:1215)
     [java] 	at sun.reflect.NativeMethodAccessorImpl.invoke0(Native Method)
     [java] 	at sun.reflect.NativeMethodAccessorImpl.invoke(NativeMethodAccessorImpl.java:39)
     [java] 	at sun.reflect.DelegatingMethodAccessorImpl.invoke(DelegatingMethodAccessorImpl.java:25)
     [java] 	at java.lang.reflect.Method.invoke(Method.java:597)
     [java] 	at org.junit.runners.model.FrameworkMethod$1.runReflectiveCall(FrameworkMethod.java:50)
     [java] 	at org.junit.internal.runners.model.ReflectiveCallable.run(ReflectiveCallable.java:12)
     [java] 	at org.junit.runners.model.FrameworkMethod.invokeExplosively(FrameworkMethod.java:47)
     [java] 	at org.junit.internal.runners.statements.InvokeMethod.evaluate(InvokeMethod.java:17)
     [java] 	at org.junit.runners.ParentRunner.runLeaf(ParentRunner.java:325)
     [java] 	at org.junit.runners.BlockJUnit4ClassRunner.runChild(BlockJUnit4ClassRunner.java:78)
     [java] 	at org.junit.runners.BlockJUnit4ClassRunner.runChild(BlockJUnit4ClassRunner.java:57)
     [java] 	at org.junit.runners.ParentRunner$3.run(ParentRunner.java:290)
     [java] 	at org.junit.runners.ParentRunner$1.schedule(ParentRunner.java:71)
     [java] 	at org.junit.runners.ParentRunner.runChildren(ParentRunner.java:288)
     [java] 	at org.junit.runners.ParentRunner.access$000(ParentRunner.java:58)
     [java] 	at org.junit.runners.ParentRunner$2.evaluate(ParentRunner.java:268)
     [java] 	at org.junit.runners.ParentRunner.run(ParentRunner.java:363)
     [java] Exception in thread "main" java.lang.RuntimeException: Tests did not succeed, cannot build ooxml-lite jar
     [java] 	at org.apache.poi.util.OOXMLLite.build(OOXMLLite.java:105)
     [java] 	at org.apache.poi.util.OOXMLLite.main(OOXMLLite.java:86)
     [java] 
     [java] FAILURES!!!
     [java] Tests run: 1321,  Failures: 1
     [java] 

BUILD FAILED
<https://builds.apache.org/job/POI/ws/build.xml>:1192: Java returned: 1

Total time: 7 minutes 1 second
Build step 'Invoke Ant' marked build as failure
[FINDBUGS] Skipping publisher since build result is FAILURE
[WARNINGS] Skipping publisher since build result is FAILURE
Archiving artifacts
Sending artifact delta relative to POI #805
Archived 16 artifacts
Archive block size is 32768
Received 1948 blocks and 50977 bytes
Compression is 99.9%
Took 12 sec
Recording test results

---------------------------------------------------------------------
To unsubscribe, e-mail: dev-unsubscribe@poi.apache.org
For additional commands, e-mail: dev-help@poi.apache.org


Jenkins build is back to normal : POI #808

Posted by Apache Jenkins Server <je...@builds.apache.org>.
See <https://builds.apache.org/job/POI/808/changes>


---------------------------------------------------------------------
To unsubscribe, e-mail: dev-unsubscribe@poi.apache.org
For additional commands, e-mail: dev-help@poi.apache.org