You are viewing a plain text version of this content. The canonical link for it is here.
Posted to builds@cassandra.apache.org by Apache Jenkins Server <je...@builds.apache.org> on 2023/04/01 04:31:26 UTC

Build complete: Cassandra-3.11 #436 [UNSTABLE] ee586b53c2cb7178c10841dc02f4023c64dda10e

-------------------------------------------------------------------------------
Build Cassandra-3.11 #436 Still Unstable
URL: https://ci-cassandra.apache.org/job/Cassandra-3.11/436/
-------------------------------------------------------------------------------
Changes:
[Brandon Williams] Notify the corresponding JIRA issue as soon as the PR is raised

[Brandon Williams] Remove asf.yaml from non-trunk branches

[Jacek Lewandowski] Save host id to system.local and flush immediately after startup


-------------------------------------------------------------------------------
Failed Tests:
18 tests failed.
FAILED:  dtest-novnode.replace_address_test.TestReplaceAddress.test_fail_when_seed
FAILED:  dtest-upgrade.upgrade_tests.storage_engine_upgrade_test.TestBootstrapAfterUpgrade.test_upgrade_with_range_tombstone_ae
FAILED:  dtest.materialized_views_test.TestMaterializedViewsConsistency.test_multi_partition_consistent_reads_after_write
FAILED:  org.apache.cassandra.distributed.upgrade.MixedModeReadTest.mixedModeReadColumnSubsetDigestCheck
FAILED:  org.apache.cassandra.db.compaction.LongLeveledCompactionStrategyCQLTest.stressTestCompactionStrategyManager
FAILED:  org.apache.cassandra.cql3.ViewTest.testClusteringOrder
FAILED:  org.apache.cassandra.concurrent.SEPExecutorTest.shutdownTest-cdc
FAILED:  dtest-upgrade.upgrade_tests.cql_tests.TestCQLNodes3RF3_Upgrade_current_2_1_x_To_indev_3_11_x.test_clustering_order_and_functions
FAILED:  dtest-upgrade.upgrade_tests.cql_tests.TestCQLNodes3RF3_Upgrade_current_2_1_x_To_indev_3_11_x.test_function_with_null
FAILED:  dtest-upgrade.upgrade_tests.cql_tests.TestCQLNodes2RF1_Upgrade_current_2_1_x_To_indev_3_11_x.test_timeuuid
FAILED:  dtest-upgrade.upgrade_tests.cql_tests.TestCQLNodes2RF1_Upgrade_current_2_1_x_To_indev_3_11_x.test_clustering_order_and_functions
FAILED:  dtest-upgrade.upgrade_tests.cql_tests.TestCQLNodes2RF1_Upgrade_current_2_1_x_To_indev_3_11_x.test_function_with_null
FAILED:  dtest-upgrade.upgrade_tests.cql_tests.TestCQLNodes3RF3_Upgrade_current_2_1_x_To_indev_3_11_x.test_timeuuid
FAILED:  org.apache.cassandra.distributed.test.ReprepareOldBehaviourTest.testReprepareMixedVersionWithoutReset
FAILED:  dtest-offheap.repair_tests.repair_test.TestRepair.test_dead_sync_initiator
FAILED:  dtest-novnode.repair_tests.repair_test.TestRepair.test_dead_sync_initiator
FAILED:  dtest.repair_tests.repair_test.TestRepair.test_dead_sync_initiator
FAILED:  dtest-upgrade.upgrade_internal_auth_test.TestAuthUpgrade.test_upgrade_legacy_table

-------------------------------------------------------------------------------
For complete test report and logs see https://nightlies.apache.org/cassandra/Cassandra-3.11/436/