You are viewing a plain text version of this content. The canonical link for it is here.
Posted to dev@lucene.apache.org by Policeman Jenkins Server <je...@thetaphi.de> on 2014/02/03 09:01:41 UTC

[JENKINS] Lucene-Solr-trunk-Windows (64bit/jdk1.7.0_51) - Build # 3739 - Failure!

Build: http://jenkins.thetaphi.de/job/Lucene-Solr-trunk-Windows/3739/
Java: 64bit/jdk1.7.0_51 -XX:-UseCompressedOops -XX:+UseConcMarkSweepGC

1 tests failed.
REGRESSION:  org.apache.solr.cloud.OverseerRolesTest.testDistribSearch

Error Message:
Captured an uncaught exception in thread: Thread[id=10983, name=Overseer-91187725480493070-127.0.0.1:62773_-n_0000000054, state=RUNNABLE, group=Overseer collection creation process.]

Stack Trace:
com.carrotsearch.randomizedtesting.UncaughtExceptionError: Captured an uncaught exception in thread: Thread[id=10983, name=Overseer-91187725480493070-127.0.0.1:62773_-n_0000000054, state=RUNNABLE, group=Overseer collection creation process.]
Caused by: org.apache.solr.common.cloud.ZooKeeperException: 
	at __randomizedtesting.SeedInfo.seed([A3ECBC284D188E7A]:0)
	at org.apache.solr.cloud.OverseerCollectionProcessor.run(OverseerCollectionProcessor.java:202)
	at java.lang.Thread.run(Thread.java:744)
Caused by: org.apache.zookeeper.KeeperException$NoNodeException: KeeperErrorCode = NoNode for /overseer/collection-queue-work/qn-0000000004
	at org.apache.zookeeper.KeeperException.create(KeeperException.java:111)
	at org.apache.zookeeper.KeeperException.create(KeeperException.java:51)
	at org.apache.zookeeper.ZooKeeper.getData(ZooKeeper.java:1151)
	at org.apache.solr.common.cloud.SolrZkClient$7.execute(SolrZkClient.java:273)
	at org.apache.solr.common.cloud.SolrZkClient$7.execute(SolrZkClient.java:270)
	at org.apache.solr.common.cloud.ZkCmdExecutor.retryOperation(ZkCmdExecutor.java:73)
	at org.apache.solr.common.cloud.SolrZkClient.getData(SolrZkClient.java:270)
	at org.apache.solr.cloud.DistributedQueue.remove(DistributedQueue.java:192)
	at org.apache.solr.cloud.OverseerCollectionProcessor.run(OverseerCollectionProcessor.java:193)
	... 1 more




Build Log:
[...truncated 10939 lines...]
   [junit4] Suite: org.apache.solr.cloud.OverseerRolesTest
   [junit4]   2> 3356707 T10752 oas.BaseDistributedSearchTestCase.initHostContext Setting hostContext system property: /
   [junit4]   2> 3356712 T10752 oas.SolrTestCaseJ4.setUp ###Starting testDistribSearch
   [junit4]   2> Creating dataDir: C:\Users\JenkinsSlave\workspace\Lucene-Solr-trunk-Windows\solr\build\solr-core\test\J0\.\solrtest-OverseerRolesTest-1391414268187
   [junit4]   2> 3356715 T10752 oasc.ZkTestServer.run STARTING ZK TEST SERVER
   [junit4]   2> 3356716 T10753 oasc.ZkTestServer$ZKServerMain.runFromConfig Starting server
   [junit4]   2> 3356812 T10752 oasc.ZkTestServer.run start zk server on port:62717
   [junit4]   2> 3356814 T10752 oascc.ConnectionManager.waitForConnected Waiting for client to connect to ZooKeeper
   [junit4]   2> 3356820 T10759 oascc.ConnectionManager.process Watcher org.apache.solr.common.cloud.ConnectionManager@3d4fbddd name:ZooKeeperConnection Watcher:127.0.0.1:62717 got event WatchedEvent state:SyncConnected type:None path:null path:null type:None
   [junit4]   2> 3356821 T10752 oascc.ConnectionManager.waitForConnected Client is connected to ZooKeeper
   [junit4]   2> 3356822 T10752 oascc.SolrZkClient.makePath makePath: /solr
   [junit4]   2> 3356828 T10754 oazs.NIOServerCnxn.doIO WARN caught end of stream exception EndOfStreamException: Unable to read additional data from client sessionid 0x143f6c0d1240000, likely client has closed socket
   [junit4]   2> 	at org.apache.zookeeper.server.NIOServerCnxn.doIO(NIOServerCnxn.java:220)
   [junit4]   2> 	at org.apache.zookeeper.server.NIOServerCnxnFactory.run(NIOServerCnxnFactory.java:208)
   [junit4]   2> 	at java.lang.Thread.run(Thread.java:744)
   [junit4]   2> 
   [junit4]   2> 3356830 T10752 oascc.ConnectionManager.waitForConnected Waiting for client to connect to ZooKeeper
   [junit4]   2> 3356835 T10761 oascc.ConnectionManager.process Watcher org.apache.solr.common.cloud.ConnectionManager@1cde766d name:ZooKeeperConnection Watcher:127.0.0.1:62717/solr got event WatchedEvent state:SyncConnected type:None path:null path:null type:None
   [junit4]   2> 3356836 T10752 oascc.ConnectionManager.waitForConnected Client is connected to ZooKeeper
   [junit4]   2> 3356836 T10752 oascc.SolrZkClient.makePath makePath: /collections/collection1
   [junit4]   2> 3356842 T10752 oascc.SolrZkClient.makePath makePath: /collections/collection1/shards
   [junit4]   2> 3356847 T10752 oascc.SolrZkClient.makePath makePath: /collections/control_collection
   [junit4]   2> 3356851 T10752 oascc.SolrZkClient.makePath makePath: /collections/control_collection/shards
   [junit4]   2> 3356855 T10752 oasc.AbstractZkTestCase.putConfig put C:\Users\JenkinsSlave\workspace\Lucene-Solr-trunk-Windows\solr\build\solr-core\test-files\solr\collection1\conf\solrconfig-tlog.xml to /configs/conf1/solrconfig.xml
   [junit4]   2> 3356855 T10752 oascc.SolrZkClient.makePath makePath: /configs/conf1/solrconfig.xml
   [junit4]   2> 3356865 T10752 oasc.AbstractZkTestCase.putConfig put C:\Users\JenkinsSlave\workspace\Lucene-Solr-trunk-Windows\solr\build\solr-core\test-files\solr\collection1\conf\schema.xml to /configs/conf1/schema.xml
   [junit4]   2> 3356866 T10752 oascc.SolrZkClient.makePath makePath: /configs/conf1/schema.xml
   [junit4]   2> 3356870 T10752 oasc.AbstractZkTestCase.putConfig put C:\Users\JenkinsSlave\workspace\Lucene-Solr-trunk-Windows\solr\build\solr-core\test-files\solr\collection1\conf\solrconfig.snippet.randomindexconfig.xml to /configs/conf1/solrconfig.snippet.randomindexconfig.xml
   [junit4]   2> 3356870 T10752 oascc.SolrZkClient.makePath makePath: /configs/conf1/solrconfig.snippet.randomindexconfig.xml
   [junit4]   2> 3356876 T10752 oasc.AbstractZkTestCase.putConfig put C:\Users\JenkinsSlave\workspace\Lucene-Solr-trunk-Windows\solr\build\solr-core\test-files\solr\collection1\conf\stopwords.txt to /configs/conf1/stopwords.txt
   [junit4]   2> 3356877 T10752 oascc.SolrZkClient.makePath makePath: /configs/conf1/stopwords.txt
   [junit4]   2> 3356882 T10752 oasc.AbstractZkTestCase.putConfig put C:\Users\JenkinsSlave\workspace\Lucene-Solr-trunk-Windows\solr\build\solr-core\test-files\solr\collection1\conf\protwords.txt to /configs/conf1/protwords.txt
   [junit4]   2> 3356882 T10752 oascc.SolrZkClient.makePath makePath: /configs/conf1/protwords.txt
   [junit4]   2> 3356887 T10752 oasc.AbstractZkTestCase.putConfig put C:\Users\JenkinsSlave\workspace\Lucene-Solr-trunk-Windows\solr\build\solr-core\test-files\solr\collection1\conf\currency.xml to /configs/conf1/currency.xml
   [junit4]   2> 3356888 T10752 oascc.SolrZkClient.makePath makePath: /configs/conf1/currency.xml
   [junit4]   2> 3356893 T10752 oasc.AbstractZkTestCase.putConfig put C:\Users\JenkinsSlave\workspace\Lucene-Solr-trunk-Windows\solr\build\solr-core\test-files\solr\collection1\conf\enumsConfig.xml to /configs/conf1/enumsConfig.xml
   [junit4]   2> 3356894 T10752 oascc.SolrZkClient.makePath makePath: /configs/conf1/enumsConfig.xml
   [junit4]   2> 3356897 T10752 oasc.AbstractZkTestCase.putConfig put C:\Users\JenkinsSlave\workspace\Lucene-Solr-trunk-Windows\solr\build\solr-core\test-files\solr\collection1\conf\open-exchange-rates.json to /configs/conf1/open-exchange-rates.json
   [junit4]   2> 3356898 T10752 oascc.SolrZkClient.makePath makePath: /configs/conf1/open-exchange-rates.json
   [junit4]   2> 3356903 T10752 oasc.AbstractZkTestCase.putConfig put C:\Users\JenkinsSlave\workspace\Lucene-Solr-trunk-Windows\solr\build\solr-core\test-files\solr\collection1\conf\mapping-ISOLatin1Accent.txt to /configs/conf1/mapping-ISOLatin1Accent.txt
   [junit4]   2> 3356903 T10752 oascc.SolrZkClient.makePath makePath: /configs/conf1/mapping-ISOLatin1Accent.txt
   [junit4]   2> 3356907 T10752 oasc.AbstractZkTestCase.putConfig put C:\Users\JenkinsSlave\workspace\Lucene-Solr-trunk-Windows\solr\build\solr-core\test-files\solr\collection1\conf\old_synonyms.txt to /configs/conf1/old_synonyms.txt
   [junit4]   2> 3356908 T10752 oascc.SolrZkClient.makePath makePath: /configs/conf1/old_synonyms.txt
   [junit4]   2> 3356913 T10752 oasc.AbstractZkTestCase.putConfig put C:\Users\JenkinsSlave\workspace\Lucene-Solr-trunk-Windows\solr\build\solr-core\test-files\solr\collection1\conf\synonyms.txt to /configs/conf1/synonyms.txt
   [junit4]   2> 3356913 T10752 oascc.SolrZkClient.makePath makePath: /configs/conf1/synonyms.txt
   [junit4]   2> 3356920 T10754 oazs.NIOServerCnxn.doIO WARN caught end of stream exception EndOfStreamException: Unable to read additional data from client sessionid 0x143f6c0d1240001, likely client has closed socket
   [junit4]   2> 	at org.apache.zookeeper.server.NIOServerCnxn.doIO(NIOServerCnxn.java:220)
   [junit4]   2> 	at org.apache.zookeeper.server.NIOServerCnxnFactory.run(NIOServerCnxnFactory.java:208)
   [junit4]   2> 	at java.lang.Thread.run(Thread.java:744)
   [junit4]   2> 
   [junit4]   2> 3357377 T10752 oejs.Server.doStart jetty-8.1.10.v20130312
   [junit4]   2> 3357405 T10752 oejs.AbstractConnector.doStart Started SelectChannelConnector@127.0.0.1:62724
   [junit4]   2> 3357405 T10752 oass.SolrDispatchFilter.init SolrDispatchFilter.init()
   [junit4]   2> 3357406 T10752 oasc.SolrResourceLoader.locateSolrHome JNDI not configured for solr (NoInitialContextEx)
   [junit4]   2> 3357406 T10752 oasc.SolrResourceLoader.locateSolrHome using system property solr.solr.home: .\org.apache.solr.cloud.OverseerRolesTest-controljetty-1391414268393
   [junit4]   2> 3357406 T10752 oasc.SolrResourceLoader.<init> new SolrResourceLoader for directory: '.\org.apache.solr.cloud.OverseerRolesTest-controljetty-1391414268393\'
   [junit4]   2> 3357445 T10752 oasc.ConfigSolr.fromFile Loading container configuration from C:\Users\JenkinsSlave\workspace\Lucene-Solr-trunk-Windows\solr\build\solr-core\test\J0\.\org.apache.solr.cloud.OverseerRolesTest-controljetty-1391414268393\solr.xml
   [junit4]   2> 3357532 T10752 oasc.ConfigSolrXml.<init> Config-defined core root directory: 
   [junit4]   2> 3357533 T10752 oasc.CoreContainer.<init> New CoreContainer 2037566211
   [junit4]   2> 3357533 T10752 oasc.CoreContainer.load Loading cores into CoreContainer [instanceDir=.\org.apache.solr.cloud.OverseerRolesTest-controljetty-1391414268393\]
   [junit4]   2> 3357535 T10752 oashc.HttpShardHandlerFactory.getParameter Setting socketTimeout to: 90000
   [junit4]   2> 3357535 T10752 oashc.HttpShardHandlerFactory.getParameter Setting urlScheme to: http://
   [junit4]   2> 3357535 T10752 oashc.HttpShardHandlerFactory.getParameter Setting connTimeout to: 15000
   [junit4]   2> 3357537 T10752 oashc.HttpShardHandlerFactory.getParameter Setting maxConnectionsPerHost to: 20
   [junit4]   2> 3357537 T10752 oashc.HttpShardHandlerFactory.getParameter Setting corePoolSize to: 0
   [junit4]   2> 3357537 T10752 oashc.HttpShardHandlerFactory.getParameter Setting maximumPoolSize to: 2147483647
   [junit4]   2> 3357538 T10752 oashc.HttpShardHandlerFactory.getParameter Setting maxThreadIdleTime to: 5
   [junit4]   2> 3357538 T10752 oashc.HttpShardHandlerFactory.getParameter Setting sizeOfQueue to: -1
   [junit4]   2> 3357538 T10752 oashc.HttpShardHandlerFactory.getParameter Setting fairnessPolicy to: false
   [junit4]   2> 3357543 T10752 oasl.LogWatcher.createWatcher SLF4J impl is org.slf4j.impl.Log4jLoggerFactory
   [junit4]   2> 3357544 T10752 oasl.LogWatcher.newRegisteredLogWatcher Registering Log Listener [Log4j (org.slf4j.impl.Log4jLoggerFactory)]
   [junit4]   2> 3357544 T10752 oasc.CoreContainer.load Host Name: 127.0.0.1
   [junit4]   2> 3357544 T10752 oasc.ZkContainer.initZooKeeper Zookeeper client=127.0.0.1:62717/solr
   [junit4]   2> 3357545 T10752 oasc.ZkController.checkChrootPath zkHost includes chroot
   [junit4]   2> 3357546 T10752 oascc.ConnectionManager.waitForConnected Waiting for client to connect to ZooKeeper
   [junit4]   2> 3357556 T10772 oascc.ConnectionManager.process Watcher org.apache.solr.common.cloud.ConnectionManager@5f6e703f name:ZooKeeperConnection Watcher:127.0.0.1:62717 got event WatchedEvent state:SyncConnected type:None path:null path:null type:None
   [junit4]   2> 3357557 T10752 oascc.ConnectionManager.waitForConnected Client is connected to ZooKeeper
   [junit4]   2> 3357565 T10752 oascc.ConnectionManager.waitForConnected Waiting for client to connect to ZooKeeper
   [junit4]   2> 3357569 T10774 oascc.ConnectionManager.process Watcher org.apache.solr.common.cloud.ConnectionManager@64a98bf4 name:ZooKeeperConnection Watcher:127.0.0.1:62717/solr got event WatchedEvent state:SyncConnected type:None path:null path:null type:None
   [junit4]   2> 3357569 T10752 oascc.ConnectionManager.waitForConnected Client is connected to ZooKeeper
   [junit4]   2> 3357571 T10752 oascc.SolrZkClient.makePath makePath: /overseer/queue
   [junit4]   2> 3357578 T10752 oascc.SolrZkClient.makePath makePath: /overseer/collection-queue-work
   [junit4]   2> 3357584 T10752 oascc.SolrZkClient.makePath makePath: /live_nodes
   [junit4]   2> 3357586 T10752 oasc.ZkController.createEphemeralLiveNode Register node as live in ZooKeeper:/live_nodes/127.0.0.1:62724_
   [junit4]   2> 3357587 T10752 oascc.SolrZkClient.makePath makePath: /live_nodes/127.0.0.1:62724_
   [junit4]   2> 3357592 T10752 oascc.SolrZkClient.makePath makePath: /overseer_elect
   [junit4]   2> 3357596 T10752 oascc.SolrZkClient.makePath makePath: /overseer_elect/election
   [junit4]   2> 3357602 T10752 oasc.OverseerElectionContext.runLeaderProcess I am going to be the leader 127.0.0.1:62724_
   [junit4]   2> 3357602 T10752 oascc.SolrZkClient.makePath makePath: /overseer_elect/leader
   [junit4]   2> 3357606 T10752 oasc.Overseer.start Overseer (id=91187725480493059-127.0.0.1:62724_-n_0000000000) starting
   [junit4]   2> 3357610 T10752 oascc.SolrZkClient.makePath makePath: /overseer/queue-work
   [junit4]   2> 3357617 T10776 oasc.OverseerCollectionProcessor.run Process current queue of collection creations
   [junit4]   2> 3357618 T10752 oascc.SolrZkClient.makePath makePath: /clusterstate.json
   [junit4]   2> 3357618 T10776 oasc.OverseerCollectionProcessor.prioritizeOverseerNodes prioritizing overseer nodes
   [junit4]   2> 3357621 T10752 oascc.SolrZkClient.makePath makePath: /aliases.json
   [junit4]   2> 3357623 T10752 oascc.ZkStateReader.createClusterStateWatchersAndUpdate Updating cluster state from ZooKeeper... 
   [junit4]   2> 3357628 T10775 oasc.Overseer$ClusterStateUpdater.run Starting to work on the main queue
   [junit4]   2> 3357632 T10752 oasc.CorePropertiesLocator.discover Looking for core definitions underneath C:\Users\JenkinsSlave\workspace\Lucene-Solr-trunk-Windows\solr\build\solr-core\test\J0\.\org.apache.solr.cloud.OverseerRolesTest-controljetty-1391414268393
   [junit4]   2> 3357845 T10752 oasc.CorePropertiesLocator.discoverUnder Found core conf in C:\Users\JenkinsSlave\workspace\Lucene-Solr-trunk-Windows\solr\build\solr-core\test\J0\.\org.apache.solr.cloud.OverseerRolesTest-controljetty-1391414268393\conf\
   [junit4]   2> 3357858 T10752 oasc.CorePropertiesLocator.discover Found 1 core definitions
   [junit4]   2> 3357859 T10752 oass.SolrDispatchFilter.init user.dir=C:\Users\JenkinsSlave\workspace\Lucene-Solr-trunk-Windows\solr\build\solr-core\test\J0
   [junit4]   2> 3357860 T10752 oass.SolrDispatchFilter.init SolrDispatchFilter.init() done
   [junit4]   2> 3357862 T10752 oascc.ConnectionManager.waitForConnected Waiting for client to connect to ZooKeeper
   [junit4]   2> 3357866 T10779 oascc.ConnectionManager.process Watcher org.apache.solr.common.cloud.ConnectionManager@7bcd5ef0 name:ZooKeeperConnection Watcher:127.0.0.1:62717/solr got event WatchedEvent state:SyncConnected type:None path:null path:null type:None
   [junit4]   2> 3357866 T10752 oascc.ConnectionManager.waitForConnected Client is connected to ZooKeeper
   [junit4]   2> 3357868 T10752 oascc.ZkStateReader.createClusterStateWatchersAndUpdate Updating cluster state from ZooKeeper... 
   [junit4]   2> 3357872 T10752 oasc.ChaosMonkey.monkeyLog monkey: init - expire sessions:false cause connection loss:false
   [junit4]   2> 3358304 T10752 oasc.AbstractFullDistribZkTestBase.createJettys create jetty 1
   [junit4]   2> 3358304 T10752 oejs.Server.doStart jetty-8.1.10.v20130312
   [junit4]   2> 3358308 T10752 oejs.AbstractConnector.doStart Started SelectChannelConnector@127.0.0.1:62736
   [junit4]   2> 3358309 T10752 oass.SolrDispatchFilter.init SolrDispatchFilter.init()
   [junit4]   2> 3358309 T10752 oasc.SolrResourceLoader.locateSolrHome JNDI not configured for solr (NoInitialContextEx)
   [junit4]   2> 3358310 T10752 oasc.SolrResourceLoader.locateSolrHome using system property solr.solr.home: .\org.apache.solr.cloud.OverseerRolesTest-jetty1-1391414269345
   [junit4]   2> 3358310 T10752 oasc.SolrResourceLoader.<init> new SolrResourceLoader for directory: '.\org.apache.solr.cloud.OverseerRolesTest-jetty1-1391414269345\'
   [junit4]   2> 3358338 T10752 oasc.ConfigSolr.fromFile Loading container configuration from C:\Users\JenkinsSlave\workspace\Lucene-Solr-trunk-Windows\solr\build\solr-core\test\J0\.\org.apache.solr.cloud.OverseerRolesTest-jetty1-1391414269345\solr.xml
   [junit4]   2> 3358423 T10752 oasc.ConfigSolrXml.<init> Config-defined core root directory: 
   [junit4]   2> 3358423 T10752 oasc.CoreContainer.<init> New CoreContainer 1600480782
   [junit4]   2> 3358423 T10752 oasc.CoreContainer.load Loading cores into CoreContainer [instanceDir=.\org.apache.solr.cloud.OverseerRolesTest-jetty1-1391414269345\]
   [junit4]   2> 3358425 T10752 oashc.HttpShardHandlerFactory.getParameter Setting socketTimeout to: 90000
   [junit4]   2> 3358425 T10752 oashc.HttpShardHandlerFactory.getParameter Setting urlScheme to: http://
   [junit4]   2> 3358425 T10752 oashc.HttpShardHandlerFactory.getParameter Setting connTimeout to: 15000
   [junit4]   2> 3358425 T10752 oashc.HttpShardHandlerFactory.getParameter Setting maxConnectionsPerHost to: 20
   [junit4]   2> 3358426 T10752 oashc.HttpShardHandlerFactory.getParameter Setting corePoolSize to: 0
   [junit4]   2> 3358426 T10752 oashc.HttpShardHandlerFactory.getParameter Setting maximumPoolSize to: 2147483647
   [junit4]   2> 3358426 T10752 oashc.HttpShardHandlerFactory.getParameter Setting maxThreadIdleTime to: 5
   [junit4]   2> 3358426 T10752 oashc.HttpShardHandlerFactory.getParameter Setting sizeOfQueue to: -1
   [junit4]   2> 3358426 T10752 oashc.HttpShardHandlerFactory.getParameter Setting fairnessPolicy to: false
   [junit4]   2> 3358431 T10752 oasl.LogWatcher.createWatcher SLF4J impl is org.slf4j.impl.Log4jLoggerFactory
   [junit4]   2> 3358431 T10752 oasl.LogWatcher.newRegisteredLogWatcher Registering Log Listener [Log4j (org.slf4j.impl.Log4jLoggerFactory)]
   [junit4]   2> 3358431 T10752 oasc.CoreContainer.load Host Name: 127.0.0.1
   [junit4]   2> 3358433 T10752 oasc.ZkContainer.initZooKeeper Zookeeper client=127.0.0.1:62717/solr
   [junit4]   2> 3358433 T10752 oasc.ZkController.checkChrootPath zkHost includes chroot
   [junit4]   2> 3358436 T10752 oascc.ConnectionManager.waitForConnected Waiting for client to connect to ZooKeeper
   [junit4]   2> 3358449 T10790 oascc.ConnectionManager.process Watcher org.apache.solr.common.cloud.ConnectionManager@7a0f520f name:ZooKeeperConnection Watcher:127.0.0.1:62717 got event WatchedEvent state:SyncConnected type:None path:null path:null type:None
   [junit4]   2> 3358449 T10752 oascc.ConnectionManager.waitForConnected Client is connected to ZooKeeper
   [junit4]   2> 3358452 T10754 oazs.NIOServerCnxn.doIO WARN caught end of stream exception EndOfStreamException: Unable to read additional data from client sessionid 0x143f6c0d1240005, likely client has closed socket
   [junit4]   2> 	at org.apache.zookeeper.server.NIOServerCnxn.doIO(NIOServerCnxn.java:220)
   [junit4]   2> 	at org.apache.zookeeper.server.NIOServerCnxnFactory.run(NIOServerCnxnFactory.java:208)
   [junit4]   2> 	at java.lang.Thread.run(Thread.java:744)
   [junit4]   2> 
   [junit4]   2> 3358454 T10752 oascc.ConnectionManager.waitForConnected Waiting for client to connect to ZooKeeper
   [junit4]   2> 3358457 T10792 oascc.ConnectionManager.process Watcher org.apache.solr.common.cloud.ConnectionManager@695da5f4 name:ZooKeeperConnection Watcher:127.0.0.1:62717/solr got event WatchedEvent state:SyncConnected type:None path:null path:null type:None
   [junit4]   2> 3358457 T10752 oascc.ConnectionManager.waitForConnected Client is connected to ZooKeeper
   [junit4]   2> 3358465 T10752 oascc.ZkStateReader.createClusterStateWatchersAndUpdate Updating cluster state from ZooKeeper... 
   [junit4]   2> 3359421 T10752 oasc.ZkController.createEphemeralLiveNode Register node as live in ZooKeeper:/live_nodes/127.0.0.1:62736_
   [junit4]   2> 3359423 T10752 oascc.SolrZkClient.makePath makePath: /live_nodes/127.0.0.1:62736_
   [junit4]   2> 3359427 T10792 oascc.ZkStateReader$3.process Updating live nodes... (2)
   [junit4]   2> 3359428 T10774 oascc.ZkStateReader$3.process Updating live nodes... (2)
   [junit4]   2> 3359428 T10779 oascc.ZkStateReader$3.process Updating live nodes... (2)
   [junit4]   2> 3359437 T10752 oasc.CorePropertiesLocator.discover Looking for core definitions underneath C:\Users\JenkinsSlave\workspace\Lucene-Solr-trunk-Windows\solr\build\solr-core\test\J0\.\org.apache.solr.cloud.OverseerRolesTest-jetty1-1391414269345
   [junit4]   2> 3359668 T10752 oasc.CorePropertiesLocator.discoverUnder Found core conf in C:\Users\JenkinsSlave\workspace\Lucene-Solr-trunk-Windows\solr\build\solr-core\test\J0\.\org.apache.solr.cloud.OverseerRolesTest-jetty1-1391414269345\conf\
   [junit4]   2> 3359679 T10752 oasc.CorePropertiesLocator.discover Found 1 core definitions
   [junit4]   2> 3359681 T10752 oass.SolrDispatchFilter.init user.dir=C:\Users\JenkinsSlave\workspace\Lucene-Solr-trunk-Windows\solr\build\solr-core\test\J0
   [junit4]   2> 3359681 T10752 oass.SolrDispatchFilter.init SolrDispatchFilter.init() done
   [junit4]   2> 3360129 T10752 oasc.AbstractFullDistribZkTestBase.createJettys create jetty 2
   [junit4]   2> 3360133 T10752 oejs.Server.doStart jetty-8.1.10.v20130312
   [junit4]   2> 3360137 T10752 oejs.AbstractConnector.doStart Started SelectChannelConnector@127.0.0.1:62745
   [junit4]   2> 3360137 T10752 oass.SolrDispatchFilter.init SolrDispatchFilter.init()
   [junit4]   2> 3360137 T10752 oasc.SolrResourceLoader.locateSolrHome JNDI not configured for solr (NoInitialContextEx)
   [junit4]   2> 3360138 T10752 oasc.SolrResourceLoader.locateSolrHome using system property solr.solr.home: ..\..\..\..\..\..\..\..\..\Users\JenkinsSlave\workspace\Lucene-Solr-trunk-Windows\solr\build\solr-core\test\J0\.\org.apache.solr.cloud.OverseerRolesTest-jetty2-1391414271154
   [junit4]   2> 3360138 T10752 oasc.SolrResourceLoader.<init> new SolrResourceLoader for directory: '..\..\..\..\..\..\..\..\..\Users\JenkinsSlave\workspace\Lucene-Solr-trunk-Windows\solr\build\solr-core\test\J0\.\org.apache.solr.cloud.OverseerRolesTest-jetty2-1391414271154\'
   [junit4]   2> 3360164 T10752 oasc.ConfigSolr.fromFile Loading container configuration from C:\Users\JenkinsSlave\workspace\Lucene-Solr-trunk-Windows\solr\build\solr-core\test\J0\..\..\..\..\..\..\..\..\..\Users\JenkinsSlave\workspace\Lucene-Solr-trunk-Windows\solr\build\solr-core\test\J0\.\org.apache.solr.cloud.OverseerRolesTest-jetty2-1391414271154\solr.xml
   [junit4]   2> 3360247 T10752 oasc.ConfigSolrXml.<init> Config-defined core root directory: 
   [junit4]   2> 3360248 T10752 oasc.CoreContainer.<init> New CoreContainer 1115883289
   [junit4]   2> 3360248 T10752 oasc.CoreContainer.load Loading cores into CoreContainer [instanceDir=..\..\..\..\..\..\..\..\..\Users\JenkinsSlave\workspace\Lucene-Solr-trunk-Windows\solr\build\solr-core\test\J0\.\org.apache.solr.cloud.OverseerRolesTest-jetty2-1391414271154\]
   [junit4]   2> 3360250 T10752 oashc.HttpShardHandlerFactory.getParameter Setting socketTimeout to: 90000
   [junit4]   2> 3360251 T10752 oashc.HttpShardHandlerFactory.getParameter Setting urlScheme to: http://
   [junit4]   2> 3360251 T10752 oashc.HttpShardHandlerFactory.getParameter Setting connTimeout to: 15000
   [junit4]   2> 3360251 T10752 oashc.HttpShardHandlerFactory.getParameter Setting maxConnectionsPerHost to: 20
   [junit4]   2> 3360251 T10752 oashc.HttpShardHandlerFactory.getParameter Setting corePoolSize to: 0
   [junit4]   2> 3360252 T10752 oashc.HttpShardHandlerFactory.getParameter Setting maximumPoolSize to: 2147483647
   [junit4]   2> 3360252 T10752 oashc.HttpShardHandlerFactory.getParameter Setting maxThreadIdleTime to: 5
   [junit4]   2> 3360252 T10752 oashc.HttpShardHandlerFactory.getParameter Setting sizeOfQueue to: -1
   [junit4]   2> 3360253 T10752 oashc.HttpShardHandlerFactory.getParameter Setting fairnessPolicy to: false
   [junit4]   2> 3360256 T10752 oasl.LogWatcher.createWatcher SLF4J impl is org.slf4j.impl.Log4jLoggerFactory
   [junit4]   2> 3360256 T10752 oasl.LogWatcher.newRegisteredLogWatcher Registering Log Listener [Log4j (org.slf4j.impl.Log4jLoggerFactory)]
   [junit4]   2> 3360257 T10752 oasc.CoreContainer.load Host Name: 127.0.0.1
   [junit4]   2> 3360257 T10752 oasc.ZkContainer.initZooKeeper Zookeeper client=127.0.0.1:62717/solr
   [junit4]   2> 3360257 T10752 oasc.ZkController.checkChrootPath zkHost includes chroot
   [junit4]   2> 3360260 T10752 oascc.ConnectionManager.waitForConnected Waiting for client to connect to ZooKeeper
   [junit4]   2> 3360272 T10804 oascc.ConnectionManager.process Watcher org.apache.solr.common.cloud.ConnectionManager@28471c6c name:ZooKeeperConnection Watcher:127.0.0.1:62717 got event WatchedEvent state:SyncConnected type:None path:null path:null type:None
   [junit4]   2> 3360272 T10752 oascc.ConnectionManager.waitForConnected Client is connected to ZooKeeper
   [junit4]   2> 3360276 T10754 oazs.NIOServerCnxn.doIO WARN caught end of stream exception EndOfStreamException: Unable to read additional data from client sessionid 0x143f6c0d1240007, likely client has closed socket
   [junit4]   2> 	at org.apache.zookeeper.server.NIOServerCnxn.doIO(NIOServerCnxn.java:220)
   [junit4]   2> 	at org.apache.zookeeper.server.NIOServerCnxnFactory.run(NIOServerCnxnFactory.java:208)
   [junit4]   2> 	at java.lang.Thread.run(Thread.java:744)
   [junit4]   2> 
   [junit4]   2> 3360278 T10752 oascc.ConnectionManager.waitForConnected Waiting for client to connect to ZooKeeper
   [junit4]   2> 3360293 T10806 oascc.ConnectionManager.process Watcher org.apache.solr.common.cloud.ConnectionManager@4681d89e name:ZooKeeperConnection Watcher:127.0.0.1:62717/solr got event WatchedEvent state:SyncConnected type:None path:null path:null type:None
   [junit4]   2> 3360293 T10752 oascc.ConnectionManager.waitForConnected Client is connected to ZooKeeper
   [junit4]   2> 3360303 T10752 oascc.ZkStateReader.createClusterStateWatchersAndUpdate Updating cluster state from ZooKeeper... 
   [junit4]   2> 3361260 T10752 oasc.ZkController.createEphemeralLiveNode Register node as live in ZooKeeper:/live_nodes/127.0.0.1:62745_
   [junit4]   2> 3361263 T10752 oascc.SolrZkClient.makePath makePath: /live_nodes/127.0.0.1:62745_
   [junit4]   2> 3361268 T10806 oascc.ZkStateReader$3.process Updating live nodes... (3)
   [junit4]   2> 3361268 T10774 oascc.ZkStateReader$3.process Updating live nodes... (3)
   [junit4]   2> 3361269 T10792 oascc.ZkStateReader$3.process Updating live nodes... (3)
   [junit4]   2> 3361269 T10779 oascc.ZkStateReader$3.process Updating live nodes... (3)
   [junit4]   2> 3361277 T10752 oasc.CorePropertiesLocator.discover Looking for core definitions underneath C:\Users\JenkinsSlave\workspace\Lucene-Solr-trunk-Windows\solr\build\solr-core\test\J0\..\..\..\..\..\..\..\..\..\Users\JenkinsSlave\workspace\Lucene-Solr-trunk-Windows\solr\build\solr-core\test\J0\.\org.apache.solr.cloud.OverseerRolesTest-jetty2-1391414271154
   [junit4]   2> 3361502 T10752 oasc.CorePropertiesLocator.discoverUnder Found core conf in C:\Users\JenkinsSlave\workspace\Lucene-Solr-trunk-Windows\solr\build\solr-core\test\J0\..\..\..\..\..\..\..\..\..\Users\JenkinsSlave\workspace\Lucene-Solr-trunk-Windows\solr\build\solr-core\test\J0\.\org.apache.solr.cloud.OverseerRolesTest-jetty2-1391414271154\conf\
   [junit4]   2> 3361512 T10752 oasc.CorePropertiesLocator.discover Found 1 core definitions
   [junit4]   2> 3361514 T10752 oass.SolrDispatchFilter.init user.dir=C:\Users\JenkinsSlave\workspace\Lucene-Solr-trunk-Windows\solr\build\solr-core\test\J0
   [junit4]   2> 3361515 T10752 oass.SolrDispatchFilter.init SolrDispatchFilter.init() done
   [junit4]   2> 3361987 T10752 oasc.AbstractFullDistribZkTestBase.createJettys create jetty 3
   [junit4]   2> 3361988 T10752 oejs.Server.doStart jetty-8.1.10.v20130312
   [junit4]   2> 3361992 T10752 oejs.AbstractConnector.doStart Started SelectChannelConnector@127.0.0.1:62754
   [junit4]   2> 3361992 T10752 oass.SolrDispatchFilter.init SolrDispatchFilter.init()
   [junit4]   2> 3361992 T10752 oasc.SolrResourceLoader.locateSolrHome JNDI not configured for solr (NoInitialContextEx)
   [junit4]   2> 3361992 T10752 oasc.SolrResourceLoader.locateSolrHome using system property solr.solr.home: .\org.apache.solr.cloud.OverseerRolesTest-jetty3-1391414272988
   [junit4]   2> 3361992 T10752 oasc.SolrResourceLoader.<init> new SolrResourceLoader for directory: '.\org.apache.solr.cloud.OverseerRolesTest-jetty3-1391414272988\'
   [junit4]   2> 3362023 T10752 oasc.ConfigSolr.fromFile Loading container configuration from C:\Users\JenkinsSlave\workspace\Lucene-Solr-trunk-Windows\solr\build\solr-core\test\J0\.\org.apache.solr.cloud.OverseerRolesTest-jetty3-1391414272988\solr.xml
   [junit4]   2> 3362115 T10752 oasc.ConfigSolrXml.<init> Config-defined core root directory: 
   [junit4]   2> 3362115 T10752 oasc.CoreContainer.<init> New CoreContainer 1820514648
   [junit4]   2> 3362115 T10752 oasc.CoreContainer.load Loading cores into CoreContainer [instanceDir=.\org.apache.solr.cloud.OverseerRolesTest-jetty3-1391414272988\]
   [junit4]   2> 3362119 T10752 oashc.HttpShardHandlerFactory.getParameter Setting socketTimeout to: 90000
   [junit4]   2> 3362119 T10752 oashc.HttpShardHandlerFactory.getParameter Setting urlScheme to: http://
   [junit4]   2> 3362119 T10752 oashc.HttpShardHandlerFactory.getParameter Setting connTimeout to: 15000
   [junit4]   2> 3362119 T10752 oashc.HttpShardHandlerFactory.getParameter Setting maxConnectionsPerHost to: 20
   [junit4]   2> 3362119 T10752 oashc.HttpShardHandlerFactory.getParameter Setting corePoolSize to: 0
   [junit4]   2> 3362119 T10752 oashc.HttpShardHandlerFactory.getParameter Setting maximumPoolSize to: 2147483647
   [junit4]   2> 3362119 T10752 oashc.HttpShardHandlerFactory.getParameter Setting maxThreadIdleTime to: 5
   [junit4]   2> 3362119 T10752 oashc.HttpShardHandlerFactory.getParameter Setting sizeOfQueue to: -1
   [junit4]   2> 3362119 T10752 oashc.HttpShardHandlerFactory.getParameter Setting fairnessPolicy to: false
   [junit4]   2> 3362125 T10752 oasl.LogWatcher.createWatcher SLF4J impl is org.slf4j.impl.Log4jLoggerFactory
   [junit4]   2> 3362125 T10752 oasl.LogWatcher.newRegisteredLogWatcher Registering Log Listener [Log4j (org.slf4j.impl.Log4jLoggerFactory)]
   [junit4]   2> 3362125 T10752 oasc.CoreContainer.load Host Name: 127.0.0.1
   [junit4]   2> 3362125 T10752 oasc.ZkContainer.initZooKeeper Zookeeper client=127.0.0.1:62717/solr
   [junit4]   2> 3362125 T10752 oasc.ZkController.checkChrootPath zkHost includes chroot
   [junit4]   2> 3362129 T10752 oascc.ConnectionManager.waitForConnected Waiting for client to connect to ZooKeeper
   [junit4]   2> 3362144 T10818 oascc.ConnectionManager.process Watcher org.apache.solr.common.cloud.ConnectionManager@28b5810 name:ZooKeeperConnection Watcher:127.0.0.1:62717 got event WatchedEvent state:SyncConnected type:None path:null path:null type:None
   [junit4]   2> 3362145 T10752 oascc.ConnectionManager.waitForConnected Client is connected to ZooKeeper
   [junit4]   2> 3362155 T10752 oascc.ConnectionManager.waitForConnected Waiting for client to connect to ZooKeeper
   [junit4]   2> 3362159 T10820 oascc.ConnectionManager.process Watcher org.apache.solr.common.cloud.ConnectionManager@14641c89 name:ZooKeeperConnection Watcher:127.0.0.1:62717/solr got event WatchedEvent state:SyncConnected type:None path:null path:null type:None
   [junit4]   2> 3362159 T10752 oascc.ConnectionManager.waitForConnected Client is connected to ZooKeeper
   [junit4]   2> 3362168 T10752 oascc.ZkStateReader.createClusterStateWatchersAndUpdate Updating cluster state from ZooKeeper... 
   [junit4]   2> 3363222 T10752 oasc.ZkController.createEphemeralLiveNode Register node as live in ZooKeeper:/live_nodes/127.0.0.1:62754_
   [junit4]   2> 3363226 T10752 oascc.SolrZkClient.makePath makePath: /live_nodes/127.0.0.1:62754_
   [junit4]   2> 3363231 T10820 oascc.ZkStateReader$3.process Updating live nodes... (4)
   [junit4]   2> 3363231 T10792 oascc.ZkStateReader$3.process Updating live nodes... (4)
   [junit4]   2> 3363232 T10774 oascc.ZkStateReader$3.process Updating live nodes... (4)
   [junit4]   2> 3363232 T10779 oascc.ZkStateReader$3.process Updating live nodes... (4)
   [junit4]   2> 3363232 T10806 oascc.ZkStateReader$3.process Updating live nodes... (4)
   [junit4]   2> 3363245 T10752 oasc.CorePropertiesLocator.discover Looking for core definitions underneath C:\Users\JenkinsSlave\workspace\Lucene-Solr-trunk-Windows\solr\build\solr-core\test\J0\.\org.apache.solr.cloud.OverseerRolesTest-jetty3-1391414272988
   [junit4]   2> 3363492 T10752 oasc.CorePropertiesLocator.discoverUnder Found core conf in C:\Users\JenkinsSlave\workspace\Lucene-Solr-trunk-Windows\solr\build\solr-core\test\J0\.\org.apache.solr.cloud.OverseerRolesTest-jetty3-1391414272988\conf\
   [junit4]   2> 3363504 T10752 oasc.CorePropertiesLocator.discover Found 1 core definitions
   [junit4]   2> 3363505 T10752 oass.SolrDispatchFilter.init user.dir=C:\Users\JenkinsSlave\workspace\Lucene-Solr-trunk-Windows\solr\build\solr-core\test\J0
   [junit4]   2> 3363505 T10752 oass.SolrDispatchFilter.init SolrDispatchFilter.init() done
   [junit4]   2> 3364010 T10752 oasc.AbstractFullDistribZkTestBase.createJettys create jetty 4
   [junit4]   2> 3364011 T10752 oejs.Server.doStart jetty-8.1.10.v20130312
   [junit4]   2> 3364015 T10752 oejs.AbstractConnector.doStart Started SelectChannelConnector@127.0.0.1:62764
   [junit4]   2> 3364015 T10752 oass.SolrDispatchFilter.init SolrDispatchFilter.init()
   [junit4]   2> 3364015 T10752 oasc.SolrResourceLoader.locateSolrHome JNDI not configured for solr (NoInitialContextEx)
   [junit4]   2> 3364015 T10752 oasc.SolrResourceLoader.locateSolrHome using system property solr.solr.home: ..\..\..\..\..\..\..\..\..\Users\JenkinsSlave\workspace\Lucene-Solr-trunk-Windows\solr\build\solr-core\test\J0\.\org.apache.solr.cloud.OverseerRolesTest-jetty4-1391414274978
   [junit4]   2> 3364015 T10752 oasc.SolrResourceLoader.<init> new SolrResourceLoader for directory: '..\..\..\..\..\..\..\..\..\Users\JenkinsSlave\workspace\Lucene-Solr-trunk-Windows\solr\build\solr-core\test\J0\.\org.apache.solr.cloud.OverseerRolesTest-jetty4-1391414274978\'
   [junit4]   2> 3364045 T10752 oasc.ConfigSolr.fromFile Loading container configuration from C:\Users\JenkinsSlave\workspace\Lucene-Solr-trunk-Windows\solr\build\solr-core\test\J0\..\..\..\..\..\..\..\..\..\Users\JenkinsSlave\workspace\Lucene-Solr-trunk-Windows\solr\build\solr-core\test\J0\.\org.apache.solr.cloud.OverseerRolesTest-jetty4-1391414274978\solr.xml
   [junit4]   2> 3364133 T10752 oasc.ConfigSolrXml.<init> Config-defined core root directory: 
   [junit4]   2> 3364134 T10752 oasc.CoreContainer.<init> New CoreContainer 563196249
   [junit4]   2> 3364134 T10752 oasc.CoreContainer.load Loading cores into CoreContainer [instanceDir=..\..\..\..\..\..\..\..\..\Users\JenkinsSlave\workspace\Lucene-Solr-trunk-Windows\solr\build\solr-core\test\J0\.\org.apache.solr.cloud.OverseerRolesTest-jetty4-1391414274978\]
   [junit4]   2> 3364136 T10752 oashc.HttpShardHandlerFactory.getParameter Setting socketTimeout to: 90000
   [junit4]   2> 3364137 T10752 oashc.HttpShardHandlerFactory.getParameter Setting urlScheme to: http://
   [junit4]   2> 3364137 T10752 oashc.HttpShardHandlerFactory.getParameter Setting connTimeout to: 15000
   [junit4]   2> 3364137 T10752 oashc.HttpShardHandlerFactory.getParameter Setting maxConnectionsPerHost to: 20
   [junit4]   2> 3364137 T10752 oashc.HttpShardHandlerFactory.getParameter Setting corePoolSize to: 0
   [junit4]   2> 3364137 T10752 oashc.HttpShardHandlerFactory.getParameter Setting maximumPoolSize to: 2147483647
   [junit4]   2> 3364139 T10752 oashc.HttpShardHandlerFactory.getParameter Setting maxThreadIdleTime to: 5
   [junit4]   2> 3364139 T10752 oashc.HttpShardHandlerFactory.getParameter Setting sizeOfQueue to: -1
   [junit4]   2> 3364139 T10752 oashc.HttpShardHandlerFactory.getParameter Setting fairnessPolicy to: false
   [junit4]   2> 3364146 T10752 oasl.LogWatcher.createWatcher SLF4J impl is org.slf4j.impl.Log4jLoggerFactory
   [junit4]   2> 3364146 T10752 oasl.LogWatcher.newRegisteredLogWatcher Registering Log Listener [Log4j (org.slf4j.impl.Log4jLoggerFactory)]
   [junit4]   2> 3364146 T10752 oasc.CoreContainer.load Host Name: 127.0.0.1
   [junit4]   2> 3364146 T10752 oasc.ZkContainer.initZooKeeper Zookeeper client=127.0.0.1:62717/solr
   [junit4]   2> 3364148 T10752 oasc.ZkController.checkChrootPath zkHost includes chroot
   [junit4]   2> 3364151 T10752 oascc.ConnectionManager.waitForConnected Waiting for client to connect to ZooKeeper
   [junit4]   2> 3364155 T10833 oascc.ConnectionManager.process Watcher org.apache.solr.common.cloud.ConnectionManager@64125b46 name:ZooKeeperConnection Watcher:127.0.0.1:62717 got event WatchedEvent state:SyncConnected type:None path:null path:null type:None
   [junit4]   2> 3364157 T10752 oascc.ConnectionManager.waitForConnected Client is connected to ZooKeeper
   [junit4]   2> 3364163 T10752 oascc.ConnectionManager.waitForConnected Waiting for client to connect to ZooKeeper
   [junit4]   2> 3364169 T10835 oascc.ConnectionManager.process Watcher org.apache.solr.common.cloud.ConnectionManager@5cf96b6e name:ZooKeeperConnection Watcher:127.0.0.1:62717/solr got event WatchedEvent state:SyncConnected type:None path:null path:null type:None
   [junit4]   2> 3364169 T10752 oascc.ConnectionManager.waitForConnected Client is connected to ZooKeeper
   [junit4]   2> 3364179 T10752 oascc.ZkStateReader.createClusterStateWatchersAndUpdate Updating cluster state from ZooKeeper... 
   [junit4]   2> 3365231 T10752 oasc.ZkController.createEphemeralLiveNode Register node as live in ZooKeeper:/live_nodes/127.0.0.1:62764_
   [junit4]   2> 3365234 T10752 oascc.SolrZkClient.makePath makePath: /live_nodes/127.0.0.1:62764_
   [junit4]   2> 3365240 T10820 oascc.ZkStateReader$3.process Updating live nodes... (5)
   [junit4]   2> 3365240 T10835 oascc.ZkStateReader$3.process Updating live nodes... (5)
   [junit4]   2> 3365240 T10779 oascc.ZkStateReader$3.process Updating live nodes... (5)
   [junit4]   2> 3365241 T10792 oascc.ZkStateReader$3.process Updating live nodes... (5)
   [junit4]   2> 3365241 T10774 oascc.ZkStateReader$3.process Updating live nodes... (5)
   [junit4]   2> 3365242 T10806 oascc.ZkStateReader$3.process Updating live nodes... (5)
   [junit4]   2> 3365253 T10752 oasc.CorePropertiesLocator.discover Looking for core definitions underneath C:\Users\JenkinsSlave\workspace\Lucene-Solr-trunk-Windows\solr\build\solr-core\test\J0\..\..\..\..\..\..\..\..\..\Users\JenkinsSlave\workspace\Lucene-Solr-trunk-Windows\solr\build\solr-core\test\J0\.\org.apache.solr.cloud.OverseerRolesTest-jetty4-1391414274978
   [junit4]   2> 3365533 T10752 oasc.CorePropertiesLocator.discoverUnder Found core conf in C:\Users\JenkinsSlave\workspace\Lucene-Solr-trunk-Windows\solr\build\solr-core\test\J0\..\..\..\..\..\..\..\..\..\Users\JenkinsSlave\workspace\Lucene-Solr-trunk-Windows\solr\build\solr-core\test\J0\.\org.apache.solr.cloud.OverseerRolesTest-jetty4-1391414274978\conf\
   [junit4]   2> 3365548 T10752 oasc.CorePropertiesLocator.discover Found 1 core definitions
   [junit4]   2> 3365549 T10752 oass.SolrDispatchFilter.init user.dir=C:\Users\JenkinsSlave\workspace\Lucene-Solr-trunk-Windows\solr\build\solr-core\test\J0
   [junit4]   2> 3365549 T10752 oass.SolrDispatchFilter.init SolrDispatchFilter.init() done
   [junit4]   2> 3366063 T10752 oasc.AbstractFullDistribZkTestBase.createJettys create jetty 5
   [junit4]   2> 3366065 T10752 oejs.Server.doStart jetty-8.1.10.v20130312
   [junit4]   2> 3366070 T10752 oejs.AbstractConnector.doStart Started SelectChannelConnector@127.0.0.1:62773
   [junit4]   2> 3366071 T10752 oass.SolrDispatchFilter.init SolrDispatchFilter.init()
   [junit4]   2> 3366072 T10752 oasc.SolrResourceLoader.locateSolrHome JNDI not configured for solr (NoInitialContextEx)
   [junit4]   2> 3366072 T10752 oasc.SolrResourceLoader.locateSolrHome using system property solr.solr.home: .\org.apache.solr.cloud.OverseerRolesTest-jetty5-1391414277022
   [junit4]   2> 3366073 T10752 oasc.SolrResourceLoader.<init> new SolrResourceLoader for directory: '.\org.apache.solr.cloud.OverseerRolesTest-jetty5-1391414277022\'
   [junit4]   2> 3366104 T10752 oasc.ConfigSolr.fromFile Loading container configuration from C:\Users\JenkinsSlave\workspace\Lucene-Solr-trunk-Windows\solr\build\solr-core\test\J0\.\org.apache.solr.cloud.OverseerRolesTest-jetty5-1391414277022\solr.xml
   [junit4]   2> 3366207 T10752 oasc.ConfigSolrXml.<init> Config-defined core root directory: 
   [junit4]   2> 3366208 T10752 oasc.CoreContainer.<init> New CoreContainer 536884262
   [junit4]   2> 3366208 T10752 oasc.CoreContainer.load Loading cores into CoreContainer [instanceDir=.\org.apache.solr.cloud.OverseerRolesTest-jetty5-1391414277022\]
   [junit4]   2> 3366210 T10752 oashc.HttpShardHandlerFactory.getParameter Setting socketTimeout to: 90000
   [junit4]   2> 3366211 T10752 oashc.HttpShardHandlerFactory.getParameter Setting urlScheme to: http://
   [junit4]   2> 3366211 T10752 oashc.HttpShardHandlerFactory.getParameter Setting connTimeout to: 15000
   [junit4]   2> 3366211 T10752 oashc.HttpShardHandlerFactory.getParameter Setting maxConnectionsPerHost to: 20
   [junit4]   2> 3366212 T10752 oashc.HttpShardHandlerFactory.getParameter Setting corePoolSize to: 0
   [junit4]   2> 3366212 T10752 oashc.HttpShardHandlerFactory.getParameter Setting maximumPoolSize to: 2147483647
   [junit4]   2> 3366212 T10752 oashc.HttpShardHandlerFactory.getParameter Setting maxThreadIdleTime to: 5
   [junit4]   2> 3366212 T10752 oashc.HttpShardHandlerFactory.getParameter Setting sizeOfQueue to: -1
   [junit4]   2> 3366213 T10752 oashc.HttpShardHandlerFactory.getParameter Setting fairnessPolicy to: false
   [junit4]   2> 3366217 T10752 oasl.LogWatcher.createWatcher SLF4J impl is org.slf4j.impl.Log4jLoggerFactory
   [junit4]   2> 3366218 T10752 oasl.LogWatcher.newRegisteredLogWatcher Registering Log Listener [Log4j (org.slf4j.impl.Log4jLoggerFactory)]
   [junit4]   2> 3366218 T10752 oasc.CoreContainer.load Host Name: 127.0.0.1
   [junit4]   2> 3366218 T10752 oasc.ZkContainer.initZooKeeper Zookeeper client=127.0.0.1:62717/solr
   [junit4]   2> 3366219 T10752 oasc.ZkController.checkChrootPath zkHost includes chroot
   [junit4]   2> 3366221 T10752 oascc.ConnectionManager.waitForConnected Waiting for client to connect to ZooKeeper
   [junit4]   2> 3366237 T10849 oascc.ConnectionManager.process Watcher org.apache.solr.common.cloud.ConnectionManager@6d5fbb33 name:ZooKeeperConnection Watcher:127.0.0.1:62717 got event WatchedEvent state:SyncConnected type:None path:null path:null type:None
   [junit4]   2> 3366237 T10752 oascc.ConnectionManager.waitForConnected Client is connected to ZooKeeper
   [junit4]   2> 3366242 T10752 oascc.ConnectionManager.waitForConnected Waiting for client to connect to ZooKeeper
   [junit4]   2> 3366247 T10851 oascc.ConnectionManager.process Watcher org.apache.solr.common.cloud.ConnectionManager@436f8f2f name:ZooKeeperConnection Watcher:127.0.0.1:62717/solr got event WatchedEvent state:SyncConnected type:None path:null path:null type:None
   [junit4]   2> 3366247 T10752 oascc.ConnectionManager.waitForConnected Client is connected to ZooKeeper
   [junit4]   2> 3366257 T10752 oascc.ZkStateReader.createClusterStateWatchersAndUpdate Updating cluster state from ZooKeeper... 
   [junit4]   2> 3367309 T10752 oasc.ZkController.createEphemeralLiveNode Register node as live in ZooKeeper:/live_nodes/127.0.0.1:62773_
   [junit4]   2> 3367312 T10752 oascc.SolrZkClient.makePath makePath: /live_nodes/127.0.0.1:62773_
   [junit4]   2> 3367318 T10779 oascc.ZkStateReader$3.process Updating live nodes... (6)
   [junit4]   2> 3367318 T10835 oascc.ZkStateReader$3.process Updating live nodes... (6)
   [junit4]   2> 3367318 T10851 oascc.ZkStateReader$3.process Updating live nodes... (6)
   [junit4]   2> 3367319 T10774 oascc.ZkStateReader$3.process Updating live nodes... (6)
   [junit4]   2> 3367320 T10806 oascc.ZkStateReader$3.process Updating live nodes... (6)
   [junit4]   2> 3367320 T10792 oascc.ZkStateReader$3.process Updating live nodes... (6)
   [junit4]   2> 3367320 T10820 oascc.ZkStateReader$3.process Updating live nodes... (6)
   [junit4]   2> 3367329 T10752 oasc.CorePropertiesLocator.discover Looking for core definitions underneath C:\Users\JenkinsSlave\workspace\Lucene-Solr-trunk-Windows\solr\build\solr-core\test\J0\.\org.apache.solr.cloud.OverseerRolesTest-jetty5-1391414277022
   [junit4]   2> 3367554 T10752 oasc.CorePropertiesLocator.discoverUnder Found core conf in C:\Users\JenkinsSlave\workspace\Lucene-Solr-trunk-Windows\solr\build\solr-core\test\J0\.\org.apache.solr.cloud.OverseerRolesTest-jetty5-1391414277022\conf\
   [junit4]   2> 3367565 T10752 oasc.CorePropertiesLocator.discover Found 1 core definitions
   [junit4]   2> 3367568 T10752 oass.SolrDispatchFilter.init user.dir=C:\Users\JenkinsSlave\workspace\Lucene-Solr-trunk-Windows\solr\build\solr-core\test\J0
   [junit4]   2> 3367568 T10752 oass.SolrDispatchFilter.init SolrDispatchFilter.init() done
   [junit4]   2> 3368126 T10752 oasc.AbstractFullDistribZkTestBase.createJettys create jetty 6
   [junit4]   2> 3368126 T10752 oejs.Server.doStart jetty-8.1.10.v20130312
   [junit4]   2> 3368131 T10752 oejs.AbstractConnector.doStart Started SelectChannelConnector@127.0.0.1:62782
   [junit4]   2> 3368132 T10752 oass.SolrDispatchFilter.init SolrDispatchFilter.init()
   [junit4]   2> 3368132 T10752 oasc.SolrResourceLoader.locateSolrHome JNDI not configured for solr (NoInitialContextEx)
   [junit4]   2> 3368132 T10752 oasc.SolrResourceLoader.locateSolrHome using system property solr.solr.home: ..\..\..\..\..\..\..\..\..\Users\JenkinsSlave\workspace\Lucene-Solr-trunk-Windows\solr\build\solr-core\test\J0\.\org.apache.solr.cloud.OverseerRolesTest-jetty6-1391414279041
   [junit4]   2> 3368132 T10752 oasc.SolrResourceLoader.<init> new SolrResourceLoader for directory: '..\..\..\..\..\..\..\..\..\Users\JenkinsSlave\workspace\Lucene-Solr-trunk-Windows\solr\build\solr-core\test\J0\.\org.apache.solr.cloud.OverseerRolesTest-jetty6-1391414279041\'
   [junit4]   2> 3368163 T10752 oasc.ConfigSolr.fromFile Loading container configuration from C:\Users\JenkinsSlave\workspace\Lucene-Solr-trunk-Windows\solr\build\solr-core\test\J0\..\..\..\..\..\..\..\..\..\Users\JenkinsSlave\workspace\Lucene-Solr-trunk-Windows\solr\build\solr-core\test\J0\.\org.apache.solr.cloud.OverseerRolesTest-jetty6-1391414279041\solr.xml
   [junit4]   2> 3368259 T10752 oasc.ConfigSolrXml.<init> Config-defined core root directory: 
   [junit4]   2> 3368260 T10752 oasc.CoreContainer.<init> New CoreContainer 886378915
   [junit4]   2> 3368260 T10752 oasc.CoreContainer.load Loading cores into CoreContainer [instanceDir=..\..\..\..\..\..\..\..\..\Users\JenkinsSlave\workspace\Lucene-Solr-trunk-Windows\solr\build\solr-core\test\J0\.\org.apache.solr.cloud.OverseerRolesTest-jetty6-1391414279041\]
   [junit4]   2> 3368263 T10752 oashc.HttpShardHandlerFactory.getParameter Setting socketTimeout to: 90000
   [junit4]   2> 3368265 T10752 oashc.HttpShardHandlerFactory.getParameter Setting urlScheme to: http://
   [junit4]   2> 3368265 T10752 oashc.HttpShardHandlerFactory.getParameter Setting connTimeout to: 15000
   [junit4]   2> 3368266 T10752 oashc.HttpShardHandlerFactory.getParameter Setting maxConnectionsPerHost to: 20
   [junit4]   2> 3368266 T10752 oashc.HttpShardHandlerFactory.getParameter Setting corePoolSize to: 0
   [junit4]   2> 3368267 T10752 oashc.HttpShardHandlerFactory.getParameter Setting maximumPoolSize to: 2147483647
   [junit4]   2> 3368267 T10752 oashc.HttpShardHandlerFactory.getParameter Setting maxThreadIdleTime to: 5
   [junit4]   2> 3368268 T10752 oashc.HttpShardHandlerFactory.getParameter Setting sizeOfQueue to: -1
   [junit4]   2> 3368268 T10752 oashc.HttpShardHandlerFactory.getParameter Setting fairnessPolicy to: false
   [junit4]   2> 3368275 T10752 oasl.LogWatcher.createWatcher SLF4J impl is org.slf4j.impl.Log4jLoggerFactory
   [junit4]   2> 3368276 T10752 oasl.LogWatcher.newRegisteredLogWatcher Registering Log Listener [Log4j (org.slf4j.impl.Log4jLoggerFactory)]
   [junit4]   2> 3368277 T10752 oasc.CoreContainer.load Host Name: 127.0.0.1
   [junit4]   2> 3368277 T10752 oasc.ZkContainer.initZooKeeper Zookeeper client=127.0.0.1:62717/solr
   [junit4]   2> 3368278 T10752 oasc.ZkController.checkChrootPath zkHost includes chroot
   [junit4]   2> 3368280 T10752 oascc.ConnectionManager.waitForConnected Waiting for client to connect to ZooKeeper
   [junit4]   2> 3368295 T10863 oascc.ConnectionManager.process Watcher org.apache.solr.common.cloud.ConnectionManager@1078ff6e name:ZooKeeperConnection Watcher:127.0.0.1:62717 got event WatchedEvent state:SyncConnected type:None path:null path:null type:None
   [junit4]   2> 3368296 T10752 oascc.ConnectionManager.waitForConnected Client is connected to ZooKeeper
   [junit4]   2> 3368301 T10752 oascc.ConnectionManager.waitForConnected Waiting for client to connect to ZooKeeper
   [junit4]   2> 3368305 T10865 oascc.ConnectionManager.process Watcher org.apache.solr.common.cloud.ConnectionManager@159d1284 name:ZooKeeperConnection Watcher:127.0.0.1:62717/solr got event WatchedEvent state:SyncConnected type:None path:null path:null type:None
   [junit4]   2> 3368306 T10752 oascc.ConnectionManager.waitForConnected Client is connected to ZooKeeper
   [junit4]   2> 3368314 T10752 oascc.ZkStateReader.createClusterStateWatchersAndUpdate Updating cluster state from ZooKeeper... 
   [junit4]   2> 3369366 T10752 oasc.ZkController.createEphemeralLiveNode Register node as live in ZooKeeper:/live_nodes/127.0.0.1:62782_
   [junit4]   2> 3369368 T10752 oascc.SolrZkClient.makePath makePath: /live_nodes/127.0.0.1:62782_
   [junit4]   2> 3369375 T10774 oascc.ZkStateReader$3.process Updating live nodes... (7)
   [junit4]   2> 3369376 T10806 oascc.ZkStateReader$3.process Updating live nodes... (7)
   [junit4]   2> 3369376 T10792 oascc.ZkStateReader$3.process Updating live nodes... (7)
   [junit4]   2> 3369376 T10779 oascc.ZkStateReader$3.process Updating live nodes... (7)
   [junit4]   2> 3369377 T10865 oascc.ZkStateReader$3.process Updating live nodes... (7)
   [junit4]   2> 3369376 T10835 oascc.ZkStateReader$3.process Updating live nodes... (7)
   [junit4]   2> 3369377 T10851 oascc.ZkStateReader$3.process Updating live nodes... (7)
   [junit4]   2> 3369377 T10820 oascc.ZkStateReader$3.process Updating live nodes... (7)
   [junit4]   2> 3369390 T10752 oasc.CorePropertiesLocator.discover Looking for core definitions underneath C:\Users\JenkinsSlave\workspace\Lucene-Solr-trunk-Windows\solr\build\solr-core\test\J0\..\..\..\..\..\..\..\..\..\Users\JenkinsSlave\workspace\Lucene-Solr-trunk-Windows\solr\build\solr-core\test\J0\.\org.apache.solr.cloud.OverseerRolesTest-jetty6-1391414279041
   [junit4]   2> 3369648 T10752 oasc.CorePropertiesLocator.discoverUnder Found core conf in C:\Users\JenkinsSlave\workspace\Lucene-Solr-trunk-Windows\solr\build\solr-core\test\J0\..\..\..\..\..\..\..\..\..\Users\JenkinsSlave\workspace\Lucene-Solr-trunk-Windows\solr\build\solr-core\test\J0\.\org.apache.solr.cloud.OverseerRolesTest-jetty6-1391414279041\conf\
   [junit4]   2> 3369661 T10752 oasc.CorePropertiesLocator.discover Found 1 core definitions
   [junit4]   2> 3369663 T10752 oass.SolrDispatchFilter.init user.dir=C:\Users\JenkinsSlave\workspace\Lucene-Solr-trunk-Windows\solr\build\solr-core\test\J0
   [junit4]   2> 3369663 T10752 oass.SolrDispatchFilter.init SolrDispatchFilter.init() done
   [junit4]   2> 3369667 T10752 oascc.ConnectionManager.waitForConnected Waiting for client to connect to ZooKeeper
   [junit4]   2> 3369670 T10868 oascc.ConnectionManager.process Watcher org.apache.solr.common.cloud.ConnectionManager@511d32c6 name:ZooKeeperConnection Watcher:127.0.0.1:62717/solr got event WatchedEvent state:SyncConnected type:None path:null path:null type:None
   [junit4]   2> 3369671 T10752 oascc.ConnectionManager.waitForConnected Client is connected to ZooKeeper
   [junit4]   2> 3369673 T10752 oascc.ZkStateReader.createClusterStateWatchersAndUpdate Updating cluster state from ZooKeeper... 
   [junit4]   2> 3369679 T10752 oascc.ConnectionManager.waitForConnected Waiting for client to connect to ZooKeeper
   [junit4]   2> 3369682 T10870 oascc.ConnectionManager.process Watcher org.apache.solr.common.cloud.ConnectionManager@619b34b7 name:ZooKeeperConnection Watcher:127.0.0.1:62717/solr got event WatchedEvent state:SyncConnected type:None path:null path:null type:None
   [junit4]   2> 3369683 T10752 oascc.ConnectionManager.waitForConnected Client is connected to ZooKeeper
   [junit4]   2> 3369684 T10752 oascc.ZkStateReader.createClusterStateWatchersAndUpdate Updating cluster state from ZooKeeper... 
   [junit4]   2> 3369691 T10827 oasha.CollectionsHandler.handleCreateAction Creating Collection : action=CREATE&wt=javabin&numShards=4&maxShardsPerNode=2&version=2&name=testOverseerCol&replicationFactor=2
   [junit4]   2> 3369693 T10774 oasc.DistributedQueue$LatchChildWatcher.process LatchChildWatcher fired on path: /overseer/collection-queue-work state: SyncConnected type NodeChildrenChanged
   [junit4]   2> 3369695 T10776 oasc.OverseerCollectionProcessor.run Overseer Collection Processor: Get the message id:/overseer/collection-queue-work/qn-0000000000 message:{
   [junit4]   2> 	  "operation":"createcollection",
   [junit4]   2> 	  "fromApi":"true",
   [junit4]   2> 	  "name":"testOverseerCol",
   [junit4]   2> 	  "replicationFactor":"2",
   [junit4]   2> 	  "numShards":"4",
   [junit4]   2> 	  "maxShardsPerNode":"2"}
   [junit4]   2> 3369695 T10776 oasc.OverseerCollectionProcessor.processMessage WARN OverseerCollectionProcessor.processMessage : createcollection , {
   [junit4]   2> 	  "operation":"createcollection",
   [junit4]   2> 	  "fromApi":"true",
   [junit4]   2> 	  "name":"testOverseerCol",
   [junit4]   2> 	  "replicationFactor":"2",
   [junit4]   2> 	  "numShards":"4",
   [junit4]   2> 	  "maxShardsPerNode":"2"}
   [junit4]   2> 3369698 T10776 oasc.OverseerCollectionProcessor.createConfNode Only one config set found in zk - using it:conf1
   [junit4]   2> 3369698 T10776 oasc.OverseerCollectionProcessor.createConfNode creating collections conf node /collections/testOverseerCol 
   [junit4]   2> 3369698 T10776 oascc.SolrZkClient.makePath makePath: /collections/testOverseerCol
   [junit4]   2> 3369708 T10774 oasc.DistributedQueue$LatchChildWatcher.process LatchChildWatcher fired on path: /overseer/queue state: SyncConnected type NodeChildrenChanged
   [junit4]   2> 3369710 T10775 oascc.ZkStateReader.updateClusterState Updating cloud state from ZooKeeper... 
   [junit4]   2> 3369711 T10775 oasc.Overseer$ClusterStateUpdater.buildCollection building a new collection: testOverseerCol
   [junit4]   2> 3369711 T10775 oasc.Overseer$ClusterStateUpdater.createCollection Create collection testOverseerCol with shards [shard1, shard2, shard3, shard4]
   [junit4]   2> 3369716 T10774 oasc.DistributedQueue$LatchChildWatcher.process LatchChildWatcher fired on path: /overseer/queue state: SyncConnected type NodeChildrenChanged
   [junit4]   2> 3369718 T10868 oascc.ZkStateReader$2.process A cluster state change: WatchedEvent state:SyncConnected type:NodeDataChanged path:/clusterstate.json, has occurred - updating... (live nodes size: 7)
   [junit4]   2> 3369718 T10870 oascc.ZkStateReader$2.process A cluster state change: WatchedEvent state:SyncConnected type:NodeDataChanged path:/clusterstate.json, has occurred - updating... (live nodes size: 7)
   [junit4]   2> 3369719 T10792 oascc.ZkStateReader$2.process A cluster state change: WatchedEvent state:SyncConnected type:NodeDataChanged path:/clusterstate.json, has occurred - updating... (live nodes size: 7)
   [junit4]   2> 3369719 T10820 oascc.ZkStateReader$2.process A cluster state change: WatchedEvent state:SyncConnected type:NodeDataChanged path:/clusterstate.json, has occurred - updating... (live nodes size: 7)
   [junit4]   2> 3369719 T10774 oascc.ZkStateReader$2.process A cluster state change: WatchedEvent state:SyncConnected type:NodeDataChanged path:/clusterstate.json, has occurred - updating... (live nodes size: 7)
   [junit4]   2> 3369720 T10806 oascc.ZkStateReader$2.process A cluster state change: WatchedEvent state:SyncConnected type:NodeDataChanged path:/clusterstate.json, has occurred - updating... (live nodes size: 7)
   [junit4]   2> 3369720 T10865 oascc.ZkStateReader$2.process A cluster state change: WatchedEvent state:SyncConnected type:NodeDataChanged path:/clusterstate.json, has occurred - updating... (live nodes size: 7)
   [junit4]   2> 3369720 T10851 oascc.ZkStateReader$2.process A cluster state change: WatchedEvent state:SyncConnected type:NodeDataChanged path:/clusterstate.json, has occurred - updating... (live nodes size: 7)
   [junit4]   2> 3369720 T10835 oascc.ZkStateReader$2.process A cluster state change: WatchedEvent state:SyncConnected type:NodeDataChanged path:/clusterstate.json, has occurred - updating... (live nodes size: 7)
   [junit4]   2> 3369721 T10779 oascc.ZkStateReader$2.process A cluster state change: WatchedEvent state:SyncConnected type:NodeDataChanged path:/clusterstate.json, has occurred - updating... (live nodes size: 7)
   [junit4]   2> 3369813 T10776 oasc.OverseerCollectionProcessor.createCollection going to create cores replicas shardNames [shard1, shard2, shard3, shard4] , repFactor : 2
   [junit4]   2> 3369813 T10776 oasc.OverseerCollectionProcessor.createCollection Creating shard testOverseerCol_shard1_replica1 as part of slice shard1 of collection testOverseerCol on 127.0.0.1:62736_
   [junit4]   2> 3369814 T10776 oasc.OverseerCollectionProcessor.createCollection Creating shard testOverseerCol_shard1_replica2 as part of slice shard1 of collection testOverseerCol on 127.0.0.1:62745_
   [junit4]   2> 3369814 T10776 oasc.OverseerCollectionProcessor.createCollection Creating shard testOverseerCol_shard2_replica1 as part of slice shard2 of collection testOverseerCol on 127.0.0.1:62724_
   [junit4]   2> 3369817 T10776 oasc.OverseerCollectionProcessor.createCollection Creating shard testOverseerCol_shard2_replica2 as part of slice shard2 of collection testOverseerCol on 127.0.0.1:62782_
   [junit4]   2> 3369817 T10776 oasc.OverseerCollectionProcessor.createCollection Creating shard testOverseerCol_shard3_replica1 as part of slice shard3 of collection testOverseerCol on 127.0.0.1:62754_
   [junit4]   2> 3369817 T10776 oasc.OverseerCollectionProcessor.createCollection Creating shard testOverseerCol_shard3_replica2 as part of slice shard3 of collection testOverseerCol on 127.0.0.1:62764_
   [junit4]   2> 3369818 T10776 oasc.OverseerCollectionProcessor.createCollection Creating shard testOverseerCol_shard4_replica1 as part of slice shard4 of collection testOverseerCol on 127.0.0.1:62773_
   [junit4]   2> 3369819 T10776 oasc.OverseerCollectionProcessor.createCollection Creating shard testOverseerCol_shard4_replica2 as part of slice shard4 of collection testOverseerCol on 127.0.0.1:62736_
   [junit4]   2> 3369830 T10828 oasc.ZkController.publish publishing core=testOverseerCol_shard3_replica2 state=down
   [junit4]   2> 3369830 T10845 oasc.ZkController.publish publishing core=testOverseerCol_shard4_replica1 state=down
   [junit4]   2> 3369831 T10765 oasc.ZkController.publish publishing core=testOverseerCol_shard2_replica1 state=down
   [junit4]   2> 3369833 T10788 oasc.ZkController.publish publishing core=testOverseerCol_shard1_replica1 state=down
   [junit4]   2> 3369838 T10774 oasc.DistributedQueue$LatchChildWatcher.process LatchChildWatcher fired on path: /overseer/queue state: SyncConnected type NodeChildrenChanged
   [junit4]   2> 3369838 T10828 oasc.ZkController.waitForCoreNodeName look for our core node name
   [junit4]   2> 3369838 T10858 oasc.ZkController.publish publishing core=testOverseerCol_shard2_replica2 state=down
   [junit4]   2> 3369837 T10799 oasc.ZkController.publish publishing core=testOverseerCol_shard1_replica2 state=down
   [junit4]   2> 3369840 T10811 oasc.ZkController.publish publishing core=testOverseerCol_shard3_replica1 state=down
   [junit4]   2> 3369842 T10845 oasc.ZkController.waitForCoreNodeName look for our core node name
   [junit4]   2> 3369842 T10783 oasc.ZkController.publish publishing core=testOverseerCol_shard4_replica2 state=down
   [junit4]   2> 3369844 T10765 oasc.ZkController.waitForCoreNodeName look for our core node name
   [junit4]   2> 3369846 T10788 oasc.ZkController.waitForCoreNodeName look for our core node name
   [junit4]   2> 3369846 T10858 oasc.ZkController.waitForCoreNodeName look for our core node name
   [junit4]   2> 3369846 T10799 oasc.ZkController.waitForCoreNodeName look for our core node name
   [junit4]   2> 3369847 T10811 oasc.ZkController.waitForCoreNodeName look for our core node name
   [junit4]   2> 3369849 T10783 oasc.ZkController.waitForCoreNodeName look for our core node name
   [junit4]   2> 3369849 T10774 oasc.DistributedQueue$LatchChildWatcher.process LatchChildWatcher fired on path: /overseer/queue state: SyncConnected type NodeChildrenChanged
   [junit4]   2> 3369851 T10775 oascc.ZkStateReader.updateClusterState Updating cloud state from ZooKeeper... 
   [junit4]   2> 3369852 T10775 oasc.Overseer$ClusterStateUpdater.updateState Update state numShards=4 message={
   [junit4]   2> 	  "operation":"state",
   [junit4]   2> 	  "state":"down",
   [junit4]   2> 	  "base_url":"http://127.0.0.1:62764",
   [junit4]   2> 	  "core":"testOverseerCol_shard3_replica2",
   [junit4]   2> 	  "roles":null,
   [junit4]   2> 	  "node_name":"127.0.0.1:62764_",
   [junit4]   2> 	  "shard":"shard3",
   [junit4]   2> 	  "shard_range":null,
   [junit4]   2> 	  "shard_state":"active",
   [junit4]   2> 	  "shard_parent":null,
   [junit4]   2> 	  "collection":"testOverseerCol",
   [junit4]   2> 	  "numShards":"4",
   [junit4]   2> 	  "core_node_name":null}
   [junit4]   2> 3369859 T10775 oasc.Overseer$ClusterStateUpdater.updateState Update state numShards=4 message={
   [junit4]   2> 	  "operation":"state",
   [junit4]   2> 	  "state":"down",
   [junit4]   2> 	  "base_url":"http://127.0.0.1:62773",
   [junit4]   2> 	  "core":"testOverseerCol_shard4_replica1",
   [junit4]   2> 	  "roles":null,
   [junit4]   2> 	  "node_name":"127.0.0.1:62773_",
   [junit4]   2> 	  "shard":"shard4",
   [junit4]   2> 	  "shard_range":null,
   [junit4]   2> 	  "shard_state":"active",
   [junit4]   2> 	  "shard_parent":null,
   [junit4]   2> 	  "collection":"testOverseerCol",
   [junit4]   2> 	  "numShards":"4",
   [junit4]   2> 	  "core_node_name":null}
   [junit4]   2> 3369865 T10774 oasc.DistributedQueue$LatchChildWatcher.process LatchChildWatcher fired on path: /overseer/queue state: SyncConnected type NodeChildrenChanged
   [junit4]   2> 3369867 T10775 oasc.Overseer$ClusterStateUpdater.updateState Update state numShards=4 message={
   [junit4]   2> 	  "operation":"state",
   [junit4]   2> 	  "state":"down",
   [junit4]   2> 	  "base_url":"http://127.0.0.1:62724",
   [junit4]   2> 	  "core":"testOverseerCol_shard2_replica1",
   [junit4]   2> 	  "roles":null,
   [junit4]   2> 	  "node_name":"127.0.0.1:62724_",
   [junit4]   2> 	  "shard":"shard2",
   [junit4]   2> 	  "shard_range":null,
   [junit4]   2> 	  "shard_state":"active",
   [junit4]   2> 	  "shard_parent":null,
   [junit4]   2> 	  "collection":"testOverseerCol",
   [junit4]   2> 	  "numShards":"4",
   [junit4]   2> 	  "core_node_name":null}
   [junit4]   2> 3369872 T10774 oasc.DistributedQueue$LatchChildWatcher.process LatchChildWatcher fired on path: /overseer/queue state: SyncConnected type NodeChildrenChanged
   [junit4]   2> 3369874 T10775 oasc.Overseer$ClusterStateUpdater.updateState Update state numShards=4 message={
   [junit4]   2> 	  "operation":"state",
   [junit4]   2> 	  "state":"down",
   [junit4]   2> 	  "base_url":"http://127.0.0.1:62736",
   [junit4]   2> 	  "core":"testOverseerCol_shard1_replica1",
   [junit4]   2> 	  "roles":null,
   [junit4]   2> 	  "node_name":"127.0.0.1:62736_",
   [junit4]   2> 	  "shard":"shard1",
   [junit4]   2> 	  "shard_range":null,
   [junit4]   2> 	  "shard_state":"active",
   [junit4]   2> 	  "shard_parent":null,
   [junit4]   2> 	  "collection":"testOverseerCol",
   [junit4]   2> 	  "numShards":"4",
   [junit4]   2> 	  "core_node_name":null}
   [junit4]   2> 3369879 T10774 oasc.DistributedQueue$LatchChildWatcher.process LatchChildWatcher fired on path: /overseer/queue state: SyncConnected type NodeChildrenChanged
   [junit4]   2> 3369881 T10775 oasc.Overseer$ClusterStateUpdater.updateState Update state numShards=4 message={
   [junit4]   2> 	  "operation":"state",
   [junit4]   2> 	  "state":"down",
   [junit4]   2> 	  "base_url":"http://127.0.0.1:62782",
   [junit4]   2> 	  "core":"testOverseerCol_shard2_replica2",
   [junit4]   2> 	  "roles":null,
   [junit4]   2> 	  "node_name":"127.0.0.1:62782_",
   [junit4]   2> 	  "shard":"shard2",
   [junit4]   2> 	  "shard_range":null,
   [junit4]   2> 	  "shard_state":"active",
   [junit4]   2> 	  "shard_parent":null,
   [junit4]   2> 	  "collection":"testOverseerCol",
   [junit4]   2> 	  "numShards":"4",
   [junit4]   2> 	  "core_node_name":null}
   [junit4]   2> 3369887 T10774 oasc.DistributedQueue$LatchChildWatcher.process LatchChildWatcher fired on path: /overseer/queue state: SyncConnected type NodeChildrenChanged
   [junit4]   2> 3369888 T10775 oasc.Overseer$ClusterStateUpdater.updateState Update state numShards=4 message={
   [junit4]   2> 	  "operation":"state",
   [junit4]   2> 	  "state":"down",
   [junit4]   2> 	  "base_url":"http://127.0.0.1:62745",
   [junit4]   2> 	  "core":"testOverseerCol_shard1_replica2",
   [junit4]   2> 	  "roles":null,
   [junit4]   2> 	  "node_name":"127.0.0.1:62745_",
   [junit4]   2> 	  "shard":"shard1",
   [junit4]   2> 	  "shard_range":null,
   [junit4]   2> 	  "shard_state":"active",
   [junit4]   2> 	  "shard_parent":null,
   [junit4]   2> 	  "collection":"testOverseerCol",
   [junit4]   2> 	  "numShards":"4",
   [junit4]   2> 	  "core_node_name":null}
   [junit4]   2> 3369894 T10774 oasc.DistributedQueue$LatchChildWatcher.process LatchChildWatcher fired on path: /overseer/queue state: SyncConnected type NodeChildrenChanged
   [junit4]   2> 3369895 T10775 oasc.Overseer$ClusterStateUpdater.updateState Update state numShards=4 message={
   [junit4]   2> 	  "operation":"state",
   [junit4]   2> 	  "state":"down",
   [junit4]   2> 	  "base_url":"http://127.0.0.1:62754",
   [junit4]   2> 	  "core":"testOverseerCol_shard3_replica1",
   [junit4]   2> 	  "roles":null,
   [junit4]   2> 	  "node_name":"127.0.0.1:62754_",
   [junit4]   2> 	  "shard":"shard3",
   [junit4]   2> 	  "shard_range":null,
   [junit4]   2> 	  "shard_state":"active",
   [junit4]   2> 	  "shard_parent":null,
   [junit4]   2> 	  "collection":"testOverseerCol",
   [junit4]   2> 	  "numShards":"4",
   [junit4]   2> 	  "core_node_name":null}
   [junit4]   2> 3369900 T10774 oasc.DistributedQueue$LatchChildWatcher.process LatchChildWatcher fired on path: /overseer/queue state: SyncConnected type NodeChildrenChanged
   [junit4]   2> 3369901 T10775 oasc.Overseer$ClusterStateUpdater.updateState Update state numShards=4 message={
   [junit4]   2> 	  "operation":"state",
   [junit4]   2> 	  "state":"down",
   [junit4]   2> 	  "base_url":"http://127.0.0.1:62736",
   [junit4]   2> 	  "core":"testOverseerCol_shard4_replica2",
   [junit4]   2> 	  "roles":null,
   [junit4]   2> 	  "node_name":"127.0.0.1:62736_",
   [junit4]   2> 	  "shard":"shard4",
   [junit4]   2> 	  "shard_range":null,
   [junit4]   2> 	  "shard_state":"active",
   [junit4]   2> 	  "shard_parent":null,
   [junit4]   2> 	  "collection":"testOverseerCol",
   [junit4]   2> 	  "numShards":"4",
   [junit4]   2> 	  "core_node_name":null}
   [junit4]   2> 3369906 T10774 oasc.DistributedQueue$LatchChildWatcher.process LatchChildWatcher fired on path: /overseer/queue state: SyncConnected type NodeChildrenChanged
   [junit4]   2> 3370015 T10774 oascc.ZkStateReader$2.process A cluster state change: WatchedEvent state:SyncConnected type:NodeDataChanged path:/clusterstate.json, has occurred - updating... (live nodes size: 7)
   [junit4]   2> 3370015 T10806 oascc.ZkStateReader$2.process A cluster state change: WatchedEvent state:SyncConnected type:NodeDataChanged path:/clusterstate.json, has occurred - updating... (live nodes size: 7)
   [junit4]   2> 3370016 T10792 oascc.ZkStateReader$2.process A cluster state change: WatchedEvent state:SyncConnected type:NodeDataChanged path:/clusterstate.json, has occurred - updating... (live nodes size: 7)
   [junit4]   2> 3370016 T10870 oascc.ZkStateReader$2.process A cluster state change: WatchedEvent state:SyncConnected type:NodeDataChanged path:/clusterstate.json, has occurred - updating... (live nodes size: 7)
   [junit4]   2> 3370017 T10820 oascc.ZkStateReader$2.process A cluster state change: WatchedEvent state:SyncConnected type:NodeDataChanged path:/clusterstate.json, has occurred - updating... (live nodes size: 7)
   [junit4]   2> 3370017 T10835 oascc.ZkStateReader$2.process A cluster state change: WatchedEvent state:SyncConnected type:NodeDataChanged path:/clusterstate.json, has occurred - updating... (live nodes size: 7)
   [junit4]   2> 3370017 T10868 oascc.ZkStateReader$2.process A cluster state change: WatchedEvent state:SyncConnected type:NodeDataChanged path:/clusterstate.json, has occurred - updating... (live nodes size: 7)
   [junit4]   2> 3370017 T10779 oascc.ZkStateReader$2.process A cluster state change: WatchedEvent state:SyncConnected type:NodeDataChanged path:/clusterstate.json, has occurred - updating... (live nodes size: 7)
   [junit4]   2> 3370018 T10851 oascc.ZkStateReader$2.process A cluster state change: WatchedEvent state:SyncConnected type:NodeDataChanged path:/clusterstate.json, has occurred - updating... (live nodes size: 7)
   [junit4]   2> 3370018 T10865 oascc.ZkStateReader$2.process A cluster state change: WatchedEvent state:SyncConnected type:NodeDataChanged path:/clusterstate.json, has occurred - updating... (live nodes size: 7)
   [junit4]   2> 3370885 T10828 oasc.ZkController.waitForShardId waiting to find shard id in clusterstate for testOverseerCol_shard3_replica2
   [junit4]   2> 3370888 T10828 oasc.CoreContainer.create Creating SolrCore 'testOverseerCol_shard3_replica2' using instanceDir: ..\..\..\..\..\..\..\..\..\Users\JenkinsSlave\workspace\Lucene-Solr-trunk-Windows\solr\build\solr-core\test\J0\.\org.apache.solr.cloud.OverseerRolesTest-jetty4-1391414274978\testOverseerCol_shard3_replica2
   [junit4]   2> 3370889 T10828 oasc.ZkController.createCollectionZkNode Check for collection zkNode:testOverseerCol
   [junit4]   2> 3370889 T10845 oasc.ZkController.waitForShardId waiting to find shard id in clusterstate for testOverseerCol_shard4_replica1
   [junit4]   2> 3370891 T10828 oasc.ZkController.createCollectionZkNode Collection zkNode exists
   [junit4]   2> 3370891 T10828 oascc.ZkStateReader.readConfigName Load collection config from:/collections/testOverseerCol
   [junit4]   2> 3370892 T10845 oasc.CoreContainer.create Creating SolrCore 'testOverseerCol_shard4_replica1' using instanceDir: .\org.apache.solr.cloud.OverseerRolesTest-jetty5-1391414277022\testOverseerCol_shard4_replica1
   [junit4]   2> 3370892 T10845 oasc.ZkController.createCollectionZkNode Check for collection zkNode:testOverseerCol
   [junit4]   2> 3370894 T10799 oasc.ZkController.waitForShardId waiting to find shard id in clusterstate for testOverseerCol_shard1_replica2
   [junit4]   2> 3370892 T10788 oasc.ZkController.waitForShardId waiting to find shard id in clusterstate for testOverseerCol_shard1_replica1
   [junit4]   2> 3370896 T10858 oasc.ZkController.waitForShardId waiting to find shard id in clusterstate for testOverseerCol_shard2_replica2
   [junit4]   2> 3370896 T10799 oasc.CoreContainer.create Creating SolrCore 'testOverseerCol_shard1_replica2' using instanceDir: ..\..\..\..\..\..\..\..\..\Users\JenkinsSlave\workspace\Lucene-Solr-trunk-Windows\solr\build\solr-core\test\J0\.\org.apache.solr.cloud.OverseerRolesTest-jetty2-1391414271154\testOverseerCol_shard1_replica2
   [junit4]   2> 3370896 T10799 oasc.ZkController.createCollectionZkNode Check for collection zkNode:testOverseerCol
   [junit4]   2> 3370898 T10788 oasc.CoreContainer.create Creating SolrCore 'testOverseerCol_shard1_replica1' using instanceDir: .\org.apache.solr.cloud.OverseerRolesTest-jetty1-1391414269345\testOverseerCol_shard1_replica1
   [junit4]   2> 3370898 T10783 oasc.ZkController.waitForShardId waiting to find shard id in clusterstate for testOverseerCol_shard4_replica2
   [junit4]   2> 3370899 T10845 oasc.ZkController.createCollectionZkNode Collection zkNode exists
   [junit4]   2> 3370900 T10845 oascc.ZkStateReader.readConfigName Load collection config from:/collections/testOverseerCol
   [junit4]   2> 3370898 T10788 oasc.ZkController.createCollectionZkNode Check for collection zkNode:testOverseerCol
   [junit4]   2> 3370898 T10811 oasc.ZkController.waitForShardId waiting to find shard id in clusterstate for testOverseerCol_shard3_replica1
   [junit4]   2> 3370904 T10788 oasc.ZkController.createCollectionZkNode Collection zkNode exists
   [junit4]   2> 3370906 T10788 oascc.ZkStateReader.readConfigName Load collection config from:/collections/testOverseerCol
   [junit4]   2> 3370906 T10845 oasc.SolrResourceLoader.<init> new SolrResourceLoader for directory: '.\org.apache.solr.cloud.OverseerRolesTest-jetty5-1391414277022\testOverseerCol_shard4_replica1\'
   [junit4]   2> 3370907 T10858 oasc.CoreContainer.create Creating SolrCore 'testOverseerCol_shard2_replica2' using instanceDir: ..\..\..\..\..\..\..\..\..\Users\JenkinsSlave\workspace\Lucene-Solr-trunk-Windows\solr\build\solr-core\test\J0\.\org.apache.solr.cloud.OverseerRolesTest-jetty6-1391414279041\testOverseerCol_shard2_replica2
   [junit4]   2> 3370907 T10858 oasc.ZkController.createCollectionZkNode Check for collection zkNode:testOverseerCol
   [junit4]   2> 3370909 T10858 oasc.ZkController.createCollectionZkNode Collection zkNode exists
   [junit4]   2> 3370909 T10858 oascc.ZkStateReader.readConfigName Load collection config from:/collections/testOverseerCol
   [junit4]   2> 3370911 T10788 oasc.SolrResourceLoader.<init> new SolrResourceLoader for directory: '.\org.apache.solr.cloud.OverseerRolesTest-jetty1-1391414269345\testOverseerCol_shard1_replica1\'
   [junit4]   2> 3370913 T10858 oasc.SolrResourceLoader.<init> new SolrResourceLoader for directory: '..\..\..\..\..\..\..\..\..\Users\JenkinsSlave\workspace\Lucene-Solr-trunk-Windows\solr\build\solr-core\test\J0\.\org.apache.solr.cloud.OverseerRolesTest-jetty6-1391414279041\testOverseerCol_shard2_replica2\'
   [junit4]   2> 3370898 T10765 oasc.ZkController.waitForShardId waiting to find shard id in clusterstate for testOverseerCol_shard2_replica1
   [junit4]   2> 3370917 T10765 oasc.CoreContainer.create Creating SolrCore 'testOverseerCol_shard2_replica1' using instanceDir: .\org.apache.solr.cloud.OverseerRolesTest-controljetty-1391414268393\testOverseerCol_shard2_replica1
   [junit4]   2> 3370918 T10765 oasc.ZkController.createCollectionZkNode Check for collection zkNode:testOverseerCol
   [junit4]   2> 3370919 T10783 oasc.CoreContainer.create Creating SolrCore 'testOverseerCol_shard4_replica2' using instanceDir: .\org.apache.solr.cloud.OverseerRolesTest-jetty1-1391414269345\testOverseerCol_shard4_replica2
   [junit4]   2> 3370919 T10783 oasc.ZkController.createCollectionZkNode Check for collection zkNode:testOverseerCol
   [junit4]   2> 3370905 T10811 oasc.CoreContainer.create Creating SolrCore 'testOverseerCol_shard3_replica1' using instanceDir: .\org.apache.solr.cloud.OverseerRolesTest-jetty3-1391414272988\testOverseerCol_shard3_replica1
   [junit4]   2> 3370920 T10811 oasc.ZkController.createCollectionZkNode Check for collection zkNode:testOverseerCol
   [junit4]   2> 3370901 T10799 oasc.ZkController.createCollectionZkNode Collection zkNode exists
   [junit4]   2> 3370921 T10799 oascc.ZkStateReader.readConfigName Load collection config from:/collections/testOverseerCol
   [junit4]   2> 3370900 T10828 oasc.SolrResourceLoader.<init> new SolrResourceLoader for directory: '..\..\..\..\..\..\..\..\..\Users\JenkinsSlave\workspace\Lucene-Solr-trunk-Windows\solr\build\solr-core\test\J0\.\org.apache.solr.cloud.OverseerRolesTest-jetty4-1391414274978\testOverseerCol_shard3_replica2\'
   [junit4]   2> 3370935 T10765 oasc.ZkController.createCollectionZkNode Collection zkNode exists
   [junit4]   2> 3370936 T10765 oascc.ZkStateReader.readConfigName Load collection config from:/collections/testOverseerCol
   [junit4]   2> 3370939 T10811 oasc.ZkController.createCollectionZkNode Collection zkNode exists
   [junit4]   2> 3370940 T10811 oascc.ZkStateReader.readConfigName Load collection config from:/collections/testOverseerCol
   [junit4]   2> 3370944 T10783 oasc.ZkController.createCollectionZkNode Collection zkNode exists
   [junit4]   2> 3370944 T10783 oascc.ZkStateReader.readConfigName Load collection config from:/collections/testOverseerCol
   [junit4]   2> 3370958 T10799 oasc.SolrResourceLoader.<init> new SolrResourceLoader for directory: '..\..\..\..\..\..\..\..\..\Users\JenkinsSlave\workspace\Lucene-Solr-trunk-Windows\solr\build\solr-core\test\J0\.\org.apache.solr.cloud.OverseerRolesTest-jetty2-1391414271154\testOverseerCol_shard1_replica2\'
   [junit4]   2> 3370973 T10765 oasc.SolrResourceLoader.<init> new SolrResourceLoader for directory: '.\org.apache.solr.cloud.OverseerRolesTest-controljetty-1391414268393\testOverseerCol_shard2_replica1\'
   [junit4]   2> 3370986 T10811 oasc.SolrResourceLoader.<init> new SolrResourceLoader for directory: '.\org.apache.solr.cloud.OverseerRolesTest-jetty3-1391414272988\testOverseerCol_shard3_replica1\'
   [junit4]   2> 3370994 T10783 oasc.SolrResourceLoader.<init> new SolrResourceLoader for directory: '.\org.apache.solr.cloud.OverseerRolesTest-jetty1-1391414269345\testOverseerCol_shard4_replica2\'
   [junit4]   2> 3371134 T10828 oasc.SolrConfig.<init> Using Lucene MatchVersion: LUCENE_50
   [junit4]   2> 3371146 T10765 oasc.SolrConfig.<init> Using Lucene MatchVersion: LUCENE_50
   [junit4]   2> 3371219 T10828 oasc.SolrConfig.<init> Loaded SolrConfig: solrconfig.xml
   [junit4]   2> 3371233 T10765 oasc.SolrConfig.<init> Loaded SolrConfig: solrconfig.xml
   [junit4]   2> 3371277 T10788 oasc.SolrConfig.<init> Using Lucene MatchVersion: LUCENE_50
   [junit4]   2> 3371284 T10845 oasc.SolrConfig.<init> Using Lucene MatchVersion: LUCENE_50
   [junit4]   2> 3371358 T10788 oasc.SolrConfig.<init> Loaded SolrConfig: solrconfig.xml
   [junit4]   2> 3371364 T10858 oasc.SolrConfig.<init> Using Lucene MatchVersion: LUCENE_50
   [junit4]   2> 3371367 T10845 oasc.SolrConfig.<init> Loaded SolrConfig: solrconfig.xml
   [junit4]   2> 3371384 T10799 oasc.SolrConfig.<init> Using Lucene MatchVersion: LUCENE_50
   [junit4]   2> 3371440 T10828 oass.IndexSchema.readSchema Reading Solr Schema from schema.xml
   [junit4]   2> 3371452 T10828 oass.IndexSchema.readSchema [testOverseerCol_shard3_replica2] Schema name=test
   [junit4]   2> 3371481 T10799 oasc.SolrConfig.<init> Loaded SolrConfig: solrconfig.xml
   [junit4]   2> 3371529 T10811 oasc.SolrConfig.<init> Using Lucene MatchVersion: LUCENE_50
   [junit4]   2> 3371631 T10811 oasc.SolrConfig.<init> Loaded SolrConfig: solrconfig.xml
   [junit4]   2> 3371635 T10858 oasc.SolrConfig.<init> Loaded SolrConfig: solrconfig.xml
   [junit4]   2> 3371636 T10765 oass.IndexSchema.readSchema Reading Solr Schema from schema.xml
   [junit4]   2> 3371649 T10765 oass.IndexSchema.readSchema [testOverseerCol_shard2_replica1] Schema name=test
   [junit4]   2> 3371699 T10845 oass.IndexSchema.readSchema Reading Solr Schema from schema.xml
   [junit4]   2> 3371711 T10845 oass.IndexSchema.readSchema [testOverseerCol_shard4_replica1] Schema name=test
   [junit4]   2> 3371751 T10788 oass.IndexSchema.readSchema Reading Solr Schema from schema.xml
   [junit4]   2> 3371755 T10858 oass.IndexSchema.readSchema Reading Solr Schema from schema.xml
   [junit4]   2> 3371768 T10788 oass.IndexSchema.readSchema [testOverseerCol_shard1_replica1] Schema name=test
   [junit4]   2> 3371770 T10799 oass.IndexSchema.readSchema Reading Solr Schema from schema.xml
   [junit4]   2> 3371773 T10811 oass.IndexSchema.readSchema Reading Solr Schema from schema.xml
   [junit4]   2> 3371838 T10783 oasc.SolrConfig.<init> Using Lucene MatchVersion: LUCENE_50
   [junit4]   2> 3371858 T10858 oass.IndexSchema.readSchema [testOverseerCol_shard2_replica2] Schema name=test
   [junit4]   2> 3371923 T10783 oasc.SolrConfig.<init> Loaded SolrConfig: solrconfig.xml
   [junit4]   2> 3371937 T10799 oass.IndexSchema.readSchema [testOverseerCol_shard1_replica2] Schema name=test
   [junit4]   2> 3372043 T10811 oass.IndexSchema.readSchema [testOverseerCol_shard3_replica1] Schema name=test
   [junit4]   2> 3372336 T10783 oass.IndexSchema.readSchema Reading Solr Schema from schema.xml
   [junit4]   2> 3372366 T10783 oass.IndexSchema.readSchema [testOverseerCol_shard4_replica2] Schema name=test
   [junit4]   2> 3373766 T10765 oass.OpenExchangeRatesOrgProvider.init Initialized with rates=open-exchange-rates.json, refreshInterval=1440.
   [junit4]   2> 3374014 T10765 oass.IndexSchema.readSchema default search field in schema is text
   [junit4]   2> 3374034 T10765 oass.IndexSchema.readSchema unique key field: id
   [junit4]   2> 3374104 T10765 oass.FileExchangeRateProvider.reload Reloading exchange rates from file currency.xml
   [junit4]   2> 3374129 T10765 oass.FileExchangeRateProvider.reload Reloading exchange rates from file currency.xml
   [junit4]   2> 3374155 T10765 oass.OpenExchangeRatesOrgProvider.reload Reloading exchange rates from open-exchange-rates.json
   [junit4]   2> 3374164 T10765 oass.OpenExchangeRatesOrgProvider$OpenExchangeRates.<init> WARN Unknown key IMPORTANT NOTE
   [junit4]   2> 3374168 T10765 oass.OpenExchangeRatesOrgProvider$OpenExchangeRates.<init> WARN Expected key, got STRING
   [junit4]   2> 3374168 T10765 oass.OpenExchangeRatesOrgProvider.reload Reloading exchange rates from open-exchange-rates.json
   [junit4]   2> 3374251 T10765 oass.OpenExchangeRatesOrgProvider$OpenExchangeRates.<init> WARN Unknown key IMPORTANT NOTE
   [junit4]   2> 3374252 T10765 oass.OpenExchangeRatesOrgProvider$OpenExchangeRates.<init> WARN Expected key, got STRING
   [junit4]   2> 3374253 T10765 oasc.SolrCore.initDirectoryFactory org.apache.solr.core.MockDirectoryFactory
   [junit4]   2> 3374253 T10765 oasc.SolrCore.<init> [testOverseerCol_shard2_replica1] Opening new SolrCore at .\org.apache.solr.cloud.OverseerRolesTest-controljetty-1391414268393\testOverseerCol_shard2_replica1\, dataDir=.\org.apache.solr.cloud.OverseerRolesTest-controljetty-1391414268393\testOverseerCol_shard2_replica1\data\
   [junit4]   2> 3374253 T10765 oasc.JmxMonitoredMap.<init> JMX monitoring is enabled. Adding Solr mbeans to JMX Server: com.sun.jmx.mbeanserver.JmxMBeanServer@1ee34c22
   [junit4]   2> 3374255 T10765 oasc.CachingDirectoryFactory.get return new directory for .\org.apache.solr.cloud.OverseerRolesTest-controljetty-1391414268393\testOverseerCol_shard2_replica1\data\
   [junit4]   2> 3374261 T10765 oasc.SolrCore.getNewIndexDir New index directory detected: old=null new=.\org.apache.solr.cloud.OverseerRolesTest-controljetty-1391414268393\testOverseerCol_shard2_replica1\data\index/
   [junit4]   2> 3374261 T10765 oasc.SolrCore.initIndex WARN [testOverseerCol_shard2_replica1] Solr index directory '.\org.apache.solr.cloud.OverseerRolesTest-controljetty-1391414268393\testOverseerCol_shard2_replica1\data\index' doesn't exist. Creating new index...
   [junit4]   2> 3374352 T10828 oass.OpenExchangeRatesOrgProvider.init Initialized with rates=open-exchange-rates.json, refreshInterval=1440.
   [junit4]   2> 3374361 T10828 oass.IndexSchema.readSchema default search field in schema is text
   [junit4]   2> 3374366 T10828 oass.IndexSchema.readSchema unique key field: id
   [junit4]   2> 3374405 T10811 oass.OpenExchangeRatesOrgProvider.init Initialized with rates=open-exchange-rates.json, refreshInterval=1440.
   [junit4]   2> 3374546 T10788 oass.OpenExchangeRatesOrgProvider.init Initialized with rates=open-exchange-rates.json, refreshInterval=1440.
   [junit4]   2> 3374628 T10811 oass.IndexSchema.readSchema default search field in schema is text
   [junit4]   2> 3374632 T10811 oass.IndexSchema.readSchema unique key field: id
   [junit4]   2> 3374640 T10788 oass.IndexSchema.readSchema default search field in schema is text
   [junit4]   2> 3374646 T10788 oass.IndexSchema.readSchema unique key field: id
   [junit4]   2> 3374906 T10845 oass.OpenExchangeRatesOrgProvider.init Initialized with rates=open-exchange-rates.json, refreshInterval=1440.
   [junit4]   2> 3374915 T10799 oass.OpenExchangeRatesOrgProvider.init Initialized with rates=open-exchange-rates.json, refreshInterval=1440.
   [junit4]   2> 3374915 T10845 oass.IndexSchema.readSchema default search field in schema is text
   [junit4]   2> 3374921 T10845 oass.IndexSchema.readSchema unique key field: id
   [junit4]   2> 3374925 T10799 oass.IndexSchema.readSchema default search field in schema is text
   [junit4]   2> 3374925 T10765 oasc.CachingDirectoryFactory.get return new directory for .\org.apache.solr.cloud.OverseerRolesTest-controljetty-1391414268393\testOverseerCol_shard2_replica1\data\index
   [junit4]   2> 3374929 T10765 oasu.RandomMergePolicy.<init> RandomMergePolicy wrapping class org.apache.lucene.index.TieredMergePolicy: [TieredMergePolicy: maxMergeAtOnce=11, maxMergeAtOnceExplicit=10, maxMergedSegmentMB=37.126953125, floorSegmentMB=0.61328125, forceMergeDeletesPctAllowed=14.260310482833194, segmentsPerTier=45.0, maxCFSSegmentSizeMB=8.796093022207999E12, noCFSRatio=0.2536819356288074
   [junit4]   2> 3375027 T10765 oasc.SolrDeletionPolicy.onCommit SolrDeletionPolicy.onCommit: commits: num=1
   [junit4]   2> 		commit{dir=MockDirectoryWrapper(org.apache.lucene.store.RAMDirectory@4eb5a53b lockFactory=org.apache.lucene.store.SingleInstanceLockFactory@503ee5ac),segFN=segments_1,generation=1}
   [junit4]   2> 3375027 T10765 oasc.SolrDeletionPolicy.updateCommits newest commit generation = 1
   [junit4]   2> 3375031 T10765 oasup.UpdateRequestProcessorChain.init creating updateRequestProcessorChain "nodistrib"
   [junit4]   2> 3375033 T10765 oasup.UpdateRequestProcessorChain.init creating updateRequestProcessorChain "dedupe"
   [junit4]   2> 3375033 T10765 oasup.UpdateRequestProcessorChain.init inserting DistributedUpdateProcessorFactory into updateRequestProcessorChain "dedupe"
   [junit4]   2> 3375033 T10765 oasup.UpdateRequestProcessorChain.init creating updateRequestProcessorChain "stored_sig"
   [junit4]   2> 3375034 T10765 oasup.UpdateRequestProcessorChain.init inserting DistributedUpdateProcessorFactory into updateRequestProcessorChain "stored_sig"
   [junit4]   2> 3375034 T10765 oasup.UpdateRequestProcessorChain.init creating updateRequestProcessorChain "distrib-dup-test-chain-explicit"
   [junit4]   2> 3375034 T10765 oasup.UpdateRequestProcessorChain.init creating updateRequestProcessorChain "distrib-dup-test-chain-implicit"
   [junit4]   2> 3375035 T10765 oasup.UpdateRequestProcessorChain.init inserting DistributedUpdateProcessorFactory into updateRequestProcessorChain "distrib-dup-test-chain-implicit"
   [junit4]   2> 3375035 T10765 oasc.SolrCore.loadUpdateProcessorChains no updateRequestProcessorChain defined as default, creating implicit default
   [junit4]   2> 3375035 T10765 oasc.RequestHandlers.initHandlersFromConfig created standard: solr.StandardRequestHandler
   [junit4]   2> 3375038 T10765 oasc.RequestHandlers.initHandlersFromConfig created /get: solr.RealTimeGetHandler
   [junit4]   2> 3375038 T10765 oasc.RequestHandlers.initHandlersFromConfig adding lazy requestHandler: solr.ReplicationHandler
   [junit4]   2> 3375038 T10765 oasc.RequestHandlers.initHandlersFromConfig created /replication: solr.ReplicationHandler
   [junit4]   2> 3375039 T10765 oasc.RequestHandlers.initHandlersFromConfig created /update: solr.UpdateRequestHandler
   [junit4]   2> 3375039 T10765 oasc.RequestHandlers.initHandlersFromConfig created /admin/: org.apache.solr.handler.admin.AdminHandlers
   [junit4]   2> 3375040 T10765 oasc.RequestHandlers.initHandlersFromConfig created /admin/file: solr.admin.ShowFileRequestHandler
   [junit4]   2> 337

[...truncated too long message...]

reate(KeeperException.java:127)
   [junit4]   2> 	at org.apache.zookeeper.KeeperException.create(KeeperException.java:51)
   [junit4]   2> 	at org.apache.zookeeper.ZooKeeper.getChildren(ZooKeeper.java:1468)
   [junit4]   2> 	at org.apache.solr.common.cloud.SolrZkClient$6.execute(SolrZkClient.java:256)
   [junit4]   2> 	at org.apache.solr.common.cloud.SolrZkClient$6.execute(SolrZkClient.java:253)
   [junit4]   2> 	at org.apache.solr.common.cloud.ZkCmdExecutor.retryOperation(ZkCmdExecutor.java:73)
   [junit4]   2> 	at org.apache.solr.common.cloud.SolrZkClient.getChildren(SolrZkClient.java:253)
   [junit4]   2> 	at org.apache.solr.cloud.LeaderElector.checkIfIamLeader(LeaderElector.java:92)
   [junit4]   2> 	at org.apache.solr.cloud.LeaderElector.access$000(LeaderElector.java:55)
   [junit4]   2> 	at org.apache.solr.cloud.LeaderElector$1.process(LeaderElector.java:137)
   [junit4]   2> 	at org.apache.zookeeper.ClientCnxn$EventThread.processEvent(ClientCnxn.java:519)
   [junit4]   2> 	at org.apache.zookeeper.ClientCnxn$EventThread.run(ClientCnxn.java:495)
   [junit4]   2> 
   [junit4]   2> NOTE: test params are: codec=Lucene40, sim=DefaultSimilarity, locale=nl_NL, timezone=NZ-CHAT
   [junit4]   2> NOTE: Windows 7 6.1 amd64/Oracle Corporation 1.7.0_51 (64-bit)/cpus=2,threads=1,free=307731792,total=519438336
   [junit4]   2> NOTE: All tests run in this JVM: [TestDistributedMissingSort, SolrPluginUtilsTest, CurrencyFieldOpenExchangeTest, ConnectionManagerTest, TestAnalyzedSuggestions, SOLR749Test, TermsComponentTest, StatelessScriptUpdateProcessorFactoryTest, ZkCLITest, TestOverriddenPrefixQueryForCustomFieldType, CopyFieldTest, JSONWriterTest, BadComponentTest, TestMergePolicyConfig, TestSolrXmlPersistence, DocValuesMissingTest, ChaosMonkeyNothingIsSafeTest, SolrXmlInZkTest, XmlUpdateRequestHandlerTest, DirectUpdateHandlerTest, TestRecoveryHdfs, FieldAnalysisRequestHandlerTest, BlockCacheTest, TestFaceting, TestFreeTextSuggestions, SimplePostToolTest, SliceStateTest, TestShardHandlerFactory, SortByFunctionTest, TestPerFieldSimilarity, TestFieldCollectionResource, HardAutoCommitTest, TestPHPSerializedResponseWriter, SuggesterWFSTTest, DirectSolrConnectionTest, FileBasedSpellCheckerTest, CircularListTest, DisMaxRequestHandlerTest, TestInfoStreamLogging, DirectSolrSpellCheckerTest, HdfsBasicDistributedZk2Test, HdfsDirectoryTest, FieldMutatingUpdateProcessorTest, ScriptEngineTest, TestGroupingSearch, EchoParamsTest, TestUtils, TestReloadAndDeleteDocs, TestCollapseQParserPlugin, TestNumberUtils, DistributedQueryComponentCustomSortTest, MultiTermTest, TestNonNRTOpen, ExternalFileFieldSortTest, BadCopyFieldTest, LukeRequestHandlerTest, TestLFUCache, PreAnalyzedUpdateProcessorTest, BinaryUpdateRequestHandlerTest, TestSearchPerf, AutoCommitTest, TestManagedSchemaFieldResource, MBeansHandlerTest, XsltUpdateRequestHandlerTest, TestBinaryField, TestSolrXMLSerializer, DistributedSuggestComponentTest, TestCollationField, TestNRTOpen, TestExtendedDismaxParser, SimpleFacetsTest, UpdateRequestProcessorFactoryTest, TestFastWriter, TestWordDelimiterFilterFactory, DateFieldTest, TestHighFrequencyDictionaryFactory, IndexSchemaRuntimeFieldTest, TestLuceneMatchVersion, BasicFunctionalityTest, TestArbitraryIndexDir, TriLevelCompositeIdRoutingTest, TestValueSourceCache, TestPartialUpdateDeduplication, TestLRUCache, TestDefaultSimilarityFactory, TestMaxScoreQueryParser, SearchHandlerTest, UpdateParamsTest, TestHashPartitioner, OpenExchangeRatesOrgProviderTest, TestSolr4Spatial, TestSolrQueryParserResource, AliasIntegrationTest, TestElisionMultitermQuery, TestFastLRUCache, TestRealTimeGet, DistributedTermsComponentTest, TestQuerySenderNoQuery, TestCharFilters, FileUtilsTest, TestSweetSpotSimilarityFactory, UnloadDistributedZkTest, RangeFacetTest, DistanceFunctionTest, TestDocBasedVersionConstraints, ResourceLoaderTest, SolrRequestParserTest, TestDocumentBuilder, PathHierarchyTokenizerFactoryTest, TestLMDirichletSimilarityFactory, SynonymTokenizerTest, NotRequiredUniqueKeyTest, TestSolrQueryParserDefaultOperatorResource, DeleteReplicaTest, TestAddFieldRealTimeGet, CurrencyFieldXmlFileTest, TestDistribDocBasedVersion, ShardRoutingTest, LoggingHandlerTest, TestTrie, TermVectorComponentDistributedTest, ShardSplitTest, SystemInfoHandlerTest, TestStressLucene, EnumFieldTest, NoFacetTest, HdfsCollectionsAPIDistributedZkTest, HdfsBasicDistributedZkTest, CoreContainerCoreInitFailuresTest, TestOmitPositions, TestJmxMonitoredMap, ClusterStateTest, TestManagedSchema, TestSchemaNameResource, TestWriterPerf, TestSolrDeletionPolicy1, TestAnalyzeInfixSuggestions, CustomCollectionTest, PrimUtilsTest, StandardRequestHandlerTest, ExpressionTest, LeaderElectionIntegrationTest, TestRandomFaceting, TestStressUserVersions, IndexSchemaTest, SyncSliceTest, DocValuesMultiTest, DocumentBuilderTest, TestClassNameShortening, HdfsLockFactoryTest, TestStressRecovery, TestFunctionQuery, TestFileDictionaryLookup, TestFoldingMultitermQuery, OverseerTest, InfoHandlerTest, AddBlockUpdateTest, TestIBSimilarityFactory, BJQParserTest, TestAtomicUpdateErrorCases, TestSolrIndexConfig, TestJmxIntegration, LeaderElectionTest, MigrateRouteKeyTest, CacheHeaderTest, TestBM25SimilarityFactory, SolrCoreCheckLockOnStartupTest, TestStressReorder, TestUniqueKeyFieldResource, SolrInfoMBeanTest, ClusterStateUpdateTest, TestSolrJ, AssignTest, TestIndexSearcher, TestQuerySenderListener, SuggesterFSTTest, HighlighterConfigTest, TestSimpleQParserPlugin, TestFieldTypeResource, ChangedSchemaMergeTest, BasicDistributedZkTest, ChaosMonkeySafeLeaderTest, BasicDistributedZk2Test, CollectionsAPIDistributedZkTest, OpenCloseCoreStressTest, BasicZkTest, RecoveryZkTest, FullSolrCloudDistribCmdsTest, TestReplicationHandler, ZkSolrClientTest, TestZkChroot, TestRandomDVFaceting, ShardRoutingCustomTest, SliceStateUpdateTest, TestDistributedSearch, TestDistributedGrouping, TestRecovery, DistributedSpellCheckComponentTest, ZkControllerTest, TestJoin, TestMultiCoreConfBootstrap, TestReload, TestStressVersions, TestRangeQuery, TestCoreContainer, SolrCoreTest, StatsComponentTest, SpellCheckComponentTest, SolrCmdDistributorTest, QueryElevationComponentTest, PeerSyncTest, BadIndexSchemaTest, ConvertedLegacyTest, TestSort, TestFiltering, TestLazyCores, TestBadConfig, OverseerCollectionProcessorTest, HighlighterTest, SoftAutoCommitTest, ShowFileRequestHandlerTest, DistributedQueryElevationComponentTest, SolrIndexSplitterTest, TestCoreDiscovery, AnalysisAfterCoreReloadTest, SignatureUpdateProcessorFactoryTest, SpellCheckCollatorTest, CoreAdminHandlerTest, DocValuesTest, SuggesterTSTTest, SuggesterTest, SpatialFilterTest, TestCSVLoader, PolyFieldTest, NoCacheHeaderTest, WordBreakSolrSpellCheckerTest, SchemaVersionSpecificBehaviorTest, TestPseudoReturnFields, TestUpdate, QueryEqualityTest, DirectUpdateHandlerOptimizeTest, DefaultValueUpdateProcessorTest, TestRemoteStreaming, DebugComponentTest, IndexBasedSpellCheckerTest, TestSurroundQueryParser, TestQueryUtils, TestReversedWildcardFilterFactory, DocumentAnalysisRequestHandlerTest, TestQueryTypes, PrimitiveFieldTypeTest, RequestHandlersTest, TermVectorComponentTest, TestIndexingPerformance, MoreLikeThisHandlerTest, RequiredFieldsTest, TestSolrQueryParser, FastVectorHighlighterTest, RegexBoostProcessorTest, ReturnFieldsTest, TestCSVResponseWriter, QueryParsingTest, UniqFieldsUpdateProcessorFactoryTest, JsonLoaderTest, PingRequestHandlerTest, CSVRequestHandlerTest, TestComponentsName, TestBinaryResponseWriter, AlternateDirectoryTest, ResponseLogComponentTest, SolrIndexConfigTest, TestSolrDeletionPolicy2, SampleTest, TestDocSet, NumericFieldsTest, MinimalSchemaTest, TestConfig, OutputWriterTest, TestFuzzyAnalyzedSuggestions, TestSolrCoreProperties, TestPostingsSolrHighlighter, TestPhraseSuggestions, SpellPossibilityIteratorTest, TestCodecSupport, TestXIncludeConfig, TestDFRSimilarityFactory, TestLMJelinekMercerSimilarityFactory, LegacyHTMLStripCharFilterTest, TimeZoneUtilsTest, TestFastOutputStream, URLClassifyProcessorTest, PluginInfoTest, DateMathParserTest, PreAnalyzedFieldTest, TestSystemIdResolver, TestSuggestSpellingConverter, SpellingQueryConverterTest, DOMUtilTest, RAMDirectoryFactoryTest, ZkNodePropsTest, UUIDFieldTest, TestRTGBase, CursorPagingTest, SolrTestCaseJ4Test, TestCursorMarkWithoutUniqueKey, AbstractAnalyticsStatsTest, AbstractAnalyticsFacetTest, FieldFacetExtrasTest, QueryFacetTest, FunctionTest, DeleteShardTest, DistribCursorPagingTest, OverseerRolesTest]
   [junit4] Completed in 29.20s, 1 test, 1 error <<< FAILURES!

[...truncated 120 lines...]
BUILD FAILED
C:\Users\JenkinsSlave\workspace\Lucene-Solr-trunk-Windows\build.xml:453: The following error occurred while executing this line:
C:\Users\JenkinsSlave\workspace\Lucene-Solr-trunk-Windows\build.xml:433: The following error occurred while executing this line:
C:\Users\JenkinsSlave\workspace\Lucene-Solr-trunk-Windows\build.xml:39: The following error occurred while executing this line:
C:\Users\JenkinsSlave\workspace\Lucene-Solr-trunk-Windows\extra-targets.xml:37: The following error occurred while executing this line:
C:\Users\JenkinsSlave\workspace\Lucene-Solr-trunk-Windows\solr\build.xml:189: The following error occurred while executing this line:
C:\Users\JenkinsSlave\workspace\Lucene-Solr-trunk-Windows\solr\common-build.xml:491: The following error occurred while executing this line:
C:\Users\JenkinsSlave\workspace\Lucene-Solr-trunk-Windows\lucene\common-build.xml:1268: The following error occurred while executing this line:
C:\Users\JenkinsSlave\workspace\Lucene-Solr-trunk-Windows\lucene\common-build.xml:901: There were test failures: 365 suites, 1590 tests, 1 error, 40 ignored (12 assumptions)

Total time: 85 minutes 17 seconds
Build step 'Invoke Ant' marked build as failure
Description set: Java: 64bit/jdk1.7.0_51 -XX:-UseCompressedOops -XX:+UseConcMarkSweepGC
Archiving artifacts
Recording test results
Email was triggered for: Failure
Sending email for trigger: Failure



[JENKINS] Lucene-Solr-trunk-Windows (32bit/jdk1.8.0-ea-b124) - Build # 3740 - Still Failing!

Posted by Policeman Jenkins Server <je...@thetaphi.de>.
Build: http://jenkins.thetaphi.de/job/Lucene-Solr-trunk-Windows/3740/
Java: 32bit/jdk1.8.0-ea-b124 -server -XX:+UseG1GC

2 tests failed.
REGRESSION:  org.apache.solr.handler.TestReplicationHandler.doTestIndexAndConfigReplication

Error Message:
[C:\Users\JenkinsSlave\workspace\Lucene-Solr-trunk-Windows\solr\build\solr-core\test\J0\.\org.apache.solr.handler.TestReplicationHandler$SolrInstance-1391437210182\slave\collection1\data\, C:\Users\JenkinsSlave\workspace\Lucene-Solr-trunk-Windows\solr\build\solr-core\test\J0\.\org.apache.solr.handler.TestReplicationHandler$SolrInstance-1391437210182\slave\collection1\data\index, C:\Users\JenkinsSlave\workspace\Lucene-Solr-trunk-Windows\solr\build\solr-core\test\J0\.\org.apache.solr.handler.TestReplicationHandler$SolrInstance-1391437210182\slave\collection1\data\index.20140203162013990] expected:<2> but was:<3>

Stack Trace:
java.lang.AssertionError: [C:\Users\JenkinsSlave\workspace\Lucene-Solr-trunk-Windows\solr\build\solr-core\test\J0\.\org.apache.solr.handler.TestReplicationHandler$SolrInstance-1391437210182\slave\collection1\data\, C:\Users\JenkinsSlave\workspace\Lucene-Solr-trunk-Windows\solr\build\solr-core\test\J0\.\org.apache.solr.handler.TestReplicationHandler$SolrInstance-1391437210182\slave\collection1\data\index, C:\Users\JenkinsSlave\workspace\Lucene-Solr-trunk-Windows\solr\build\solr-core\test\J0\.\org.apache.solr.handler.TestReplicationHandler$SolrInstance-1391437210182\slave\collection1\data\index.20140203162013990] expected:<2> but was:<3>
	at __randomizedtesting.SeedInfo.seed([E2360CFC50397165:F67E57A9733ECC7B]:0)
	at org.junit.Assert.fail(Assert.java:93)
	at org.junit.Assert.failNotEquals(Assert.java:647)
	at org.junit.Assert.assertEquals(Assert.java:128)
	at org.junit.Assert.assertEquals(Assert.java:472)
	at org.apache.solr.handler.TestReplicationHandler.checkForSingleIndex(TestReplicationHandler.java:863)
	at org.apache.solr.handler.TestReplicationHandler.doTestIndexAndConfigReplication(TestReplicationHandler.java:569)
	at sun.reflect.NativeMethodAccessorImpl.invoke0(Native Method)
	at sun.reflect.NativeMethodAccessorImpl.invoke(NativeMethodAccessorImpl.java:62)
	at sun.reflect.DelegatingMethodAccessorImpl.invoke(DelegatingMethodAccessorImpl.java:43)
	at java.lang.reflect.Method.invoke(Method.java:483)
	at com.carrotsearch.randomizedtesting.RandomizedRunner.invoke(RandomizedRunner.java:1559)
	at com.carrotsearch.randomizedtesting.RandomizedRunner.access$600(RandomizedRunner.java:79)
	at com.carrotsearch.randomizedtesting.RandomizedRunner$6.evaluate(RandomizedRunner.java:737)
	at com.carrotsearch.randomizedtesting.RandomizedRunner$7.evaluate(RandomizedRunner.java:773)
	at com.carrotsearch.randomizedtesting.RandomizedRunner$8.evaluate(RandomizedRunner.java:787)
	at com.carrotsearch.randomizedtesting.rules.SystemPropertiesRestoreRule$1.evaluate(SystemPropertiesRestoreRule.java:53)
	at org.apache.lucene.util.TestRuleSetupTeardownChained$1.evaluate(TestRuleSetupTeardownChained.java:50)
	at org.apache.lucene.util.TestRuleFieldCacheSanity$1.evaluate(TestRuleFieldCacheSanity.java:51)
	at org.apache.lucene.util.AbstractBeforeAfterRule$1.evaluate(AbstractBeforeAfterRule.java:46)
	at com.carrotsearch.randomizedtesting.rules.SystemPropertiesInvariantRule$1.evaluate(SystemPropertiesInvariantRule.java:55)
	at org.apache.lucene.util.TestRuleThreadAndTestName$1.evaluate(TestRuleThreadAndTestName.java:49)
	at org.apache.lucene.util.TestRuleIgnoreAfterMaxFailures$1.evaluate(TestRuleIgnoreAfterMaxFailures.java:70)
	at org.apache.lucene.util.TestRuleMarkFailure$1.evaluate(TestRuleMarkFailure.java:48)
	at com.carrotsearch.randomizedtesting.rules.StatementAdapter.evaluate(StatementAdapter.java:36)
	at com.carrotsearch.randomizedtesting.ThreadLeakControl$StatementRunner.run(ThreadLeakControl.java:358)
	at com.carrotsearch.randomizedtesting.ThreadLeakControl.forkTimeoutingTask(ThreadLeakControl.java:782)
	at com.carrotsearch.randomizedtesting.ThreadLeakControl$3.evaluate(ThreadLeakControl.java:442)
	at com.carrotsearch.randomizedtesting.RandomizedRunner.runSingleTest(RandomizedRunner.java:746)
	at com.carrotsearch.randomizedtesting.RandomizedRunner$3.evaluate(RandomizedRunner.java:648)
	at com.carrotsearch.randomizedtesting.RandomizedRunner$4.evaluate(RandomizedRunner.java:682)
	at com.carrotsearch.randomizedtesting.RandomizedRunner$5.evaluate(RandomizedRunner.java:693)
	at com.carrotsearch.randomizedtesting.rules.StatementAdapter.evaluate(StatementAdapter.java:36)
	at com.carrotsearch.randomizedtesting.rules.SystemPropertiesRestoreRule$1.evaluate(SystemPropertiesRestoreRule.java:53)
	at org.apache.lucene.util.AbstractBeforeAfterRule$1.evaluate(AbstractBeforeAfterRule.java:46)
	at org.apache.lucene.util.TestRuleStoreClassName$1.evaluate(TestRuleStoreClassName.java:42)
	at com.carrotsearch.randomizedtesting.rules.SystemPropertiesInvariantRule$1.evaluate(SystemPropertiesInvariantRule.java:55)
	at com.carrotsearch.randomizedtesting.rules.NoShadowingOrOverridesOnMethodsRule$1.evaluate(NoShadowingOrOverridesOnMethodsRule.java:39)
	at com.carrotsearch.randomizedtesting.rules.NoShadowingOrOverridesOnMethodsRule$1.evaluate(NoShadowingOrOverridesOnMethodsRule.java:39)
	at com.carrotsearch.randomizedtesting.rules.StatementAdapter.evaluate(StatementAdapter.java:36)
	at org.apache.lucene.util.TestRuleAssertionsRequired$1.evaluate(TestRuleAssertionsRequired.java:43)
	at org.apache.lucene.util.TestRuleMarkFailure$1.evaluate(TestRuleMarkFailure.java:48)
	at org.apache.lucene.util.TestRuleIgnoreAfterMaxFailures$1.evaluate(TestRuleIgnoreAfterMaxFailures.java:70)
	at org.apache.lucene.util.TestRuleIgnoreTestSuites$1.evaluate(TestRuleIgnoreTestSuites.java:55)
	at com.carrotsearch.randomizedtesting.rules.StatementAdapter.evaluate(StatementAdapter.java:36)
	at com.carrotsearch.randomizedtesting.ThreadLeakControl$StatementRunner.run(ThreadLeakControl.java:358)
	at java.lang.Thread.run(Thread.java:744)


FAILED:  org.apache.solr.cloud.OverseerRolesTest.testDistribSearch

Error Message:
Captured an uncaught exception in thread: Thread[id=9677, name=Overseer-91189330008801294-127.0.0.1:57651_-n_0000000012, state=RUNNABLE, group=Overseer collection creation process.]

Stack Trace:
com.carrotsearch.randomizedtesting.UncaughtExceptionError: Captured an uncaught exception in thread: Thread[id=9677, name=Overseer-91189330008801294-127.0.0.1:57651_-n_0000000012, state=RUNNABLE, group=Overseer collection creation process.]
	at __randomizedtesting.SeedInfo.seed([E2360CFC50397165:63D082E427661159]:0)
Caused by: org.apache.solr.common.cloud.ZooKeeperException: 
	at __randomizedtesting.SeedInfo.seed([E2360CFC50397165]:0)
	at org.apache.solr.cloud.OverseerCollectionProcessor.run(OverseerCollectionProcessor.java:209)
	at java.lang.Thread.run(Thread.java:744)
Caused by: org.apache.zookeeper.KeeperException$NoNodeException: KeeperErrorCode = NoNode for /overseer/collection-queue-work/qn-0000000004
	at org.apache.zookeeper.KeeperException.create(KeeperException.java:111)
	at org.apache.zookeeper.KeeperException.create(KeeperException.java:51)
	at org.apache.zookeeper.ZooKeeper.delete(ZooKeeper.java:873)
	at org.apache.solr.common.cloud.SolrZkClient$2.execute(SolrZkClient.java:173)
	at org.apache.solr.common.cloud.SolrZkClient$2.execute(SolrZkClient.java:170)
	at org.apache.solr.common.cloud.ZkCmdExecutor.retryOperation(ZkCmdExecutor.java:73)
	at org.apache.solr.common.cloud.SolrZkClient.delete(SolrZkClient.java:170)
	at org.apache.solr.cloud.DistributedQueue.remove(DistributedQueue.java:193)
	at org.apache.solr.cloud.OverseerCollectionProcessor.run(OverseerCollectionProcessor.java:200)
	... 1 more




Build Log:
[...truncated 10381 lines...]
   [junit4] Suite: org.apache.solr.handler.TestReplicationHandler
   [junit4]   2> 790099 T3066 oas.SolrTestCaseJ4.setUp ###Starting testNoWriter
   [junit4]   2> 790125 T3066 oejs.Server.doStart jetty-8.1.10.v20130312
   [junit4]   2> 790132 T3066 oejs.AbstractConnector.doStart Started SelectChannelConnector@127.0.0.1:54036
   [junit4]   2> 790132 T3066 oass.SolrDispatchFilter.init SolrDispatchFilter.init()
   [junit4]   2> 790132 T3066 oasc.SolrResourceLoader.locateSolrHome JNDI not configured for solr (NoInitialContextEx)
   [junit4]   2> 790132 T3066 oasc.SolrResourceLoader.locateSolrHome using system property solr.solr.home: .\org.apache.solr.handler.TestReplicationHandler$SolrInstance-1391437175768\master
   [junit4]   2> 790132 T3066 oasc.SolrResourceLoader.<init> new SolrResourceLoader for directory: '.\org.apache.solr.handler.TestReplicationHandler$SolrInstance-1391437175768\master\'
   [junit4]   2> 790184 T3066 oasc.ConfigSolr.fromFile Loading container configuration from C:\Users\JenkinsSlave\workspace\Lucene-Solr-trunk-Windows\solr\build\solr-core\test\J0\.\org.apache.solr.handler.TestReplicationHandler$SolrInstance-1391437175768\master\solr.xml
   [junit4]   2> 790199 T3066 oasc.CoreContainer.<init> New CoreContainer 9546704
   [junit4]   2> 790199 T3066 oasc.CoreContainer.load Loading cores into CoreContainer [instanceDir=.\org.apache.solr.handler.TestReplicationHandler$SolrInstance-1391437175768\master\]
   [junit4]   2> 790200 T3066 oashc.HttpShardHandlerFactory.getParameter Setting socketTimeout to: 90000
   [junit4]   2> 790201 T3066 oashc.HttpShardHandlerFactory.getParameter Setting urlScheme to: http://
   [junit4]   2> 790201 T3066 oashc.HttpShardHandlerFactory.getParameter Setting connTimeout to: 15000
   [junit4]   2> 790201 T3066 oashc.HttpShardHandlerFactory.getParameter Setting maxConnectionsPerHost to: 20
   [junit4]   2> 790202 T3066 oashc.HttpShardHandlerFactory.getParameter Setting corePoolSize to: 0
   [junit4]   2> 790202 T3066 oashc.HttpShardHandlerFactory.getParameter Setting maximumPoolSize to: 2147483647
   [junit4]   2> 790203 T3066 oashc.HttpShardHandlerFactory.getParameter Setting maxThreadIdleTime to: 5
   [junit4]   2> 790203 T3066 oashc.HttpShardHandlerFactory.getParameter Setting sizeOfQueue to: -1
   [junit4]   2> 790203 T3066 oashc.HttpShardHandlerFactory.getParameter Setting fairnessPolicy to: false
   [junit4]   2> 790208 T3066 oasl.LogWatcher.createWatcher SLF4J impl is org.slf4j.impl.Log4jLoggerFactory
   [junit4]   2> 790208 T3066 oasl.LogWatcher.newRegisteredLogWatcher Registering Log Listener [Log4j (org.slf4j.impl.Log4jLoggerFactory)]
   [junit4]   2> 790209 T3066 oasc.CoreContainer.load Host Name: 127.0.0.1
   [junit4]   2> 790215 T3076 oasc.CoreContainer.create Creating SolrCore 'collection1' using instanceDir: .\org.apache.solr.handler.TestReplicationHandler$SolrInstance-1391437175768\master\collection1
   [junit4]   2> 790216 T3076 oasc.SolrResourceLoader.<init> new SolrResourceLoader for directory: '.\org.apache.solr.handler.TestReplicationHandler$SolrInstance-1391437175768\master\collection1\'
   [junit4]   2> 790247 T3076 oasc.SolrConfig.<init> Using Lucene MatchVersion: LUCENE_50
   [junit4]   2> 790254 T3076 oasc.SolrConfig.<init> Loaded SolrConfig: solrconfig.xml
   [junit4]   2> 790255 T3076 oass.IndexSchema.readSchema Reading Solr Schema from schema.xml
   [junit4]   2> 790258 T3076 oass.IndexSchema.readSchema [collection1] Schema name=test
   [junit4]   2> 790264 T3076 oass.IndexSchema.readSchema unique key field: id
   [junit4]   2> 790264 T3076 oasc.SolrCore.initDirectoryFactory org.apache.solr.core.MockDirectoryFactory
   [junit4]   2> 790265 T3076 oasc.SolrCore.<init> [collection1] Opening new SolrCore at .\org.apache.solr.handler.TestReplicationHandler$SolrInstance-1391437175768\master\collection1\, dataDir=C:\Users\JenkinsSlave\workspace\Lucene-Solr-trunk-Windows\solr\build\solr-core\test\J0\.\org.apache.solr.handler.TestReplicationHandler$SolrInstance-1391437175768\master\collection1\data\
   [junit4]   2> 790265 T3076 oasc.SolrCore.<init> JMX monitoring not detected for core: collection1
   [junit4]   2> 790266 T3076 oasc.CachingDirectoryFactory.get return new directory for C:\Users\JenkinsSlave\workspace\Lucene-Solr-trunk-Windows\solr\build\solr-core\test\J0\.\org.apache.solr.handler.TestReplicationHandler$SolrInstance-1391437175768\master\collection1\data\
   [junit4]   2> 790266 T3076 oasc.SolrCore.getNewIndexDir New index directory detected: old=null new=C:\Users\JenkinsSlave\workspace\Lucene-Solr-trunk-Windows\solr\build\solr-core\test\J0\.\org.apache.solr.handler.TestReplicationHandler$SolrInstance-1391437175768\master\collection1\data\index/
   [junit4]   2> 790266 T3076 oasc.SolrCore.initIndex WARN [collection1] Solr index directory 'C:\Users\JenkinsSlave\workspace\Lucene-Solr-trunk-Windows\solr\build\solr-core\test\J0\.\org.apache.solr.handler.TestReplicationHandler$SolrInstance-1391437175768\master\collection1\data\index' doesn't exist. Creating new index...
   [junit4]   2> 790267 T3076 oasc.CachingDirectoryFactory.get return new directory for C:\Users\JenkinsSlave\workspace\Lucene-Solr-trunk-Windows\solr\build\solr-core\test\J0\.\org.apache.solr.handler.TestReplicationHandler$SolrInstance-1391437175768\master\collection1\data\index
   [junit4]   2> 790268 T3076 oasu.RandomMergePolicy.<init> RandomMergePolicy wrapping class org.apache.lucene.index.TieredMergePolicy: [TieredMergePolicy: maxMergeAtOnce=13, maxMergeAtOnceExplicit=23, maxMergedSegmentMB=47.8701171875, floorSegmentMB=0.88671875, forceMergeDeletesPctAllowed=5.5741720020020065, segmentsPerTier=30.0, maxCFSSegmentSizeMB=8.796093022207999E12, noCFSRatio=0.0
   [junit4]   2> 790268 T3076 oasc.SolrDeletionPolicy.onCommit SolrDeletionPolicy.onCommit: commits: num=1
   [junit4]   2> 		commit{dir=MockDirectoryWrapper(org.apache.lucene.store.RAMDirectory@14a4728 lockFactory=org.apache.lucene.store.SingleInstanceLockFactory@1d931d8),segFN=segments_1,generation=1}
   [junit4]   2> 790269 T3076 oasc.SolrDeletionPolicy.updateCommits newest commit generation = 1
   [junit4]   2> 790270 T3076 oasc.SolrCore.loadUpdateProcessorChains no updateRequestProcessorChain defined as default, creating implicit default
   [junit4]   2> 790271 T3076 oasc.RequestHandlers.initHandlersFromConfig created standard: solr.StandardRequestHandler
   [junit4]   2> 790271 T3076 oasc.RequestHandlers.initHandlersFromConfig created /replication: solr.ReplicationHandler
   [junit4]   2> 790271 T3076 oasc.RequestHandlers.initHandlersFromConfig created defaults: solr.StandardRequestHandler
   [junit4]   2> 790271 T3076 oasc.RequestHandlers.initHandlersFromConfig adding lazy requestHandler: solr.StandardRequestHandler
   [junit4]   2> 790272 T3076 oasc.RequestHandlers.initHandlersFromConfig created lazy: solr.StandardRequestHandler
   [junit4]   2> 790272 T3076 oasc.RequestHandlers.initHandlersFromConfig created /update: solr.UpdateRequestHandler
   [junit4]   2> 790278 T3076 oashl.XMLLoader.init xsltCacheLifetimeSeconds=60
   [junit4]   2> 790280 T3076 oasu.CommitTracker.<init> Hard AutoCommit: disabled
   [junit4]   2> 790280 T3076 oasu.CommitTracker.<init> Soft AutoCommit: disabled
   [junit4]   2> 790280 T3076 oasu.RandomMergePolicy.<init> RandomMergePolicy wrapping class org.apache.lucene.index.AlcoholicMergePolicy: [AlcoholicMergePolicy: minMergeSize=0, mergeFactor=10, maxMergeSize=1697363906, maxMergeSizeForForcedMerge=9223372036854775807, calibrateSizeByDeletes=true, maxMergeDocs=2147483647, maxCFSSegmentSizeMB=8.796093022207999E12, noCFSRatio=0.1]
   [junit4]   2> 790281 T3076 oasc.SolrDeletionPolicy.onInit SolrDeletionPolicy.onInit: commits: num=1
   [junit4]   2> 		commit{dir=MockDirectoryWrapper(org.apache.lucene.store.RAMDirectory@14a4728 lockFactory=org.apache.lucene.store.SingleInstanceLockFactory@1d931d8),segFN=segments_1,generation=1}
   [junit4]   2> 790281 T3076 oasc.SolrDeletionPolicy.updateCommits newest commit generation = 1
   [junit4]   2> 790282 T3076 oass.SolrIndexSearcher.<init> Opening Searcher@d64883 main
   [junit4]   2> 790282 T3076 oash.ReplicationHandler.inform Replication enabled for following config files: schema.xml,xslt/dummy.xsl
   [junit4]   2> 790283 T3076 oash.ReplicationHandler.inform Commits will be reserved for  10000
   [junit4]   2> 790283 T3076 oasc.CoreContainer.registerCore registering core: collection1
   [junit4]   2> 790283 T3077 oasc.SolrCore.registerSearcher [collection1] Registered new searcher Searcher@d64883 main{StandardDirectoryReader(segments_1:1:nrt)}
   [junit4]   2> 790284 T3066 oass.SolrDispatchFilter.init user.dir=C:\Users\JenkinsSlave\workspace\Lucene-Solr-trunk-Windows\solr\build\solr-core\test\J0
   [junit4]   2> 790284 T3066 oass.SolrDispatchFilter.init SolrDispatchFilter.init() done
   [junit4]   2> 790304 T3066 oejs.Server.doStart jetty-8.1.10.v20130312
   [junit4]   2> 790309 T3066 oejs.AbstractConnector.doStart Started SelectChannelConnector@127.0.0.1:54039
   [junit4]   2> 790310 T3066 oass.SolrDispatchFilter.init SolrDispatchFilter.init()
   [junit4]   2> 790310 T3066 oasc.SolrResourceLoader.locateSolrHome JNDI not configured for solr (NoInitialContextEx)
   [junit4]   2> 790310 T3066 oasc.SolrResourceLoader.locateSolrHome using system property solr.solr.home: .\org.apache.solr.handler.TestReplicationHandler$SolrInstance-1391437175954\slave
   [junit4]   2> 790310 T3066 oasc.SolrResourceLoader.<init> new SolrResourceLoader for directory: '.\org.apache.solr.handler.TestReplicationHandler$SolrInstance-1391437175954\slave\'
   [junit4]   2> 790336 T3066 oasc.ConfigSolr.fromFile Loading container configuration from C:\Users\JenkinsSlave\workspace\Lucene-Solr-trunk-Windows\solr\build\solr-core\test\J0\.\org.apache.solr.handler.TestReplicationHandler$SolrInstance-1391437175954\slave\solr.xml
   [junit4]   2> 790345 T3066 oasc.CoreContainer.<init> New CoreContainer 10490609
   [junit4]   2> 790346 T3066 oasc.CoreContainer.load Loading cores into CoreContainer [instanceDir=.\org.apache.solr.handler.TestReplicationHandler$SolrInstance-1391437175954\slave\]
   [junit4]   2> 790347 T3066 oashc.HttpShardHandlerFactory.getParameter Setting socketTimeout to: 90000
   [junit4]   2> 790347 T3066 oashc.HttpShardHandlerFactory.getParameter Setting urlScheme to: http://
   [junit4]   2> 790347 T3066 oashc.HttpShardHandlerFactory.getParameter Setting connTimeout to: 15000
   [junit4]   2> 790348 T3066 oashc.HttpShardHandlerFactory.getParameter Setting maxConnectionsPerHost to: 20
   [junit4]   2> 790348 T3066 oashc.HttpShardHandlerFactory.getParameter Setting corePoolSize to: 0
   [junit4]   2> 790349 T3066 oashc.HttpShardHandlerFactory.getParameter Setting maximumPoolSize to: 2147483647
   [junit4]   2> 790349 T3066 oashc.HttpShardHandlerFactory.getParameter Setting maxThreadIdleTime to: 5
   [junit4]   2> 790349 T3066 oashc.HttpShardHandlerFactory.getParameter Setting sizeOfQueue to: -1
   [junit4]   2> 790350 T3066 oashc.HttpShardHandlerFactory.getParameter Setting fairnessPolicy to: false
   [junit4]   2> 790354 T3066 oasl.LogWatcher.createWatcher SLF4J impl is org.slf4j.impl.Log4jLoggerFactory
   [junit4]   2> 790355 T3066 oasl.LogWatcher.newRegisteredLogWatcher Registering Log Listener [Log4j (org.slf4j.impl.Log4jLoggerFactory)]
   [junit4]   2> 790355 T3066 oasc.CoreContainer.load Host Name: 127.0.0.1
   [junit4]   2> 790359 T3088 oasc.CoreContainer.create Creating SolrCore 'collection1' using instanceDir: .\org.apache.solr.handler.TestReplicationHandler$SolrInstance-1391437175954\slave\collection1
   [junit4]   2> 790361 T3088 oasc.SolrResourceLoader.<init> new SolrResourceLoader for directory: '.\org.apache.solr.handler.TestReplicationHandler$SolrInstance-1391437175954\slave\collection1\'
   [junit4]   2> 790393 T3088 oasc.SolrConfig.<init> Using Lucene MatchVersion: LUCENE_50
   [junit4]   2> 790400 T3088 oasc.SolrConfig.<init> Loaded SolrConfig: solrconfig.xml
   [junit4]   2> 790401 T3088 oass.IndexSchema.readSchema Reading Solr Schema from schema.xml
   [junit4]   2> 790405 T3088 oass.IndexSchema.readSchema [collection1] Schema name=test
   [junit4]   2> 790408 T3088 oass.IndexSchema.readSchema unique key field: id
   [junit4]   2> 790409 T3088 oasc.SolrCore.initDirectoryFactory org.apache.solr.core.MockDirectoryFactory
   [junit4]   2> 790409 T3088 oasc.SolrCore.<init> [collection1] Opening new SolrCore at .\org.apache.solr.handler.TestReplicationHandler$SolrInstance-1391437175954\slave\collection1\, dataDir=C:\Users\JenkinsSlave\workspace\Lucene-Solr-trunk-Windows\solr\build\solr-core\test\J0\.\org.apache.solr.handler.TestReplicationHandler$SolrInstance-1391437175954\slave\collection1\data\
   [junit4]   2> 790410 T3088 oasc.SolrCore.<init> JMX monitoring not detected for core: collection1
   [junit4]   2> 790411 T3088 oasc.CachingDirectoryFactory.get return new directory for C:\Users\JenkinsSlave\workspace\Lucene-Solr-trunk-Windows\solr\build\solr-core\test\J0\.\org.apache.solr.handler.TestReplicationHandler$SolrInstance-1391437175954\slave\collection1\data\
   [junit4]   2> 790411 T3088 oasc.SolrCore.getNewIndexDir New index directory detected: old=null new=C:\Users\JenkinsSlave\workspace\Lucene-Solr-trunk-Windows\solr\build\solr-core\test\J0\.\org.apache.solr.handler.TestReplicationHandler$SolrInstance-1391437175954\slave\collection1\data\index/
   [junit4]   2> 790411 T3088 oasc.SolrCore.initIndex WARN [collection1] Solr index directory 'C:\Users\JenkinsSlave\workspace\Lucene-Solr-trunk-Windows\solr\build\solr-core\test\J0\.\org.apache.solr.handler.TestReplicationHandler$SolrInstance-1391437175954\slave\collection1\data\index' doesn't exist. Creating new index...
   [junit4]   2> 790413 T3088 oasc.CachingDirectoryFactory.get return new directory for C:\Users\JenkinsSlave\workspace\Lucene-Solr-trunk-Windows\solr\build\solr-core\test\J0\.\org.apache.solr.handler.TestReplicationHandler$SolrInstance-1391437175954\slave\collection1\data\index
   [junit4]   2> 790413 T3088 oasu.RandomMergePolicy.<init> RandomMergePolicy wrapping class org.apache.lucene.index.TieredMergePolicy: [TieredMergePolicy: maxMergeAtOnce=13, maxMergeAtOnceExplicit=23, maxMergedSegmentMB=47.8701171875, floorSegmentMB=0.88671875, forceMergeDeletesPctAllowed=5.5741720020020065, segmentsPerTier=30.0, maxCFSSegmentSizeMB=8.796093022207999E12, noCFSRatio=0.0
   [junit4]   2> 790414 T3088 oasc.SolrDeletionPolicy.onCommit SolrDeletionPolicy.onCommit: commits: num=1
   [junit4]   2> 		commit{dir=MockDirectoryWrapper(org.apache.lucene.store.RAMDirectory@60d104 lockFactory=org.apache.lucene.store.SingleInstanceLockFactory@1b2ca59),segFN=segments_1,generation=1}
   [junit4]   2> 790415 T3088 oasc.SolrDeletionPolicy.updateCommits newest commit generation = 1
   [junit4]   2> 790417 T3088 oasc.SolrCore.loadUpdateProcessorChains no updateRequestProcessorChain defined as default, creating implicit default
   [junit4]   2> 790417 T3088 oasc.RequestHandlers.initHandlersFromConfig created standard: solr.StandardRequestHandler
   [junit4]   2> 790418 T3088 oasc.RequestHandlers.initHandlersFromConfig created defaults: solr.StandardRequestHandler
   [junit4]   2> 790418 T3088 oasc.RequestHandlers.initHandlersFromConfig adding lazy requestHandler: solr.StandardRequestHandler
   [junit4]   2> 790418 T3088 oasc.RequestHandlers.initHandlersFromConfig created lazy: solr.StandardRequestHandler
   [junit4]   2> 790419 T3088 oasc.RequestHandlers.initHandlersFromConfig created /update: solr.UpdateRequestHandler
   [junit4]   2> 790419 T3088 oasc.RequestHandlers.initHandlersFromConfig created /replication: solr.ReplicationHandler
   [junit4]   2> 790422 T3088 oashl.XMLLoader.init xsltCacheLifetimeSeconds=60
   [junit4]   2> 790426 T3088 oasu.CommitTracker.<init> Hard AutoCommit: disabled
   [junit4]   2> 790426 T3088 oasu.CommitTracker.<init> Soft AutoCommit: disabled
   [junit4]   2> 790427 T3088 oasu.RandomMergePolicy.<init> RandomMergePolicy wrapping class org.apache.lucene.index.AlcoholicMergePolicy: [AlcoholicMergePolicy: minMergeSize=0, mergeFactor=10, maxMergeSize=1697363906, maxMergeSizeForForcedMerge=9223372036854775807, calibrateSizeByDeletes=true, maxMergeDocs=2147483647, maxCFSSegmentSizeMB=8.796093022207999E12, noCFSRatio=0.1]
   [junit4]   2> 790427 T3088 oasc.SolrDeletionPolicy.onInit SolrDeletionPolicy.onInit: commits: num=1
   [junit4]   2> 		commit{dir=MockDirectoryWrapper(org.apache.lucene.store.RAMDirectory@60d104 lockFactory=org.apache.lucene.store.SingleInstanceLockFactory@1b2ca59),segFN=segments_1,generation=1}
   [junit4]   2> 790428 T3088 oasc.SolrDeletionPolicy.updateCommits newest commit generation = 1
   [junit4]   2> 790428 T3088 oass.SolrIndexSearcher.<init> Opening Searcher@7ab568 main
   [junit4]   2> 790428 T3088 oash.SnapPuller.startExecutorService Poll Scheduled at an interval of 1000ms
   [junit4]   2> 790428 T3089 oasc.SolrCore.registerSearcher [collection1] Registered new searcher Searcher@7ab568 main{StandardDirectoryReader(segments_1:1:nrt)}
   [junit4]   2> 790428 T3088 oasc.CoreContainer.registerCore registering core: collection1
   [junit4]   2> 790429 T3066 oass.SolrDispatchFilter.init user.dir=C:\Users\JenkinsSlave\workspace\Lucene-Solr-trunk-Windows\solr\build\solr-core\test\J0
   [junit4]   2> 790430 T3066 oass.SolrDispatchFilter.init SolrDispatchFilter.init() done
   [junit4]   2> 790447 T3066 oasc.CoreContainer.shutdown Shutting down CoreContainer instance=10490609
   [junit4]   2> 790449 T3066 oasc.SolrCore.close [collection1]  CLOSING SolrCore org.apache.solr.core.SolrCore@b7041f
   [junit4]   2> 790450 T3066 oasu.DirectUpdateHandler2.close closing DirectUpdateHandler2{commits=0,autocommits=0,soft autocommits=0,optimizes=0,rollbacks=0,expungeDeletes=0,docsPending=0,adds=0,deletesById=0,deletesByQuery=0,errors=0,cumulative_adds=0,cumulative_deletesById=0,cumulative_deletesByQuery=0,cumulative_errors=0}
   [junit4]   2> 790450 T3066 oasu.SolrCoreState.decrefSolrCoreState Closing SolrCoreState
   [junit4]   2> 790450 T3066 oasu.DefaultSolrCoreState.closeIndexWriter SolrCoreState ref count has reached 0 - closing IndexWriter
   [junit4]   2> 790450 T3066 oasu.DefaultSolrCoreState.closeIndexWriter closing IndexWriter with IndexWriterCloser
   [junit4]   2> 790451 T3066 oasc.SolrCore.closeSearcher [collection1] Closing main searcher on request.
   [junit4]   2> 790451 T3066 oasc.CachingDirectoryFactory.close Closing MockDirectoryFactory - 2 directories currently being tracked
   [junit4]   2> 790451 T3066 oasc.CachingDirectoryFactory.closeCacheValue looking to close C:\Users\JenkinsSlave\workspace\Lucene-Solr-trunk-Windows\solr\build\solr-core\test\J0\.\org.apache.solr.handler.TestReplicationHandler$SolrInstance-1391437175954\slave\collection1\data\ [CachedDir<<refCount=0;path=C:\Users\JenkinsSlave\workspace\Lucene-Solr-trunk-Windows\solr\build\solr-core\test\J0\.\org.apache.solr.handler.TestReplicationHandler$SolrInstance-1391437175954\slave\collection1\data\;done=false>>]
   [junit4]   2> 790451 T3066 oasc.CachingDirectoryFactory.close Closing directory: C:\Users\JenkinsSlave\workspace\Lucene-Solr-trunk-Windows\solr\build\solr-core\test\J0\.\org.apache.solr.handler.TestReplicationHandler$SolrInstance-1391437175954\slave\collection1\data\
   [junit4]   2> 790451 T3066 oasc.CachingDirectoryFactory.closeCacheValue looking to close C:\Users\JenkinsSlave\workspace\Lucene-Solr-trunk-Windows\solr\build\solr-core\test\J0\.\org.apache.solr.handler.TestReplicationHandler$SolrInstance-1391437175954\slave\collection1\data\index [CachedDir<<refCount=0;path=C:\Users\JenkinsSlave\workspace\Lucene-Solr-trunk-Windows\solr\build\solr-core\test\J0\.\org.apache.solr.handler.TestReplicationHandler$SolrInstance-1391437175954\slave\collection1\data\index;done=false>>]
   [junit4]   2> 790451 T3066 oasc.CachingDirectoryFactory.close Closing directory: C:\Users\JenkinsSlave\workspace\Lucene-Solr-trunk-Windows\solr\build\solr-core\test\J0\.\org.apache.solr.handler.TestReplicationHandler$SolrInstance-1391437175954\slave\collection1\data\index
   [junit4]   2> 790453 T3066 oejsh.ContextHandler.doStop stopped o.e.j.s.ServletContextHandler{/solr,null}
   [junit4]   2> 790519 T3066 oasc.CoreContainer.shutdown Shutting down CoreContainer instance=9546704
   [junit4]   2> 790523 T3066 oasc.SolrCore.close [collection1]  CLOSING SolrCore org.apache.solr.core.SolrCore@1ac84a0
   [junit4]   2> 790523 T3066 oasu.DirectUpdateHandler2.close closing DirectUpdateHandler2{commits=0,autocommits=0,soft autocommits=0,optimizes=0,rollbacks=0,expungeDeletes=0,docsPending=0,adds=0,deletesById=0,deletesByQuery=0,errors=0,cumulative_adds=0,cumulative_deletesById=0,cumulative_deletesByQuery=0,cumulative_errors=0}
   [junit4]   2> 790523 T3066 oasu.SolrCoreState.decrefSolrCoreState Closing SolrCoreState
   [junit4]   2> 790523 T3066 oasu.DefaultSolrCoreState.closeIndexWriter SolrCoreState ref count has reached 0 - closing IndexWriter
   [junit4]   2> 790523 T3066 oasu.DefaultSolrCoreState.closeIndexWriter closing IndexWriter with IndexWriterCloser
   [junit4]   2> 790526 T3066 oasc.SolrCore.closeSearcher [collection1] Closing main searcher on request.
   [junit4]   2> 790526 T3066 oasc.CachingDirectoryFactory.close Closing MockDirectoryFactory - 2 directories currently being tracked
   [junit4]   2> 790526 T3066 oasc.CachingDirectoryFactory.closeCacheValue looking to close C:\Users\JenkinsSlave\workspace\Lucene-Solr-trunk-Windows\solr\build\solr-core\test\J0\.\org.apache.solr.handler.TestReplicationHandler$SolrInstance-1391437175768\master\collection1\data\ [CachedDir<<refCount=0;path=C:\Users\JenkinsSlave\workspace\Lucene-Solr-trunk-Windows\solr\build\solr-core\test\J0\.\org.apache.solr.handler.TestReplicationHandler$SolrInstance-1391437175768\master\collection1\data\;done=false>>]
   [junit4]   2> 790526 T3066 oasc.CachingDirectoryFactory.close Closing directory: C:\Users\JenkinsSlave\workspace\Lucene-Solr-trunk-Windows\solr\build\solr-core\test\J0\.\org.apache.solr.handler.TestReplicationHandler$SolrInstance-1391437175768\master\collection1\data\
   [junit4]   2> 790526 T3066 oasc.CachingDirectoryFactory.closeCacheValue looking to close C:\Users\JenkinsSlave\workspace\Lucene-Solr-trunk-Windows\solr\build\solr-core\test\J0\.\org.apache.solr.handler.TestReplicationHandler$SolrInstance-1391437175768\master\collection1\data\index [CachedDir<<refCount=0;path=C:\Users\JenkinsSlave\workspace\Lucene-Solr-trunk-Windows\solr\build\solr-core\test\J0\.\org.apache.solr.handler.TestReplicationHandler$SolrInstance-1391437175768\master\collection1\data\index;done=false>>]
   [junit4]   2> 790529 T3066 oasc.CachingDirectoryFactory.close Closing directory: C:\Users\JenkinsSlave\workspace\Lucene-Solr-trunk-Windows\solr\build\solr-core\test\J0\.\org.apache.solr.handler.TestReplicationHandler$SolrInstance-1391437175768\master\collection1\data\index
   [junit4]   2> 790529 T3066 oejsh.ContextHandler.doStop stopped o.e.j.s.ServletContextHandler{/solr,null}
   [junit4]   2> 790582 T3066 oejs.Server.doStart jetty-8.1.10.v20130312
   [junit4]   2> 790589 T3066 oejs.AbstractConnector.doStart Started SelectChannelConnector@127.0.0.1:54039
   [junit4]   2> 790590 T3066 oass.SolrDispatchFilter.init SolrDispatchFilter.init()
   [junit4]   2> 790591 T3066 oasc.SolrResourceLoader.locateSolrHome JNDI not configured for solr (NoInitialContextEx)
   [junit4]   2> 790591 T3066 oasc.SolrResourceLoader.locateSolrHome using system property solr.solr.home: .\org.apache.solr.handler.TestReplicationHandler$SolrInstance-1391437175954\slave
   [junit4]   2> 790591 T3066 oasc.SolrResourceLoader.<init> new SolrResourceLoader for directory: '.\org.apache.solr.handler.TestReplicationHandler$SolrInstance-1391437175954\slave\'
   [junit4]   2> 790620 T3066 oasc.ConfigSolr.fromFile Loading container configuration from C:\Users\JenkinsSlave\workspace\Lucene-Solr-trunk-Windows\solr\build\solr-core\test\J0\.\org.apache.solr.handler.TestReplicationHandler$SolrInstance-1391437175954\slave\solr.xml
   [junit4]   2> 790629 T3066 oasc.CoreContainer.<init> New CoreContainer 14128347
   [junit4]   2> 790630 T3066 oasc.CoreContainer.load Loading cores into CoreContainer [instanceDir=.\org.apache.solr.handler.TestReplicationHandler$SolrInstance-1391437175954\slave\]
   [junit4]   2> 790630 T3066 oashc.HttpShardHandlerFactory.getParameter Setting socketTimeout to: 90000
   [junit4]   2> 790631 T3066 oashc.HttpShardHandlerFactory.getParameter Setting urlScheme to: http://
   [junit4]   2> 790631 T3066 oashc.HttpShardHandlerFactory.getParameter Setting connTimeout to: 15000
   [junit4]   2> 790632 T3066 oashc.HttpShardHandlerFactory.getParameter Setting maxConnectionsPerHost to: 20
   [junit4]   2> 790632 T3066 oashc.HttpShardHandlerFactory.getParameter Setting corePoolSize to: 0
   [junit4]   2> 790632 T3066 oashc.HttpShardHandlerFactory.getParameter Setting maximumPoolSize to: 2147483647
   [junit4]   2> 790633 T3066 oashc.HttpShardHandlerFactory.getParameter Setting maxThreadIdleTime to: 5
   [junit4]   2> 790633 T3066 oashc.HttpShardHandlerFactory.getParameter Setting sizeOfQueue to: -1
   [junit4]   2> 790633 T3066 oashc.HttpShardHandlerFactory.getParameter Setting fairnessPolicy to: false
   [junit4]   2> 790638 T3066 oasl.LogWatcher.createWatcher SLF4J impl is org.slf4j.impl.Log4jLoggerFactory
   [junit4]   2> 790638 T3066 oasl.LogWatcher.newRegisteredLogWatcher Registering Log Listener [Log4j (org.slf4j.impl.Log4jLoggerFactory)]
   [junit4]   2> 790639 T3066 oasc.CoreContainer.load Host Name: 127.0.0.1
   [junit4]   2> 790642 T3101 oasc.CoreContainer.create Creating SolrCore 'collection1' using instanceDir: .\org.apache.solr.handler.TestReplicationHandler$SolrInstance-1391437175954\slave\collection1
   [junit4]   2> 790643 T3101 oasc.SolrResourceLoader.<init> new SolrResourceLoader for directory: '.\org.apache.solr.handler.TestReplicationHandler$SolrInstance-1391437175954\slave\collection1\'
   [junit4]   2> 790685 T3101 oasc.SolrConfig.<init> Using Lucene MatchVersion: LUCENE_50
   [junit4]   2> 790711 T3101 oasc.SolrConfig.<init> Loaded SolrConfig: solrconfig.xml
   [junit4]   2> 790711 T3101 oass.IndexSchema.readSchema Reading Solr Schema from schema.xml
   [junit4]   2> 790714 T3101 oass.IndexSchema.readSchema [collection1] Schema name=test
   [junit4]   2> 790717 T3101 oass.IndexSchema.readSchema unique key field: id
   [junit4]   2> 790717 T3101 oasc.SolrCore.initDirectoryFactory solr.NRTCachingDirectoryFactory
   [junit4]   2> 790718 T3101 oasc.SolrCore.<init> [collection1] Opening new SolrCore at .\org.apache.solr.handler.TestReplicationHandler$SolrInstance-1391437175954\slave\collection1\, dataDir=C:\Users\JenkinsSlave\workspace\Lucene-Solr-trunk-Windows\solr\build\solr-core\test\J0\org.apache.solr.handler.TestReplicationHandler$SolrInstance-1391437175954\slave\collection1\data\
   [junit4]   2> 790718 T3101 oasc.SolrCore.<init> JMX monitoring not detected for core: collection1
   [junit4]   2> 790718 T3101 oasc.CachingDirectoryFactory.get return new directory for C:\Users\JenkinsSlave\workspace\Lucene-Solr-trunk-Windows\solr\build\solr-core\test\J0\org.apache.solr.handler.TestReplicationHandler$SolrInstance-1391437175954\slave\collection1\data
   [junit4]   2> 790718 T3101 oasc.SolrCore.getNewIndexDir New index directory detected: old=null new=C:\Users\JenkinsSlave\workspace\Lucene-Solr-trunk-Windows\solr\build\solr-core\test\J0\org.apache.solr.handler.TestReplicationHandler$SolrInstance-1391437175954\slave\collection1\data\index/
   [junit4]   2> 790721 T3101 oasc.SolrCore.initIndex WARN [collection1] Solr index directory 'C:\Users\JenkinsSlave\workspace\Lucene-Solr-trunk-Windows\solr\build\solr-core\test\J0\org.apache.solr.handler.TestReplicationHandler$SolrInstance-1391437175954\slave\collection1\data\index' doesn't exist. Creating new index...
   [junit4]   2> 790722 T3101 oasc.CachingDirectoryFactory.get return new directory for C:\Users\JenkinsSlave\workspace\Lucene-Solr-trunk-Windows\solr\build\solr-core\test\J0\org.apache.solr.handler.TestReplicationHandler$SolrInstance-1391437175954\slave\collection1\data\index
   [junit4]   2> 790723 T3101 oasu.RandomMergePolicy.<init> RandomMergePolicy wrapping class org.apache.lucene.index.LogByteSizeMergePolicy: [LogByteSizeMergePolicy: minMergeSize=1677721, mergeFactor=24, maxMergeSize=2147483648, maxMergeSizeForForcedMerge=9223372036854775807, calibrateSizeByDeletes=false, maxMergeDocs=2147483647, maxCFSSegmentSizeMB=8.796093022207999E12, noCFSRatio=0.38130184583998683]
   [junit4]   2> 790730 T3101 oasc.SolrDeletionPolicy.onCommit SolrDeletionPolicy.onCommit: commits: num=1
   [junit4]   2> 		commit{dir=NRTCachingDirectory(org.apache.lucene.store.SimpleFSDirectory@C:\Users\JenkinsSlave\workspace\Lucene-Solr-trunk-Windows\solr\build\solr-core\test\J0\org.apache.solr.handler.TestReplicationHandler$SolrInstance-1391437175954\slave\collection1\data\index lockFactory=org.apache.lucene.store.SingleInstanceLockFactory@15a5342; maxCacheMB=48.0 maxMergeSizeMB=4.0),segFN=segments_1,generation=1}
   [junit4]   2> 790730 T3101 oasc.SolrDeletionPolicy.updateCommits newest commit generation = 1
   [junit4]   2> 790732 T3101 oasc.SolrCore.loadUpdateProcessorChains no updateRequestProcessorChain defined as default, creating implicit default
   [junit4]   2> 790733 T3101 oasc.RequestHandlers.initHandlersFromConfig created standard: solr.StandardRequestHandler
   [junit4]   2> 790733 T3101 oasc.RequestHandlers.initHandlersFromConfig created defaults: solr.StandardRequestHandler
   [junit4]   2> 790733 T3101 oasc.RequestHandlers.initHandlersFromConfig adding lazy requestHandler: solr.StandardRequestHandler
   [junit4]   2> 790733 T3101 oasc.RequestHandlers.initHandlersFromConfig created lazy: solr.StandardRequestHandler
   [junit4]   2> 790734 T3101 oasc.RequestHandlers.initHandlersFromConfig created /update: solr.UpdateRequestHandler
   [junit4]   2> 790734 T3101 oasc.RequestHandlers.initHandlersFromConfig created /replication: solr.ReplicationHandler
   [junit4]   2> 790740 T3101 oashl.XMLLoader.init xsltCacheLifetimeSeconds=60
   [junit4]   2> 790742 T3101 oasu.CommitTracker.<init> Hard AutoCommit: disabled
   [junit4]   2> 790742 T3101 oasu.CommitTracker.<init> Soft AutoCommit: disabled
   [junit4]   2> 790742 T3101 oass.SolrIndexSearcher.<init> Opening Searcher@1bad9c5 main
   [junit4]   2> 790748 T3101 oash.SnapPuller.startExecutorService Poll Scheduled at an interval of 1000ms
   [junit4]   2> 790749 T3101 oasc.CoreContainer.registerCore registering core: collection1
   [junit4]   2> 790749 T3102 oasc.SolrCore.registerSearcher [collection1] Registered new searcher Searcher@1bad9c5 main{StandardDirectoryReader(segments_1:1)}
   [junit4]   2> 790750 T3066 oass.SolrDispatchFilter.init user.dir=C:\Users\JenkinsSlave\workspace\Lucene-Solr-trunk-Windows\solr\build\solr-core\test\J0
   [junit4]   2> 790750 T3066 oass.SolrDispatchFilter.init SolrDispatchFilter.init() done
   [junit4]   2> 790751 T3066 oejs.Server.doStart jetty-8.1.10.v20130312
   [junit4]   2> 790757 T3066 oejs.AbstractConnector.doStart Started SelectChannelConnector@127.0.0.1:54036
   [junit4]   2> 790759 T3066 oass.SolrDispatchFilter.init SolrDispatchFilter.init()
   [junit4]   2> 790759 T3066 oasc.SolrResourceLoader.locateSolrHome JNDI not configured for solr (NoInitialContextEx)
   [junit4]   2> 790760 T3066 oasc.SolrResourceLoader.locateSolrHome using system property solr.solr.home: .\org.apache.solr.handler.TestReplicationHandler$SolrInstance-1391437175768\master
   [junit4]   2> 790760 T3066 oasc.SolrResourceLoader.<init> new SolrResourceLoader for directory: '.\org.apache.solr.handler.TestReplicationHandler$SolrInstance-1391437175768\master\'
   [junit4]   2> 790798 T3066 oasc.ConfigSolr.fromFile Loading container configuration from C:\Users\JenkinsSlave\workspace\Lucene-Solr-trunk-Windows\solr\build\solr-core\test\J0\.\org.apache.solr.handler.TestReplicationHandler$SolrInstance-1391437175768\master\solr.xml
   [junit4]   2> 790815 T3066 oasc.CoreContainer.<init> New CoreContainer 19135616
   [junit4]   2> 790816 T3066 oasc.CoreContainer.load Loading cores into CoreContainer [instanceDir=.\org.apache.solr.handler.TestReplicationHandler$SolrInstance-1391437175768\master\]
   [junit4]   2> 790817 T3066 oashc.HttpShardHandlerFactory.getParameter Setting socketTimeout to: 90000
   [junit4]   2> 790818 T3066 oashc.HttpShardHandlerFactory.getParameter Setting urlScheme to: http://
   [junit4]   2> 790818 T3066 oashc.HttpShardHandlerFactory.getParameter Setting connTimeout to: 15000
   [junit4]   2> 790819 T3066 oashc.HttpShardHandlerFactory.getParameter Setting maxConnectionsPerHost to: 20
   [junit4]   2> 790819 T3066 oashc.HttpShardHandlerFactory.getParameter Setting corePoolSize to: 0
   [junit4]   2> 790821 T3066 oashc.HttpShardHandlerFactory.getParameter Setting maximumPoolSize to: 2147483647
   [junit4]   2> 790821 T3066 oashc.HttpShardHandlerFactory.getParameter Setting maxThreadIdleTime to: 5
   [junit4]   2> 790821 T3066 oashc.HttpShardHandlerFactory.getParameter Setting sizeOfQueue to: -1
   [junit4]   2> 790821 T3066 oashc.HttpShardHandlerFactory.getParameter Setting fairnessPolicy to: false
   [junit4]   2> 790830 T3066 oasl.LogWatcher.createWatcher SLF4J impl is org.slf4j.impl.Log4jLoggerFactory
   [junit4]   2> 790830 T3066 oasl.LogWatcher.newRegisteredLogWatcher Registering Log Listener [Log4j (org.slf4j.impl.Log4jLoggerFactory)]
   [junit4]   2> 790830 T3066 oasc.CoreContainer.load Host Name: 127.0.0.1
   [junit4]   2> 790834 T3114 oasc.CoreContainer.create Creating SolrCore 'collection1' using instanceDir: .\org.apache.solr.handler.TestReplicationHandler$SolrInstance-1391437175768\master\collection1
   [junit4]   2> 790835 T3114 oasc.SolrResourceLoader.<init> new SolrResourceLoader for directory: '.\org.apache.solr.handler.TestReplicationHandler$SolrInstance-1391437175768\master\collection1\'
   [junit4]   2> 790862 T3114 oasc.SolrConfig.<init> Using Lucene MatchVersion: LUCENE_50
   [junit4]   2> 790869 T3114 oasc.SolrConfig.<init> Loaded SolrConfig: solrconfig.xml
   [junit4]   2> 790869 T3114 oass.IndexSchema.readSchema Reading Solr Schema from schema.xml
   [junit4]   2> 790873 T3114 oass.IndexSchema.readSchema [collection1] Schema name=test
   [junit4]   2> 790879 T3114 oass.IndexSchema.readSchema unique key field: id
   [junit4]   2> 790879 T3114 oasc.SolrCore.initDirectoryFactory solr.NRTCachingDirectoryFactory
   [junit4]   2> 790883 T3114 oasc.SolrCore.<init> [collection1] Opening new SolrCore at .\org.apache.solr.handler.TestReplicationHandler$SolrInstance-1391437175768\master\collection1\, dataDir=C:\Users\JenkinsSlave\workspace\Lucene-Solr-trunk-Windows\solr\build\solr-core\test\J0\org.apache.solr.handler.TestReplicationHandler$SolrInstance-1391437175768\master\collection1\data\
   [junit4]   2> 790883 T3114 oasc.SolrCore.<init> JMX monitoring not detected for core: collection1
   [junit4]   2> 790883 T3114 oasc.CachingDirectoryFactory.get return new directory for C:\Users\JenkinsSlave\workspace\Lucene-Solr-trunk-Windows\solr\build\solr-core\test\J0\org.apache.solr.handler.TestReplicationHandler$SolrInstance-1391437175768\master\collection1\data
   [junit4]   2> 790886 T3114 oasc.SolrCore.getNewIndexDir New index directory detected: old=null new=C:\Users\JenkinsSlave\workspace\Lucene-Solr-trunk-Windows\solr\build\solr-core\test\J0\org.apache.solr.handler.TestReplicationHandler$SolrInstance-1391437175768\master\collection1\data\index/
   [junit4]   2> 790886 T3114 oasc.SolrCore.initIndex WARN [collection1] Solr index directory 'C:\Users\JenkinsSlave\workspace\Lucene-Solr-trunk-Windows\solr\build\solr-core\test\J0\org.apache.solr.handler.TestReplicationHandler$SolrInstance-1391437175768\master\collection1\data\index' doesn't exist. Creating new index...
   [junit4]   2> 790888 T3114 oasc.CachingDirectoryFactory.get return new directory for C:\Users\JenkinsSlave\workspace\Lucene-Solr-trunk-Windows\solr\build\solr-core\test\J0\org.apache.solr.handler.TestReplicationHandler$SolrInstance-1391437175768\master\collection1\data\index
   [junit4]   2> 790889 T3114 oasu.RandomMergePolicy.<init> RandomMergePolicy wrapping class org.apache.lucene.index.LogByteSizeMergePolicy: [LogByteSizeMergePolicy: minMergeSize=1677721, mergeFactor=24, maxMergeSize=2147483648, maxMergeSizeForForcedMerge=9223372036854775807, calibrateSizeByDeletes=false, maxMergeDocs=2147483647, maxCFSSegmentSizeMB=8.796093022207999E12, noCFSRatio=0.38130184583998683]
   [junit4]   2> 790895 T3114 oasc.SolrDeletionPolicy.onCommit SolrDeletionPolicy.onCommit: commits: num=1
   [junit4]   2> 		commit{dir=NRTCachingDirectory(org.apache.lucene.store.SimpleFSDirectory@C:\Users\JenkinsSlave\workspace\Lucene-Solr-trunk-Windows\solr\build\solr-core\test\J0\org.apache.solr.handler.TestReplicationHandler$SolrInstance-1391437175768\master\collection1\data\index lockFactory=org.apache.lucene.store.SingleInstanceLockFactory@127d309; maxCacheMB=48.0 maxMergeSizeMB=4.0),segFN=segments_1,generation=1}
   [junit4]   2> 790895 T3114 oasc.SolrDeletionPolicy.updateCommits newest commit generation = 1
   [junit4]   2> 790897 T3114 oasc.SolrCore.loadUpdateProcessorChains no updateRequestProcessorChain defined as default, creating implicit default
   [junit4]   2> 790897 T3114 oasc.RequestHandlers.initHandlersFromConfig created standard: solr.StandardRequestHandler
   [junit4]   2> 790898 T3114 oasc.RequestHandlers.initHandlersFromConfig created /replication: solr.ReplicationHandler
   [junit4]   2> 790898 T3114 oasc.RequestHandlers.initHandlersFromConfig created defaults: solr.StandardRequestHandler
   [junit4]   2> 790898 T3114 oasc.RequestHandlers.initHandlersFromConfig adding lazy requestHandler: solr.StandardRequestHandler
   [junit4]   2> 790898 T3114 oasc.RequestHandlers.initHandlersFromConfig created lazy: solr.StandardRequestHandler
   [junit4]   2> 790899 T3114 oasc.RequestHandlers.initHandlersFromConfig created /update: solr.UpdateRequestHandler
   [junit4]   2> 790908 T3114 oashl.XMLLoader.init xsltCacheLifetimeSeconds=60
   [junit4]   2> 790909 T3114 oasu.CommitTracker.<init> Hard AutoCommit: disabled
   [junit4]   2> 790910 T3114 oasu.CommitTracker.<init> Soft AutoCommit: disabled
   [junit4]   2> 790912 T3114 oass.SolrIndexSearcher.<init> Opening Searcher@863789 main
   [junit4]   2> 790912 T3114 oash.ReplicationHandler.inform Replication enabled for following config files: schema.xml,xslt/dummy.xsl
   [junit4]   2> 790912 T3114 oash.ReplicationHandler.inform Commits will be reserved for  10000
   [junit4]   2> 790913 T3114 oasc.CoreContainer.registerCore registering core: collection1
   [junit4]   2> 790913 T3115 oasc.SolrCore.registerSearcher [collection1] Registered new searcher Searcher@863789 main{StandardDirectoryReader(segments_1:1)}
   [junit4]   2> 790914 T3066 oass.SolrDispatchFilter.init user.dir=C:\Users\JenkinsSlave\workspace\Lucene-Solr-trunk-Windows\solr\build\solr-core\test\J0
   [junit4]   2> 790914 T3066 oass.SolrDispatchFilter.init SolrDispatchFilter.init() done
   [junit4]   2> ASYNC  NEW_CORE C1397 name=collection1 org.apache.solr.core.SolrCore@b28b6d
   [junit4]   2> 790920 T3095 C1397 oasu.RandomMergePolicy.<init> RandomMergePolicy wrapping class org.apache.lucene.index.LogByteSizeMergePolicy: [LogByteSizeMergePolicy: minMergeSize=1677721, mergeFactor=24, maxMergeSize=2147483648, maxMergeSizeForForcedMerge=9223372036854775807, calibrateSizeByDeletes=false, maxMergeDocs=2147483647, maxCFSSegmentSizeMB=8.796093022207999E12, noCFSRatio=0.38130184583998683]
   [junit4]   2> 790923 T3095 C1397 oasc.SolrDeletionPolicy.onInit SolrDeletionPolicy.onInit: commits: num=1
   [junit4]   2> 		commit{dir=NRTCachingDirectory(org.apache.lucene.store.SimpleFSDirectory@C:\Users\JenkinsSlave\workspace\Lucene-Solr-trunk-Windows\solr\build\solr-core\test\J0\org.apache.solr.handler.TestReplicationHandler$SolrInstance-1391437175954\slave\collection1\data\index lockFactory=org.apache.lucene.store.SingleInstanceLockFactory@15a5342; maxCacheMB=48.0 maxMergeSizeMB=4.0),segFN=segments_1,generation=1}
   [junit4]   2> 790925 T3095 C1397 oasc.SolrDeletionPolicy.updateCommits newest commit generation = 1
   [junit4]   2> 790926 T3095 C1397 oasup.LogUpdateProcessor.finish [collection1] webapp=/solr path=/update params={wt=javabin&version=2} {add=[123456]} 0 8
   [junit4]   2> 790933 T3096 C1397 oasu.DirectUpdateHandler2.commit start commit{,optimize=false,openSearcher=true,waitSearcher=true,expungeDeletes=false,softCommit=false,prepareCommit=false}
   [junit4]   2> 790957 T3096 C1397 oasc.SolrDeletionPolicy.onCommit SolrDeletionPolicy.onCommit: commits: num=2
   [junit4]   2> 		commit{dir=NRTCachingDirectory(org.apache.lucene.store.SimpleFSDirectory@C:\Users\JenkinsSlave\workspace\Lucene-Solr-trunk-Windows\solr\build\solr-core\test\J0\org.apache.solr.handler.TestReplicationHandler$SolrInstance-1391437175954\slave\collection1\data\index lockFactory=org.apache.lucene.store.SingleInstanceLockFactory@15a5342; maxCacheMB=48.0 maxMergeSizeMB=4.0),segFN=segments_1,generation=1}
   [junit4]   2> 		commit{dir=NRTCachingDirectory(org.apache.lucene.store.SimpleFSDirectory@C:\Users\JenkinsSlave\workspace\Lucene-Solr-trunk-Windows\solr\build\solr-core\test\J0\org.apache.solr.handler.TestReplicationHandler$SolrInstance-1391437175954\slave\collection1\data\index lockFactory=org.apache.lucene.store.SingleInstanceLockFactory@15a5342; maxCacheMB=48.0 maxMergeSizeMB=4.0),segFN=segments_2,generation=2}
   [junit4]   2> 790958 T3096 C1397 oasc.SolrDeletionPolicy.updateCommits newest commit generation = 2
   [junit4]   2> 790965 T3096 C1397 oass.SolrIndexSearcher.<init> Opening Searcher@e497 main
   [junit4]   2> 790966 T3096 C1397 oasu.DirectUpdateHandler2.commit end_commit_flush
   [junit4]   2> 790966 T3102 oasc.SolrCore.registerSearcher [collection1] Registered new searcher Searcher@e497 main{StandardDirectoryReader(segments_2:3 _0(5.0):C1)}
   [junit4]   2> 790967 T3096 C1397 oasup.LogUpdateProcessor.finish [collection1] webapp=/solr path=/update params={waitSearcher=true&commit=true&softCommit=false&wt=javabin&version=2} {commit=} 0 35
   [junit4]   2> 790982 T3066 oasc.CoreContainer.shutdown Shutting down CoreContainer instance=14128347
   [junit4]   2> 790984 T3066 oasc.SolrCore.close [collection1]  CLOSING SolrCore org.apache.solr.core.SolrCore@b28b6d
   [junit4]   2> 790984 T3066 oasu.DirectUpdateHandler2.close closing DirectUpdateHandler2{commits=1,autocommits=0,soft autocommits=0,optimizes=0,rollbacks=0,expungeDeletes=0,docsPending=0,adds=0,deletesById=0,deletesByQuery=0,errors=0,cumulative_adds=1,cumulative_deletesById=0,cumulative_deletesByQuery=0,cumulative_errors=0}
   [junit4]   2> 790986 T3066 oasu.SolrCoreState.decrefSolrCoreState Closing SolrCoreState
   [junit4]   2> 790986 T3066 oasu.DefaultSolrCoreState.closeIndexWriter SolrCoreState ref count has reached 0 - closing IndexWriter
   [junit4]   2> 790986 T3066 oasu.DefaultSolrCoreState.closeIndexWriter closing IndexWriter with IndexWriterCloser
   [junit4]   2> 790988 T3066 oasc.SolrCore.closeSearcher [collection1] Closing main searcher on request.
   [junit4]   2> 790989 T3066 oasc.CachingDirectoryFactory.close Closing NRTCachingDirectoryFactory - 2 directories currently being tracked
   [junit4]   2> 790989 T3066 oasc.CachingDirectoryFactory.closeCacheValue looking to close C:\Users\JenkinsSlave\workspace\Lucene-Solr-trunk-Windows\solr\build\solr-core\test\J0\org.apache.solr.handler.TestReplicationHandler$SolrInstance-1391437175954\slave\collection1\data [CachedDir<<refCount=0;path=C:\Users\JenkinsSlave\workspace\Lucene-Solr-trunk-Windows\solr\build\solr-core\test\J0\org.apache.solr.handler.TestReplicationHandler$SolrInstance-1391437175954\slave\collection1\data;done=false>>]
   [junit4]   2> 790989 T3066 oasc.CachingDirectoryFactory.close Closing directory: C:\Users\JenkinsSlave\workspace\Lucene-Solr-trunk-Windows\solr\build\solr-core\test\J0\org.apache.solr.handler.TestReplicationHandler$SolrInstance-1391437175954\slave\collection1\data
   [junit4]   2> 790989 T3066 oasc.CachingDirectoryFactory.closeCacheValue looking to close C:\Users\JenkinsSlave\workspace\Lucene-Solr-trunk-Windows\solr\build\solr-core\test\J0\org.apache.solr.handler.TestReplicationHandler$SolrInstance-1391437175954\slave\collection1\data\index [CachedDir<<refCount=0;path=C:\Users\JenkinsSlave\workspace\Lucene-Solr-trunk-Windows\solr\build\solr-core\test\J0\org.apache.solr.handler.TestReplicationHandler$SolrInstance-1391437175954\slave\collection1\data\index;done=false>>]
   [junit4]   2> 790989 T3066 oasc.CachingDirectoryFactory.close Closing directory: C:\Users\JenkinsSlave\workspace\Lucene-Solr-trunk-Windows\solr\build\solr-core\test\J0\org.apache.solr.handler.TestReplicationHandler$SolrInstance-1391437175954\slave\collection1\data\index
   [junit4]   2> 790992 T3066 oejsh.ContextHandler.doStop stopped o.e.j.s.ServletContextHandler{/solr,null}
   [junit4]   2> 791044 T3066 oejs.Server.doStart jetty-8.1.10.v20130312
   [junit4]   2> 791051 T3066 oejs.AbstractConnector.doStart Started SelectChannelConnector@127.0.0.1:54039
   [junit4]   2> 791053 T3066 oass.SolrDispatchFilter.init SolrDispatchFilter.init()
   [junit4]   2> 791053 T3066 oasc.SolrResourceLoader.locateSolrHome JNDI not configured for solr (NoInitialContextEx)
   [junit4]   2> 791054 T3066 oasc.SolrResourceLoader.locateSolrHome using system property solr.solr.home: .\org.apache.solr.handler.TestReplicationHandler$SolrInstance-1391437175954\slave
   [junit4]   2> 791054 T3066 oasc.SolrResourceLoader.<init> new SolrResourceLoader for directory: '.\org.apache.solr.handler.TestReplicationHandler$SolrInstance-1391437175954\slave\'
   [junit4]   2> 791104 T3066 oasc.ConfigSolr.fromFile Loading container configuration from C:\Users\JenkinsSlave\workspace\Lucene-Solr-trunk-Windows\solr\build\solr-core\test\J0\.\org.apache.solr.handler.TestReplicationHandler$SolrInstance-1391437175954\slave\solr.xml
   [junit4]   2> 791124 T3066 oasc.CoreContainer.<init> New CoreContainer 2737135
   [junit4]   2> 791125 T3066 oasc.CoreContainer.load Loading cores into CoreContainer [instanceDir=.\org.apache.solr.handler.TestReplicationHandler$SolrInstance-1391437175954\slave\]
   [junit4]   2> 791125 T3066 oashc.HttpShardHandlerFactory.getParameter Setting socketTimeout to: 90000
   [junit4]   2> 791126 T3066 oashc.HttpShardHandlerFactory.getParameter Setting urlScheme to: http://
   [junit4]   2> 791126 T3066 oashc.HttpShardHandlerFactory.getParameter Setting connTimeout to: 15000
   [junit4]   2> 791126 T3066 oashc.HttpShardHandlerFactory.getParameter Setting maxConnectionsPerHost to: 20
   [junit4]   2> 791127 T3066 oashc.HttpShardHandlerFactory.getParameter Setting corePoolSize to: 0
   [junit4]   2> 791127 T3066 oashc.HttpShardHandlerFactory.getParameter Setting maximumPoolSize to: 2147483647
   [junit4]   2> 791128 T3066 oashc.HttpShardHandlerFactory.getParameter Setting maxThreadIdleTime to: 5
   [junit4]   2> 791128 T3066 oashc.HttpShardHandlerFactory.getParameter Setting sizeOfQueue to: -1
   [junit4]   2> 791128 T3066 oashc.HttpShardHandlerFactory.getParameter Setting fairnessPolicy to: false
   [junit4]   2> 791134 T3066 oasl.LogWatcher.createWatcher SLF4J impl is org.slf4j.impl.Log4jLoggerFactory
   [junit4]   2> 791134 T3066 oasl.LogWatcher.newRegisteredLogWatcher Registering Log Listener [Log4j (org.slf4j.impl.Log4jLoggerFactory)]
   [junit4]   2> 791135 T3066 oasc.CoreContainer.load Host Name: 127.0.0.1
   [junit4]   2> 791140 T3126 oasc.CoreContainer.create Creating SolrCore 'collection1' using instanceDir: .\org.apache.solr.handler.TestReplicationHandler$SolrInstance-1391437175954\slave\collection1
   [junit4]   2> 791141 T3126 oasc.SolrResourceLoader.<init> new SolrResourceLoader for directory: '.\org.apache.solr.handler.TestReplicationHandler$SolrInstance-1391437175954\slave\collection1\'
   [junit4]   2> 791179 T3126 oasc.SolrConfig.<init> Using Lucene MatchVersion: LUCENE_50
   [junit4]   2> 791187 T3126 oasc.SolrConfig.<init> Loaded SolrConfig: solrconfig.xml
   [junit4]   2> 791188 T3126 oass.IndexSchema.readSchema Reading Solr Schema from schema.xml
   [junit4]   2> 791192 T3126 oass.IndexSchema.readSchema [collection1] Schema name=test
   [junit4]   2> 791200 T3126 oass.IndexSchema.readSchema unique key field: id
   [junit4]   2> 791200 T3126 oasc.SolrCore.initDirectoryFactory solr.NRTCachingDirectoryFactory
   [junit4]   2> 791202 T3126 oasc.SolrCore.<init> [collection1] Opening new SolrCore at .\org.apache.solr.handler.TestReplicationHandler$SolrInstance-1391437175954\slave\collection1\, dataDir=C:\Users\JenkinsSlave\workspace\Lucene-Solr-trunk-Windows\solr\build\solr-core\test\J0\org.apache.solr.handler.TestReplicationHandler$SolrInstance-1391437175954\slave\collection1\data\
   [junit4]   2> 791202 T3126 oasc.SolrCore.<init> JMX monitoring not detected for core: collection1
   [junit4]   2> 791202 T3126 oasc.CachingDirectoryFactory.get return new directory for C:\Users\JenkinsSlave\workspace\Lucene-Solr-trunk-Windows\solr\build\solr-core\test\J0\org.apache.solr.handler.TestReplicationHandler$SolrInstance-1391437175954\slave\collection1\data
   [junit4]   2> 791203 T3126 oasc.SolrCore.getNewIndexDir New index directory detected: old=null new=C:\Users\JenkinsSlave\workspace\Lucene-Solr-trunk-Windows\solr\build\solr-core\test\J0\org.apache.solr.handler.TestReplicationHandler$SolrInstance-1391437175954\slave\collection1\data\index/
   [junit4]   2> 791205 T3126 oasc.SolrCore.loadUpdateProcessorChains no updateRequestProcessorChain defined as default, creating implicit default
   [junit4]   2> 791206 T3126 oasc.RequestHandlers.initHandlersFromConfig created standard: solr.StandardRequestHandler
   [junit4]   2> 791206 T3126 oasc.RequestHandlers.initHandlersFromConfig created defaults: solr.StandardRequestHandler
   [junit4]   2> 791206 T3126 oasc.RequestHandlers.initHandlersFromConfig adding lazy requestHandler: solr.StandardRequestHandler
   [junit4]   2> 791207 T3126 oasc.RequestHandlers.initHandlersFromConfig created lazy: solr.StandardRequestHandler
   [junit4]   2> 791207 T3126 oasc.RequestHandlers.initHandlersFromConfig created /update: solr.UpdateRequestHandler
   [junit4]   2> 791208 T3126 oasc.RequestHandlers.initHandlersFromConfig created /replication: solr.ReplicationHandler
   [junit4]   2> 791216 T3126 oashl.XMLLoader.init xsltCacheLifetimeSeconds=60
   [junit4]   2> 791218 T3126 oasu.CommitTracker.<init> Hard AutoCommit: disabled
   [junit4]   2> 791218 T3126 oasu.CommitTracker.<init> Soft AutoCommit: disabled
   [junit4]   2> 791219 T3126 oasc.CachingDirectoryFactory.get return new directory for C:\Users\JenkinsSlave\workspace\Lucene-Solr-trunk-Windows\solr\build\solr-core\test\J0\org.apache.solr.handler.TestReplicationHandler$SolrInstance-1391437175954\slave\collection1\data\index
   [junit4]   2> 791222 T3126 oass.SolrIndexSearcher.<init> Opening Searcher@12af13a main
   [junit4]   2> 791223 T3126 oash.SnapPuller.startExecutorService Poll Scheduled at an interval of 1000ms
   [junit4]   2> 791223 T3126 oasc.CoreContainer.registerCore registering core: collection1
   [junit4]   2> 791223 T3127 oasc.SolrCore.registerSearcher [collection1] Registered new searcher Searcher@12af13a main{StandardDirectoryReader(segments_2:3 _0(5.0):C1)}
   [junit4]   2> 791224 T3066 oass.SolrDispatchFilter.init user.dir=C:\Users\JenkinsSlave\workspace\Lucene-Solr-trunk-Windows\solr\build\solr-core\test\J0
   [junit4]   2> 791224 T3066 oass.SolrDispatchFilter.init SolrDispatchFilter.init() done
   [junit4]   2> 791246 T3130 oash.SnapPuller.<init> WARN 'masterUrl' must be specified without the /replication suffix
   [junit4]   2> 791248 T3130 oash.SnapPuller.<init>  No value set for 'pollInterval'. Timer Task not started.
   [junit4]   2> ASYNC  NEW_CORE C1398 name=collection1 org.apache.solr.core.SolrCore@c24f03
   [junit4]   2> 791251 T3109 C1398 oasc.SolrCore.execute [collection1] webapp=/solr path=/replication params={qt=/replication&wt=javabin&version=2&command=indexversion} status=0 QTime=1 
   [junit4]   2> ASYNC  NEW_CORE C1399 name=collection1 org.apache.solr.core.SolrCore@9334ac
   [junit4]   2> 791252 T3120 C1399 oasc.SolrCore.execute [collection1] webapp=/solr path=/replication params={wait=true&masterUrl=http://127.0.0.1:54036/solr/replication&command=fetchindex} status=0 QTime=25 
   [junit4]   2> 791254 T3066 oas.SolrTestCaseJ4.tearDown ###Ending testNoWriter
   [junit4]   2> 791267 T3066 oasc.CoreContainer.shutdown Shutting down CoreContainer instance=19135616
   [junit4]   2> 791269 T3066 oasc.SolrCore.close [collection1]  CLOSING SolrCore org.apache.solr.core.SolrCore@c24f03
   [junit4]   2> 791269 T3066 oasu.DirectUpdateHandler2.close closing DirectUpdateHandler2{commits=0,autocommits=0,soft autocommits=0,optimizes=0,rollbacks=0,expungeDeletes=0,docsPending=0,adds=0,deletesById=0,deletesByQuery=0,errors=0,cumulative_adds=0,cumulative_deletesById=0,cumulative_deletesByQuery=0,cumulative_errors=0}
   [junit4]   2> 791270 T3066 oasu.SolrCoreState.decrefSolrCoreState Closing SolrCoreState
   [junit4]   2> 791270 T3066 oasu.DefaultSolrCoreState.closeIndexWriter SolrCoreState ref count has reached 0 - closing IndexWriter
   [junit4]   2> 791270 T3066 oasu.DefaultSolrCoreState.closeIndexWriter closing IndexWriter with IndexWriterCloser
   [junit4]   2> 791271 T3066 oasc.SolrCore.closeSearcher [collection1] Closing main searcher on request.
   [junit4]   2> 791272 T3066 oasc.CachingDirectoryFactory.close Closing NRTCachingDirectoryFactory - 2 directories currently being tracked
   [junit4]   2> 791274 T3066 oasc.CachingDirectoryFactory.closeCacheValue looking to close C:\Users\JenkinsSlave\workspace\Lucene-Solr-trunk-Windows\solr\build\solr-core\test\J0\org.apache.solr.handler.TestReplicationHandler$SolrInstance-1391437175768\master\collection1\data [CachedDir<<refCount=0;path=C:\Users\JenkinsSlave\workspace\Lucene-Solr-trunk-Windows\solr\build\solr-core\test\J0\org.apache.solr.handler.TestReplicationHandler$SolrInstance-1391437175768\master\collection1\data;done=false>>]
   [junit4]   2> 791274 T3066 oasc.CachingDirectoryFactory.close Closing directory: C:\Users\JenkinsSlave\workspace\Lucene-Solr-trunk-Windows\solr\build\solr-core\test\J0\org.apache.solr.handler.TestReplicationHandler$SolrInstance-1391437175768\master\collection1\data
   [junit4]   2> 791275 T3066 oasc.CachingDirectoryFactory.closeCacheValue looking to close C:\Users\JenkinsSlave\workspace\Lucene-Solr-trunk-Windows\solr\build\solr-core\test\J0\org.apache.solr.handler.TestReplicationHandler$SolrInstance-1391437175768\master\collection1\data\index [CachedDir<<refCount=0;path=C:\Users\JenkinsSlave\workspace\Lucene-Solr-trunk-Windows\solr\build\solr-core\test\J0\org.apache.solr.handler.TestReplicationHandler$SolrInstance-1391437175768\master\collection1\data\index;done=false>>]
   [junit4]   2> 791275 T3066 oasc.CachingDirectoryFactory.close Closing directory: C:\Users\JenkinsSlave\workspace\Lucene-Solr-trunk-Windows\solr\build\solr-core\test\J0\org.apache.solr.handler.TestReplicationHandler$SolrInstance-1391437175768\master\collection1\data\index
   [junit4]   2> 791276 T3066 oejsh.ContextHandler.doStop stopped o.e.j.s.ServletContextHandler{/solr,null}
   [junit4]   2> 791342 T3066 oasc.CoreContainer.shutdown Shutting down CoreContainer instance=2737135
   [junit4]   2> 791344 T3066 oasc.SolrCore.close [collection1]  CLOSING SolrCore org.apache.solr.core.SolrCore@9334ac
   [junit4]   2> 792394 T3128 oash.SnapPuller.fetchLatestIndex ERROR Master at: http://127.0.0.1:54036/solr is not available. Index fetch failed. Exception: Server refused connection at: http://127.0.0.1:54036/solr
   [junit4]   2> 792402 T3066 oasu.DirectUpdateHandler2.close closing DirectUpdateHandler2{commits=0,autocommits=0,soft autocommits=0,optimizes=0,rollbacks=0,expungeDeletes=0,docsPending=0,adds=0,deletesById=0,deletesByQuery=0,errors=0,cumulative_adds=0,cumulative_deletesById=0,cumulative_deletesByQuery=0,cumulative_errors=0}
   [junit4]   2> 792404 T3066 oasu.SolrCoreState.decrefSolrCoreState Closing SolrCoreState
   [junit4]   2> 792404 T3066 oasu.DefaultSolrCoreState.closeIndexWriter SolrCoreState ref count has reached 0 - closing IndexWriter
   [junit4]   2> 792405 T3066 oasu.DefaultSolrCoreState.closeIndexWriter closing IndexWriter with IndexWriterCloser
   [junit4]   2> 792406 T3066 oasc.SolrCore.closeSearcher [collection1] Closing main searcher on request.
   [junit4]   2> 792407 T3066 oasc.CachingDirectoryFactory.close Closing NRTCachingDirectoryFactory - 2 directories currently being tracked
   [junit4]   2> 792407 T3066 oasc.CachingDirectoryFactory.closeCacheValue looking to close C:\Users\JenkinsSlave\workspace\Lucene-Solr-trunk-Windows\solr\build\solr-core\test\J0\org.apache.solr.handler.TestReplicationHandler$SolrInstance-1391437175954\slave\collection1\data [CachedDir<<refCount=0;path=C:\Users\JenkinsSlave\workspace\Lucene-Solr-trunk-Windows\solr\build\solr-core\test\J0\org.apache.solr.handler.TestReplicationHandler$SolrInstance-1391437175954\slave\collection1\data;done=false>>]
   [junit4]   2> 792407 T3066 oasc.CachingDirectoryFactory.close Closing directory: C:\Users\JenkinsSlave\workspace\Lucene-Solr-trunk-Windows\solr\build\solr-core\test\J0\org.apache.solr.handler.TestReplicationHandler$SolrInstance-1391437175954\slave\collection1\data
   [junit4]   2> 792407 T3066 oasc.CachingDirectoryFactory.closeCacheValue looking to close C:\Users\JenkinsSlave\workspace\Lucene-Solr-trunk-Windows\solr\build\solr-core\test\J0\org.apache.solr.handler.TestReplicationHandler$SolrInstance-1391437175954\slave\collection1\data\index [CachedDir<<refCount=0;path=C:\Users\JenkinsSlave\workspace\Lucene-Solr-trunk-Windows\solr\build\solr-core\test\J0\org.apache.solr.handler.TestReplicationHandler$SolrInstance-1391437175954\slave\collection1\data\index;done=false>>]
   [junit4]   2> 792410 T3066 oasc.CachingDirectoryFactory.close Closing directory: C:\Users\JenkinsSlave\workspace\Lucene-Solr-trunk-Windows\solr\build\solr-core\test\J0\org.apache.solr.handler.TestReplicationHandler$SolrInstance-1391437175954\slave\collection1\data\index
   [junit4]   2> 792412 T3066 oejsh.ContextHandler.doStop stopped o.e.j.s.ServletContextHandler{/solr,null}
   [junit4]   2> 792564 T3066 oas.SolrTestCaseJ4.setUp ###Starting testEmptyCommits
   [junit4]   2> 792587 T3066 oejs.Server.doStart jetty-8.1.10.v20130312
   [junit4]   2> 792594 T3066 oejs.AbstractConnector.doStart Started SelectChannelConnector@127.0.0.1:54052
   [junit4]   2> 792595 T3066 oass.SolrDispatchFilter.init SolrDispatchFilter.init()
   [junit4]   2> 792596 T3066 oasc.SolrResourceLoader.locateSolrHome JNDI not configured for solr (NoInitialContextEx)
   [junit4]   2> 792596 T3066 oasc.SolrResourceLoader.locateSolrHome using system property solr.solr.home: .\org.apache.solr.handler.TestReplicationHandler$SolrInstance-1391437178233\master
   [junit4]   2> 792597 T3066 oasc.SolrResourceLoader.<init> new SolrResourceLoader for directory: '.\org.apache.solr.handler.TestReplicationHandler$SolrInstance-1391437178233\master\'
   [junit4]   2> 792643 T3066 oasc.ConfigSolr.fromFile Loading container configuration from C:\Users\JenkinsSlave\workspace\Lucene-Solr-trunk-Windows\solr\build\solr-core\test\J0\.\org.apache.solr.handler.TestReplicationHandler$SolrInstance-1391437178233\master\solr.xml
   [junit4]   2> 792657 T3066 oasc.CoreContainer.<init> New CoreContainer 13682293
   [junit4]   2> 792657 T3066 oasc.CoreContainer.load Loading cores into CoreContainer [instanceDir=.\org.apache.solr.handler.TestReplicationHandler$SolrInstance-1391437178233\master\]
   [junit4]   2> 792658 T3066 oashc.HttpShardHandlerFactory.getParameter Setting socketTimeout to: 90000
   [junit4]   2> 792658 T3066 oashc.HttpShardHandlerFactory.getParameter Setting urlScheme to: http://
   [junit4]   2> 792659 T3066 oashc.HttpShardHandlerFactory.getParameter Setting connTimeout to: 15000
   [junit4]   2> 792659 T3066 oashc.HttpShardHandlerFactory.getParameter Setting maxConnectionsPerHost to: 20
   [junit4]   2> 792661 T3066 oashc.HttpShardHandlerFactory.getParameter Setting corePoolSize to: 0
   [junit4]   2> 792661 T3066 oashc.HttpShardHandlerFactory.getParameter Setting maximumPoolSize to: 2147483647
   [junit4]   2> 792661 T3066 oashc.HttpShardHandlerFactory.getParameter Setting maxThreadIdleTime to: 5
   [junit4]   2> 792662 T3066 oashc.HttpShardHandlerFactory.getParameter Setting sizeOfQueue to: -1
   [junit4]   2> 792662 T3066 oashc.HttpShardHandlerFactory.getParameter Setting fairnessPolicy to: false
   [junit4]   2> 792668 T3066 oasl.LogWatcher.createWatcher SLF4J impl is org.slf4j.impl.Log4jLoggerFactory
   [junit4]   2> 792668 T3066 oasl.LogWatcher.newRegisteredLogWatcher Registering Log Listener [Log4j (org.slf4j.impl.Log4jLoggerFactory)]
   [junit4]   2> 792669 T3066 oasc.CoreContainer.load Host Name: 127.0.0.1
   [junit4]   2> 792678 T3141 oasc.CoreContainer.create Creating SolrCore 'collection1' using instanceDir: .\org.apache.solr.handler.TestReplicationHandler$SolrInstance-1391437178233\master\collection1
   [junit4]   2> 792679 T3141 oasc.SolrResourceLoader.<init> new SolrResourceLoader for directory: '.\org.apache.solr.handler.TestReplicationHandler$SolrInstance-1391437178233\master\collection1\'
   [junit4]   2> 792734 T3141 oasc.SolrConfig.<init> Using Lucene MatchVersion: LUCENE_50
   [junit4]   2> 792739 T3141 oasc.SolrConfig.<init> Loaded SolrConfig: solrconfig.xml
   [junit4]   2> 792739 T3141 oass.IndexSchema.readSchema Reading Solr Schema from schema.xml
   [junit4]   2> 792745 T3141 oass.IndexSchema.readSchema [collection1] Schema name=test
   [junit4]   2> 792751 T3141 oass.IndexSchema.readSchema unique key field: id
   [junit4]   2> 792751 T3141 oasc.SolrCore.initDirectoryFactory org.apache.solr.core.MockDirectoryFactory
   [junit4]   2> 792753 T3141 oasc.SolrCore.<init> [collection1] Opening new SolrCore at .\org.apache.solr.handler.TestReplicationHandler$SolrInstance-1391437178233\master\collection1\, dataDir=C:\Users\JenkinsSlave\workspace\Lucene-Solr-trunk-Windows\solr\build\solr-core\test\J0\.\org.apache.solr.handler.TestReplicationHandler$SolrInstance-1391437178233\master\collection1\data\
   [junit4]   2> 792753 T3141 oasc.SolrCore.<init> JMX monitoring not detected for core: collection1
   [junit4]   2> 792754 T3141 oasc.CachingDirectoryFactory.get return new directory for C:\Users\JenkinsSlave\workspace\Lucene-Solr-trunk-Windows\solr\build\solr-core\test\J0\.\org.apache.solr.handler.TestReplicationHandler$SolrInstance-1391437178233\master\collection1\data\
   [junit4]   2> 792754 T3141 oasc.SolrCore.getNewIndexDir New index directory detected: old=null new=C:\Users\JenkinsSlave\workspace\Lucene-Solr-trunk-Windows\solr\build\solr-core\test\J0\.\org.apache.solr.handler.TestReplicationHandler$SolrInstance-1391437178233\master\collection1\data\index/
   [junit4]   2> 792754 T3141 oasc.SolrCore.initIndex WARN [collection1] Solr index directory 'C:\Users\JenkinsSlave\workspace\Lucene-Solr-trunk-Windows\solr\build\solr-core\test\J0\.\org.apache.solr.handler.TestReplicationHandler$SolrInstance-1391437178233\master\collection1\data\index' doesn't exist. Creating new index...
   [junit4]   2> 792755 T3141 oasc.CachingDirectoryFactory.get return new directory for C:\Users\JenkinsSlave\workspace\Lucene-Solr-trunk-Windows\solr\build\solr-core\test\J0\.\org.apache.solr.handler.TestReplicationHandler$SolrInstance-1391437178233\master\collection1\data\index
   [junit4]   2> 792756 T3141 oasu.RandomMergePolicy.<init> RandomMergePolicy wrapping class org.apache.lucene.index.TieredMergePolicy: [TieredMergePolicy: maxMergeAtOnce=13, maxMergeAtOnceExplicit=23, maxMergedSegmentMB=47.8701171875, floorSegmentMB=0.88671875, forceMergeDeletesPctAllowed=5.5741720020020065, segmentsPerTier=30.0, maxCFSSegmentSizeMB=8.796093022207999E12, noCFSRatio=0.0
   [junit4]   2> 792756 T3141 oasc.SolrDeletionPolicy.onCommit SolrDeletionPolicy.onCommit: commits: num=1
   [junit4]   2> 		commit{dir=MockDirectoryWrapper(org.apache.lucene.store.RAMDirectory@1376f43 lockFactory=org.apache.lucene.store.SingleInstanceLockFactory@127cd7d),segFN=segments_1,generation=1}
   [junit4]   2> 792756 T3141 oasc.SolrDeletionPolicy.updateCommits newest commit generation = 1
   [junit4]   2> 792758 T3141 oasc.SolrCore.loadUpdateProcessorChains no updateRequestProcessorChain defined as default, creating implicit default
   [junit4]   2> 792759 T3141 oasc.RequestHandlers.initHandlersFromConfig created standard: solr.StandardRequestHandler
   [junit4]   2> 792759 T3141 oasc.RequestHandlers.initHandlersFromConfig created /replication: solr.ReplicationHandler
   [junit4]   2> 792759 T3141 oasc.RequestHandlers.initHandlersFromConfig created defaults: solr.StandardRequestHandler
   [junit4]   2> 792759 T3141 oasc.RequestHandlers.initHandlersFromConfig adding lazy requestHandler: solr.StandardRequestHandler
   [junit4]   2> 792759 T3141 oasc.RequestHandlers.initHandlersFromConfig created lazy: solr.StandardRequestHandler
   [junit4]   2> 792761 T3141 oasc.RequestHandlers.initHandlersFromConfig created /update: solr.UpdateRequestHandler
   [junit4]   2> 792768 T3141 oashl.XMLLoader.init xsltCacheLifetimeSeconds=60
   [junit4]   2> 792770 T3141 oasu.CommitTracker.<init> Hard AutoCommit: disabled
   [junit4]   2> 792770 T3141 oasu.CommitTracker.<init> Soft AutoCommit: disabled
   [junit4]   2> 792770 T3141 oasu.RandomMergePolicy.<init> RandomMergePolicy wrapping class org.apache.lucene.index.AlcoholicMergePolicy: [AlcoholicMergePolicy: minMergeSize=0, mergeFactor=10, maxMergeSize=1697363906, maxMergeSizeForForcedMerge=9223372036854775807, calibrateSizeByDeletes=true, maxMergeDocs=2147483647, maxCFSSegmentSizeMB=8.796093022207999E12, noCFSRatio=0.1]
   [junit4]   2> 792771 T3141 oasc.SolrDeletionPolicy.onInit SolrDeletionPolicy.onInit: commits: num=1
   [junit4]   2> 		commit{dir=MockDirectoryWrapper(org.apache.lucene.store.RAMDirectory@1376f43 lockFactory=org.apache.lucene.store.SingleInstanceLockFactory@127cd7d),segFN=segments_1,generation=1}
   [junit4]   2> 792771 T3141 oasc.SolrDeletionPolicy.updateCommits newest commit generation = 1
   [junit4]   2> 792771 T3141 oass.SolrIndexSearcher.<init> Opening Searcher@1ca94ae main
   [junit4]   2> 792771 T3141 oash.ReplicationHandler.inform Replication enabled for following config files: schema.xml,xslt/dummy.xsl
   [junit4]   2> 792771 T3141 oash.ReplicationHandler.inform Commits will be reserved for  10000
   [junit4]   2> 792771 T3141 oasc.CoreContainer.registerCore registering core: collection1
   [junit4]   2> 792773 T3142 oasc.SolrCore.registerSearcher [collection1] Registered new searcher Searcher@1ca94ae main{StandardDirectoryReader(segments_1:1:nrt)}
   [junit4]   2> 792774 T3066 oass.SolrDispatchFilter.init user.dir=C:\Users\JenkinsSlave\workspace\Lucene-Solr-trunk-Windows\solr\build\solr-core\test\J0
   [junit4]   2> 792774 T3066 oass.SolrDispatchFilter.init SolrDispatchFilter.init() done
   [junit4]   2> 792794 T3066 oejs.Server.doStart jetty-8.1.10.v20130312
   [junit4]   2> 792799 T3066 oejs.AbstractConnector.doStart Started SelectChannelConnector@127.0.0.1:54055
   [junit4]   2> 792801 T3066 oass.SolrDispatchFilter.init SolrDispatchFilter.init()
   [junit4]   2> 792802 T3066 oasc.SolrResourceLoader.locateSolrHome JNDI not configured for solr (NoInitialContextEx)
   [junit4]   2> 792802 T3066 oasc.SolrResourceLoader.locateSolrHome using system property solr.solr.home: .\org.apache.solr.handler.TestReplicationHandler$SolrInstance-1391437178442\slave
   [junit4]   2> 792803 T3066 oasc.SolrResourceLoader.<init> new SolrResourceLoader for directory: '.\org.apache.solr.handler.TestReplicationHandler$SolrInstance-1391437178442\slave\'
   [junit4]   2> 792836 T3066 oasc.ConfigSolr.fromFile Loading container configuration from C:\Users\JenkinsSlave\workspace\Lucene-Solr-trunk-Windows\solr\build\solr-core\test\J0\.\org.apache.solr.handler.TestReplicationHandler$SolrInstance-1391437178442\slave\solr.xml
   [junit4]   2> 792846 T3066 oasc.CoreContainer.<init> New CoreContainer 18596726
   [junit4]   2> 792847 T3066 oasc.CoreContainer.load Loading cores into CoreContainer [instanceDir=.\org.apache.solr.handler.TestReplicationHandler$SolrInstance-1391437178442\slave\]
   [junit4]   2> 792848 T3066 oashc.HttpShardHandlerFactory.getParameter Setting socketTimeout to: 90000
   [junit4]   2> 792849 T3066 oashc.HttpShardHandlerFactory.getParameter Setting urlScheme to: http://
   [junit4]   2> 792849 T3066 oashc.HttpShardHandlerFactory.getParameter Setting connTimeout to: 15000
   [junit4]   2> 792850 T3066 oashc.HttpShardHandlerFactory.getParameter Setting maxConnectionsPerHost to: 20
   [junit4]   2> 792850 T3066 oashc.HttpShardHandlerFactory.getParameter Setting corePoolSize to: 0
   [junit4]   2> 792850 T3066 oashc.HttpShardHandlerFactory.getParameter Setting maximumPoolSize to: 2147483647
   [junit4]   2> 792851 T3066 oashc.HttpShardHandlerFactory.getParameter Setting maxThreadIdleTime to: 5
   [junit4]   2> 792851 T3066 oashc.HttpShardHandlerFactory.getParameter Setting sizeOfQueue to: -1
   [junit4]   2> 792853 T3066 oashc.HttpShardHandlerFactory.getParameter Setting fairnessPolicy to: false
   [junit4]   2> 792857 T3066 oasl.LogWatcher.createWatcher SLF4J impl is org.slf4j.impl.Log4jLoggerFactory
   [junit4]   2> 792858 T3066 oasl.LogWatcher.newRegisteredLogWatcher Registering Log Listener [Log4j (org.slf4j.impl.Log4jLoggerFactory)]
   [junit4]   2> 792858 T3066 oasc.CoreContainer.load Host Name: 127.0.0.1
   [junit4]   2> 792863 T3153 oasc.CoreContainer.create Creating SolrCore 'collection1' using instanceDir: .\org.apache.solr.handler.TestReplicationHandler$SolrInstance-1391437178442\slave\collection1
   [junit4]   2> 792864 T3153 oasc.SolrResourceLoader.<init> new SolrResourceLoader for directory: '.\org.apache.solr.handler.TestReplicationHandler$SolrInstance-1391437178442\slave\collection1\'
   [junit4]   2> 792893 T3153 oasc.SolrConfig.<init> Using Lucene MatchVersion: LUCENE_50
   [junit4]   2> 792901 T3153 oasc.SolrConfig.<init> Loaded SolrConfig: solrconfig.xml
   [junit4]   2> 792901 T3153 oass.IndexSchema.readSchema Reading Solr Schema from schema.xml
   [junit4]   2> 792905 T3153 oass.IndexSchema.readSchema [collection1] Schema name=test
   [junit4]   2> 792907 T3153 oass.IndexSchema.readSchema unique key field: id
   [junit4]   2> 792907 T3153 oasc.SolrCore.initDirectoryFactory org.apache.solr.core.MockDirectoryFactory
   [junit4]   2> 792910 T3153 oasc.SolrCore.<init> [collection1] Opening new SolrCore at .\org.apache.solr.handler.TestReplicationHandler$SolrInstance-1391437178442\slave\collection1\, dataDir=C:\Users\JenkinsSlave\workspace\Lucene-Solr-trunk-Windows\solr\build\solr-core\test\J0\.\org.apache.solr.handler.TestReplicationHandler$SolrInstance-1391437178442\slave\collection1\data\
   [junit4]   2> 792910 T3153 oasc.SolrCore.<init> JMX monitoring not detected for core: collection1
   [junit4]   2> 792910 T3153 oasc.CachingDirectoryFactory.get return new directory for C:\Users\JenkinsSlave\workspace\Lucene-Solr-trunk-Windows\solr\build\solr-core\test\J0\.\org.apache.solr.handler.TestReplicationHandler$SolrInstance-1391437178442\slave\collection1\data\
   [junit4]   2> 792910 T3153 oasc.SolrCore.getNewIndexDir New index directory detected: old=null new=C:\Users\JenkinsSlave\workspace\Lucene-Solr-trunk-Windows\solr\build\solr-core\test\J0\.\org.apache.solr.handler.TestReplicationHandler$SolrInstance-1391437178442\slave\collection1\data\index/
   [junit4]   2> 792910 T3153 oasc.SolrCore.initIndex WARN [collection1] Solr index directory 'C:\Users\JenkinsSlave\workspace\Lucene-Solr-trunk-Windows\solr\build\solr-core\test\J0\.\org.apache.solr.handler.TestReplicationHandler$SolrInstance-1391437178442\slave\collection1\data\index' doesn't exist. Creating new index...
   [junit4]   2> 792912 T3153 oasc.CachingDirectoryFactory.get return new directory for C:\Users\JenkinsSlave\workspace\Lucene-Solr-trunk-Windows\solr\build\solr-core\test\J0\.\org.apache.solr.handler.TestReplicationHandler$SolrInstance-1391437178442\slave\collection1\data\index
   [junit4]   2> 792913 T3153 oasu.RandomMergePolicy.<init> RandomMergePolicy wrapping class org.apache.lucene.index.TieredMergePolicy: [TieredMergePolicy: maxMergeAtOnce=13, maxMergeAtOnceExplicit=23, maxMergedSegmentMB=47.8701171875, floorSegmentMB=0.88671875, forceMergeDeletesPctAllowed=5.5741720020020065, segmentsPerTier=30.0, maxCFSSegmentSizeMB=8.796093022207999E12, noCFSRatio=0.0
   [junit4]   2> 792913 T3153 oasc.SolrDeletionPolicy.onCommit SolrDeletionPolicy.onCommit: commits: num=1
   [junit4]   2> 		commit{dir=MockDirectoryWrapper(org.apache.lucene.store.RAMDirectory@1c6a4e7 lockFactory=org.apache.lucene.store.SingleInstanceLockFactory@132a9b7),segFN=segments_1,generation=1}
   [junit4]   2> 792914 T3153 oasc.SolrDeletionPolicy.updateCommits newest commit generation = 1
   [junit4]   2> 792915 T3153 oasc.SolrCore.loadUpdateProcessorChains no updateRequestProcessorChain defined as default, creating implicit default
   [junit4]   2> 792916 T3153 oasc.RequestHandlers.initHandlersFromConfig created standard: solr.StandardRequestHandler
   [junit4]   2> 792916 T3153 oasc.RequestHandlers.initHandlersFromConfig created defaults: solr.StandardRequestHandler
   [junit4]   2> 792917 T3153 oasc.RequestHandlers.initHandlersFromConfig adding lazy requestHandler: solr.StandardRequestHandler
   [junit4]   2> 792917 T3153 oasc.RequestHandlers.initHandlersFromConfig created lazy: solr.StandardRequestHandler
   [junit4]   2> 792917 T3153 oasc.RequestHandlers.initHandlersFromConfig created /update: solr.UpdateRequestHandler
   [junit4]   2> 792918 T3153 oasc.RequestHandlers.initHandlersFromConfig created /replication: solr.ReplicationHandler
   [junit4]   2> 792920 T3153 oashl.XMLLoader.init xsltCacheLifetimeSeconds=60
   [junit4]   2> 792922 T3153 oasu.CommitTracker.<init> Hard AutoCommit: disabled
   [junit4]   2> 792922 T3153 oasu.CommitTracker.<init> Soft AutoCommit: disabled
   [junit4]   2> 792922 T3153 oasu.RandomMergePolicy.<init> RandomMergePolicy wrapping class org.apache.lucene.index.AlcoholicMergePolicy: [AlcoholicMergePolicy: minMergeSize=0, mergeFactor=10, maxMergeSize=1697363906, maxMergeSizeForForcedMerge=9223372036854775807, calibrateSizeByDeletes=true, maxMergeDocs=2147483647, maxCFSSegmentSizeMB=8.796093022207999E12, noCFSRatio=0.1]
   [junit4]   2> 792923 T3153 oasc.SolrDeletionPolicy.onInit SolrDeletionPolicy.onInit: commits: num=1
   [junit4]   2> 		commit{dir=MockDirectoryWrapper(org.apache.lucene.store.RAMDirectory@1c6a4e7 lockFactory=org.apache.lucene.store.SingleInstanceLockFactory@132a9b7),segFN=segments_1,generation=1}
   [junit4]   2> 792923 T3153 oasc.SolrDeletionPolicy.updateCommits newest commit generation = 1
   [junit4]   2> 792923 T3153 oass.SolrIndexSearcher.<init> Opening Searcher@184442c main
   [junit4]   2> 792924 T3153 oash.SnapPuller.startExecutorService Poll Scheduled at an interval of 1000ms
   [junit4]   2> 792925 T3153 oasc.CoreContainer.registerCore registering core: collection1
   [junit4]   2> 792925 T3154 oasc.SolrCore.registerSearcher [collection1] Registered new searcher Searcher@184442c main{StandardDirectoryReader(segments_1:1:nrt)}
   [junit4]   2> 792925 T3066 oass.SolrDispatchFilter.init user.dir=C:\Users\JenkinsSlave\workspace\Lucene-Solr-trunk-Windows\solr\build\solr-core\test\J0
   [junit4]   2> 792926 T3066 oass.SolrDispatchFilter.init SolrDispatchFilter.init() done
   [junit4]   2> ASYNC  NEW_CORE C1400 name=collection1 org.apache.solr.core.SolrCore@d57d7a
   [junit4]   2> 792930 T3135 C1400 oasc.SolrCore.execute [collection1] webapp=/solr path=/select params={q=*:*&sort=id+desc&wt=javabin&version=2} hits=0 status=0 QTime=1 
   [junit4]   2> 792935 T3136 C1400 oasup.LogUpdateProcessor.finish [collection1] webapp=/solr path=/update params={wt=javabin&version=2} {add=[1]} 0 1
   [junit4]   2> 792938 T3137 C1400 oasu.DirectUpdateHandler2.commit start commit{,optimize=false,openSearcher=true,waitSearcher=true,expungeDeletes=false,softCommit=false,prepareCommit=false}
   [junit4]   2> 792941 T3137 C1400 oasc.SolrDeletionPolicy.onCommit SolrDeletionPolicy.onCommit: commits: num=2
   [junit4]   2> 		commit{dir=MockDirectoryWrapper(org.apache.lucene.store.RAMDirectory@1376f43 lockFactory=org.apache.lucene.store.SingleInstanceLockFactory@127cd7d),segFN=segments_1,generation=1}
   [junit4]   2> 		commit{dir=MockDirectoryWrapper(org.apache.lucene.store.RAMDirectory@1376f43 lockFactory=org.apache.lucene.store.SingleInstanceLockFactory@127cd7d),segFN=segments_2,generation=2}
   [junit4]   2> 792942 T3137 C1400 oasc.SolrDeletionPolicy.updateCommits newest commit generation = 2
   [junit4]   2> 792944 T3137 C1400 oass.SolrIndexSearcher.<init> Opening Searcher@6e5ac8 main
   [junit4]   2> 792944 T3137 C1400 oasu.DirectUpdateHandler2.commit end_commit_flush
   [junit4]   2> 792944 T3142 oasc.SolrCore.registerSearcher [collection1] Registered new searcher Searcher@6e5ac8 main{StandardDirectoryReader(segments_2:3:nrt _0(5.0):C1)}
   [junit4]   2> 792945 T3137 C1400 oasup.LogUpdateProcessor.finish [collection1] webapp=/solr path=/update params={commit=true&wt=javabin&version=2} {commit=} 0 7
   [junit4]   2> 792951 T3157 oash.SnapPuller.<init> WARN 'masterUrl' must be specified without the /replication suffix
   [junit4]   2> 792951 T3157 oash.SnapPuller.<init>  No value set for 'pollInterval'. Timer Task not started.
   [junit4]   2> 792953 T3138 C1400 oasc.SolrCore.execute [collection1] webapp=/solr path=/replication params={qt=/replication&wt=javabin&version=2&command=indexversion} status=0 QTime=0 
   [junit4]   2> 792954 T3157 oash.SnapPuller.fetchLatestIndex Master's generation: 2
   [junit4]   2> 792954 T3157 oash.SnapPuller.fetchLatestIndex Slave's generation: 1
   [junit4]   2> 792954 T3157 oash.SnapPuller.fetchLatestIndex Starting replication process
   [junit4]   2> 792962 T3139 C1400 oasc.SolrCore.execute [collection1] webapp=/solr path=/replication params={generation=2&qt=/replication&wt=javabin&version=2&command=filelist} status=0 QTime=4 
   [junit4]   2> 792963 T3157 oash.SnapPuller.fetchLatestIndex Number of files in latest index in master: 10
   [junit4]   2> 792964 T3157 oasc.CachingDirectoryFactory.get return new directory for C:\Users\JenkinsSlave\workspace\Lucene-Solr-trunk-Windows\solr\build\solr-core\test\J0\.\org.apache.solr.handler.TestReplicationHandler$SolrInstance-1391437178442\slave\collection1\data\index.20140203161938632
   [junit4]   2> 792964 T3157 oasu.DefaultSolrCoreState.closeIndexWriter Closing IndexWriter...
   [junit4]   2> 792964 T3157 oasu.DefaultSolrCoreState.closeIndexWriter Waiting until IndexWriter is unused... core=collection1
   [junit4]   2> 792964 T3157 oasu.DefaultSolrCoreState.closeIndexWriter Rollback old IndexWriter... core=collection1
   [junit4]   2> 792964 T3157 oash.SnapPuller.fetchLatestIndex Starting download to MockDirectoryWrapper(org.apache.lucene.store.RAMDirectory@371da2 lockFactory=org.apache.lucene.store.SingleInstanceLockFactory@6ecaff) fullCopy=false
   [junit4]   2> 792966 T3140 C1400 oasc.SolrCore.execute [collection1] webapp=/solr path=/replication params={generation=2&qt=/replication&file=_0.si&checksum=true&wt=filestream&command=filecontent} status=0 QTime=0 
   [junit4]   2> 792970 T3135 C1400 oasc.SolrCore.execute [collection1] webapp=/solr path=/replication params={generation=2&qt=/replication&file=segments_2&checksum=true&wt=filestream&command=filecontent} status=0 QTime=0 
   [junit4]   2> 792974 T3136 C1400 oasc.SolrCore.execute [collection1] webapp=/solr path=/replication params={generation=2&qt=/replication&file=_0.nvd&checksum=true&wt=filestream&command=filecontent} status=0 QTime=0 
   [junit4]   2> 792977 T3137 C1400 oasc.SolrCore.execute [collection1] webapp=/solr path=/replication params={generation=2&qt=/replication&file=_0.tip&checksum=true&wt=filestream&command=filecontent} status=0 QTime=0 
   [junit4]   2> 792982 T3138 C1400 oasc.SolrCore.execute [collection1] webapp=/solr path=/replication params={generation=2&qt=/replication&file=_0.fdx&checksum=true&wt=filestream&command=filecontent} status=0 QTime=0 
   [junit4]   2> ASYNC  NEW_CORE C1401 name=collection1 org.apache.solr.core.SolrCore@d57d7a
   [junit4]   2> 793028 T3140 C1401 oasc.SolrCore.execute [collection1] webapp=/solr path=/replication params={generation=2&qt=/replication&file=_0.doc&checksum=true&wt=filestream&command=filecontent} status=0 QTime=0 
   [junit4]   2> 793034 T3135 C1401 oasc.SolrCore.execute [collection1] webapp=/solr path=/replication params={generation=2&qt=/replication&file=_0.tim&checksum=true&wt=filestream&command=filecontent} status=0 QTime=0 
   [junit4]   2> 793038 T3136 C1401 oasc.SolrCore.execute [collection1] webapp=/solr path=/replication params={generation=2&qt=/replication&file=_0.fdt&checksum=true&wt=filestream&command=filecontent} status=0 QTime=0 
   [junit4]   2> 793044 T3137 C1401 oasc.SolrCore.execute [collection1] webapp=/solr path=/replication params={generation=2&qt=/replication&file=_0.nvm&checksum=true&wt=filestream&command=filecontent} status=0 QTime=0 
   [junit4]   2> 793049 T3138 C1401 oasc.SolrCore.execute [collection1] webapp=/solr path=/replication params={generation=2&qt=/replication&file=_0.fnm&checksum=true&wt=filestream&command=filecontent} status=0 QTime=0 
   [junit4]   2> 793050 T3157 oash.SnapPuller.fetchLatestIndex Total time taken for download : 0 secs
   [junit4]   2> 793053 T3157 oasu.DefaultSolrCoreState.openIndexWriter Creating new IndexWriter...
   [junit4]   2> 793053 T3157 oasu.RandomMergePolicy.<init> RandomM

[...truncated too long message...]

/overseer_elect/election
   [junit4]   2> 	at org.apache.zookeeper.KeeperException.create(KeeperException.java:127)
   [junit4]   2> 	at org.apache.zookeeper.KeeperException.create(KeeperException.java:51)
   [junit4]   2> 	at org.apache.zookeeper.ZooKeeper.getChildren(ZooKeeper.java:1468)
   [junit4]   2> 	at org.apache.solr.common.cloud.SolrZkClient$6.execute(SolrZkClient.java:256)
   [junit4]   2> 	at org.apache.solr.common.cloud.SolrZkClient$6.execute(SolrZkClient.java:253)
   [junit4]   2> 	at org.apache.solr.common.cloud.ZkCmdExecutor.retryOperation(ZkCmdExecutor.java:73)
   [junit4]   2> 	at org.apache.solr.common.cloud.SolrZkClient.getChildren(SolrZkClient.java:253)
   [junit4]   2> 	at org.apache.solr.cloud.LeaderElector.checkIfIamLeader(LeaderElector.java:92)
   [junit4]   2> 	at org.apache.solr.cloud.LeaderElector.access$000(LeaderElector.java:55)
   [junit4]   2> 	at org.apache.solr.cloud.LeaderElector$1.process(LeaderElector.java:137)
   [junit4]   2> 	at org.apache.zookeeper.ClientCnxn$EventThread.processEvent(ClientCnxn.java:519)
   [junit4]   2> 	at org.apache.zookeeper.ClientCnxn$EventThread.run(ClientCnxn.java:495)
   [junit4]   2> 
   [junit4]   2> NOTE: test params are: codec=CheapBastard, sim=RandomSimilarityProvider(queryNorm=false,coord=yes): {}, locale=sl_SI, timezone=Africa/Tripoli
   [junit4]   2> NOTE: Windows 7 6.1 x86/Oracle Corporation 1.8.0-ea (32-bit)/cpus=2,threads=2,free=271688056,total=515899392
   [junit4]   2> NOTE: All tests run in this JVM: [JsonLoaderTest, TestIBSimilarityFactory, ConnectionManagerTest, TestClassNameShortening, UpdateParamsTest, TermsComponentTest, TestUniqueKeyFieldResource, TestFileDictionaryLookup, TestQueryUtils, TestCodecSupport, TestFiltering, TestNumberUtils, AbstractAnalyticsStatsTest, IndexSchemaTest, SuggesterFSTTest, TestNonNRTOpen, TestQueryTypes, SolrXmlInZkTest, DeleteReplicaTest, TestZkChroot, ModifyConfFileTest, TestRemoteStreaming, OpenCloseCoreStressTest, TestFunctionQuery, HdfsChaosMonkeySafeLeaderTest, CircularListTest, DistributedSpellCheckComponentTest, DocValuesMissingTest, TestSolrIndexConfig, PolyFieldTest, ResourceLoaderTest, CoreMergeIndexesAdminHandlerTest, TestSolrDeletionPolicy1, TestFieldCollectionResource, StatelessScriptUpdateProcessorFactoryTest, PrimitiveFieldTypeTest, TestRandomFaceting, QueryFacetTest, LegacyHTMLStripCharFilterTest, TestSolrQueryParser, DisMaxRequestHandlerTest, RegexBoostProcessorTest, SuggesterTSTTest, TestPHPSerializedResponseWriter, TestRecovery, TestSuggestSpellingConverter, SpellCheckCollatorTest, TestRealTimeGet, EnumFieldTest, TestBM25SimilarityFactory, TestMultiCoreConfBootstrap, TestOmitPositions, PingRequestHandlerTest, ResponseLogComponentTest, TestCursorMarkWithoutUniqueKey, DistributedQueryComponentCustomSortTest, TestCharFilters, PreAnalyzedUpdateProcessorTest, ParsingFieldUpdateProcessorsTest, HighlighterConfigTest, LeaderElectionIntegrationTest, TestSolrJ, TestCollationFieldDocValues, MultiTermTest, TestCSVLoader, TestDocSet, TestReload, PrimUtilsTest, BinaryUpdateRequestHandlerTest, SpellCheckComponentTest, TestWordDelimiterFilterFactory, TestMaxScoreQueryParser, DebugComponentTest, ChaosMonkeySafeLeaderTest, ClusterStateUpdateTest, TestExtendedDismaxParser, StatsComponentTest, TestReloadAndDeleteDocs, StandardRequestHandlerTest, HdfsCollectionsAPIDistributedZkTest, TestInfoStreamLogging, TestSort, XsltUpdateRequestHandlerTest, TestJmxMonitoredMap, TestSolrQueryParserResource, JSONWriterTest, BlockCacheTest, RangeFacetTest, TestFieldResource, SignatureUpdateProcessorFactoryTest, SolrInfoMBeanTest, TestLMDirichletSimilarityFactory, ExternalFileFieldSortTest, DocValuesTest, BasicFunctionalityTest, TestSerializedLuceneMatchVersion, UniqFieldsUpdateProcessorFactoryTest, TestQuerySenderListener, URLClassifyProcessorTest, SuggestComponentTest, AssignTest, CurrencyFieldXmlFileTest, TestStressLucene, TestHighFrequencyDictionaryFactory, CursorMarkTest, DirectSolrSpellCheckerTest, HardAutoCommitTest, DocumentBuilderTest, TestPartialUpdateDeduplication, SoftAutoCommitTest, LoggingHandlerTest, SolrPluginUtilsTest, AnalysisAfterCoreReloadTest, DeleteShardTest, HdfsDirectoryTest, TestCloudManagedSchema, SpellingQueryConverterTest, DistributedQueryElevationComponentTest, PathHierarchyTokenizerFactoryTest, TestOverriddenPrefixQueryForCustomFieldType, SimplePostToolTest, TestIndexSearcher, TestRandomMergePolicy, IndexSchemaRuntimeFieldTest, TestAnalyzeInfixSuggestions, HdfsLockFactoryTest, MoreLikeThisHandlerTest, TestFuzzyAnalyzedSuggestions, TestJoin, TestDefaultSearchFieldResource, BlockDirectoryTest, TestPerFieldSimilarity, FileBasedSpellCheckerTest, TestSolrQueryParserDefaultOperatorResource, TestSolrXml, OutputWriterTest, DistribCursorPagingTest, SpatialFilterTest, DateMathParserTest, QueryParsingTest, TestLFUCache, TestDFRSimilarityFactory, TestBinaryField, TestNRTOpen, ConvertedLegacyTest, BadIndexSchemaTest, BadCopyFieldTest, CopyFieldTest, PeerSyncTest, TestDistributedSearch, TestSystemIdResolver, DirectUpdateHandlerOptimizeTest, LeaderElectionTest, HdfsRecoveryZkTest, CurrencyFieldOpenExchangeTest, MinimalSchemaTest, DocValuesMultiTest, SolrIndexConfigTest, FunctionTest, TestSolrCoreProperties, WordBreakSolrSpellCheckerTest, SOLR749Test, ScriptEngineTest, IndexBasedSpellCheckerTest, TestReplicationHandler, TestBinaryResponseWriter, BasicDistributedZkTest, TestDocBasedVersionConstraints, TestSchemaNameResource, ZkSolrClientTest, SortByFunctionTest, TestCustomSort, TestLuceneMatchVersion, ZkCLITest, BasicDistributedZk2Test, UnloadDistributedZkTest, CollectionsAPIDistributedZkTest, SyncSliceTest, OverseerTest, ShardRoutingTest, BasicZkTest, RecoveryZkTest, FullSolrCloudDistribCmdsTest, TestRandomDVFaceting, ShardRoutingCustomTest, SliceStateUpdateTest, AutoCommitTest, TestDistributedGrouping, TestFaceting, TestHashPartitioner, TermVectorComponentDistributedTest, ZkControllerTest, TestStressReorder, TestStressVersions, DistributedTermsComponentTest, TestRangeQuery, TestCoreContainer, SimpleFacetsTest, TestSolr4Spatial, SolrCoreTest, TestGroupingSearch, SolrCmdDistributorTest, QueryElevationComponentTest, TestLazyCores, DirectUpdateHandlerTest, TestBadConfig, OverseerCollectionProcessorTest, HighlighterTest, ShowFileRequestHandlerTest, SolrIndexSplitterTest, TestCoreDiscovery, CoreAdminHandlerTest, SolrRequestParserTest, TestFoldingMultitermQuery, SuggesterTest, TestTrie, SuggesterWFSTTest, NoCacheHeaderTest, SchemaVersionSpecificBehaviorTest, SolrCoreCheckLockOnStartupTest, TestPseudoReturnFields, TestUpdate, FieldMutatingUpdateProcessorTest, TestAtomicUpdateErrorCases, QueryEqualityTest, DefaultValueUpdateProcessorTest, DistanceFunctionTest, CacheHeaderTest, TestSurroundQueryParser, LukeRequestHandlerTest, TestWriterPerf, TestReversedWildcardFilterFactory, DocumentAnalysisRequestHandlerTest, XmlUpdateRequestHandlerTest, RequestHandlersTest, TestValueSourceCache, TermVectorComponentTest, TestIndexingPerformance, RequiredFieldsTest, FieldAnalysisRequestHandlerTest, TestArbitraryIndexDir, FastVectorHighlighterTest, TestJmxIntegration, TestCollationField, ReturnFieldsTest, UpdateRequestProcessorFactoryTest, TestCSVResponseWriter, MBeansHandlerTest, TestAnalyzedSuggestions, CSVRequestHandlerTest, TestComponentsName, SearchHandlerTest, CoreContainerCoreInitFailuresTest, AlternateDirectoryTest, TestQuerySenderNoQuery, BadComponentTest, TestStressRecovery, TestMergePolicyConfig, TestSolrDeletionPolicy2, SampleTest, TestSearchPerf, NumericFieldsTest, TestElisionMultitermQuery, TestConfig, TestPostingsSolrHighlighter, DirectSolrConnectionTest, NotRequiredUniqueKeyTest, TestPhraseSuggestions, SpellPossibilityIteratorTest, SynonymTokenizerTest, TestXIncludeConfig, EchoParamsTest, TestSweetSpotSimilarityFactory, TestLMJelinekMercerSimilarityFactory, TestDefaultSimilarityFactory, TestFastWriter, TimeZoneUtilsTest, TestFastOutputStream, OpenExchangeRatesOrgProviderTest, PluginInfoTest, TestFastLRUCache, ChaosMonkeyNothingIsSafeTest, TestSolrXMLSerializer, PreAnalyzedFieldTest, DateFieldTest, DOMUtilTest, RAMDirectoryFactoryTest, ClusterStateTest, TestLRUCache, TestUtils, TestDocumentBuilder, ZkNodePropsTest, SliceStateTest, SystemInfoHandlerTest, UUIDFieldTest, FileUtilsTest, TestRTGBase, CursorPagingTest, SolrTestCaseJ4Test, TestDistributedMissingSort, NoFacetTest, ExpressionTest, AbstractAnalyticsFacetTest, FieldFacetExtrasTest, AliasIntegrationTest, CustomCollectionTest, MigrateRouteKeyTest, OverseerRolesTest]
   [junit4] Completed in 18.04s, 1 test, 1 error <<< FAILURES!

[...truncated 137 lines...]
BUILD FAILED
C:\Users\JenkinsSlave\workspace\Lucene-Solr-trunk-Windows\build.xml:453: The following error occurred while executing this line:
C:\Users\JenkinsSlave\workspace\Lucene-Solr-trunk-Windows\build.xml:433: The following error occurred while executing this line:
C:\Users\JenkinsSlave\workspace\Lucene-Solr-trunk-Windows\build.xml:39: The following error occurred while executing this line:
C:\Users\JenkinsSlave\workspace\Lucene-Solr-trunk-Windows\extra-targets.xml:37: The following error occurred while executing this line:
C:\Users\JenkinsSlave\workspace\Lucene-Solr-trunk-Windows\solr\build.xml:189: The following error occurred while executing this line:
C:\Users\JenkinsSlave\workspace\Lucene-Solr-trunk-Windows\solr\common-build.xml:491: The following error occurred while executing this line:
C:\Users\JenkinsSlave\workspace\Lucene-Solr-trunk-Windows\lucene\common-build.xml:1268: The following error occurred while executing this line:
C:\Users\JenkinsSlave\workspace\Lucene-Solr-trunk-Windows\lucene\common-build.xml:901: There were test failures: 365 suites, 1590 tests, 1 error, 1 failure, 40 ignored (12 assumptions)

Total time: 70 minutes 41 seconds
Build step 'Invoke Ant' marked build as failure
Description set: Java: 32bit/jdk1.8.0-ea-b124 -server -XX:+UseG1GC
Archiving artifacts
Recording test results
Email was triggered for: Failure
Sending email for trigger: Failure