You are viewing a plain text version of this content. The canonical link for it is here.
Posted to builds@solr.apache.org by Policeman Jenkins Server <je...@thetaphi.de> on 2023/12/14 02:37:41 UTC

[JENKINS] Solr-main-MacOSX (64bit/hotspot/jdk-20) - Build # 3698 - Still Failing!

Build: https://jenkins.thetaphi.de/job/Solr-main-MacOSX/3698/
Java: 64bit/hotspot/jdk-20 -XX:-UseCompressedOops -XX:+UseG1GC

No tests ran.

[JENKINS] Solr-main-MacOSX (64bit/hotspot/jdk-11.0.21) - Build # 3713 - Still Failing!

Posted by Policeman Jenkins Server <je...@thetaphi.de>.
Build: https://jenkins.thetaphi.de/job/Solr-main-MacOSX/3713/
Java: 64bit/hotspot/jdk-11.0.21 -XX:+UseCompressedOops -XX:+UseConcMarkSweepGC

All tests passed

[JENKINS] Solr-main-MacOSX (64bit/hotspot/jdk-20) - Build # 3712 - Still Failing!

Posted by Policeman Jenkins Server <je...@thetaphi.de>.
Build: https://jenkins.thetaphi.de/job/Solr-main-MacOSX/3712/
Java: 64bit/hotspot/jdk-20 -XX:+UseCompressedOops -XX:+UseG1GC

No tests ran.

[JENKINS] Solr-main-MacOSX (64bit/hotspot/jdk-20) - Build # 3711 - Failure!

Posted by Policeman Jenkins Server <je...@thetaphi.de>.
Build: https://jenkins.thetaphi.de/job/Solr-main-MacOSX/3711/
Java: 64bit/hotspot/jdk-20 -XX:-UseCompressedOops -XX:+UseG1GC

No tests ran.

[JENKINS] Solr-main-MacOSX (64bit/hotspot/jdk-21.0.1) - Build # 3710 - Still unstable!

Posted by Policeman Jenkins Server <je...@thetaphi.de>.
Build: https://jenkins.thetaphi.de/job/Solr-main-MacOSX/3710/
Java: 64bit/hotspot/jdk-21.0.1 -XX:+UseCompressedOops -XX:+UseSerialGC

1 tests failed.
FAILED:  org.apache.solr.cloud.ReplicationFactorTest.test

Error Message:
org.apache.solr.client.solrj.impl.BaseHttpSolrClient$RemoteSolrException: Error from server at http://127.0.0.1:49689/solr: Underlying core creation failed while creating collection: repfacttest_c8n_2x2

Stack Trace:
org.apache.solr.client.solrj.impl.BaseHttpSolrClient$RemoteSolrException: Error from server at http://127.0.0.1:49689/solr: Underlying core creation failed while creating collection: repfacttest_c8n_2x2
	at __randomizedtesting.SeedInfo.seed([3A4D301713FB8DA2:B2190FCDBD07E05A]:0)
	at app//org.apache.solr.client.solrj.impl.HttpSolrClient.executeMethod(HttpSolrClient.java:736)
	at app//org.apache.solr.client.solrj.impl.HttpSolrClient.request(HttpSolrClient.java:255)
	at app//org.apache.solr.client.solrj.impl.HttpSolrClient.request(HttpSolrClient.java:235)
	at app//org.apache.solr.client.solrj.SolrClient.request(SolrClient.java:1194)
	at app//org.apache.solr.cloud.AbstractFullDistribZkTestBase.createCollection(AbstractFullDistribZkTestBase.java:2097)
	at app//org.apache.solr.cloud.AbstractFullDistribZkTestBase.createCollection(AbstractFullDistribZkTestBase.java:2135)
	at app//org.apache.solr.cloud.AbstractFullDistribZkTestBase.createCollection(AbstractFullDistribZkTestBase.java:2023)
	at app//org.apache.solr.cloud.ReplicationFactorTest.createCollectionWithRetry(ReplicationFactorTest.java:514)
	at app//org.apache.solr.cloud.ReplicationFactorTest.testRf2NotUsingDirectUpdates(ReplicationFactorTest.java:111)
	at app//org.apache.solr.cloud.ReplicationFactorTest.test(ReplicationFactorTest.java:95)
	at java.base@21.0.1/jdk.internal.reflect.DirectMethodHandleAccessor.invoke(DirectMethodHandleAccessor.java:103)
	at java.base@21.0.1/java.lang.reflect.Method.invoke(Method.java:580)
	at app//com.carrotsearch.randomizedtesting.RandomizedRunner.invoke(RandomizedRunner.java:1758)
	at app//com.carrotsearch.randomizedtesting.RandomizedRunner$8.evaluate(RandomizedRunner.java:946)
	at app//com.carrotsearch.randomizedtesting.RandomizedRunner$9.evaluate(RandomizedRunner.java:982)
	at app//com.carrotsearch.randomizedtesting.RandomizedRunner$10.evaluate(RandomizedRunner.java:996)
	at app//org.apache.solr.BaseDistributedSearchTestCase$ShardsRepeatRule$ShardsFixedStatement.callStatement(BaseDistributedSearchTestCase.java:1079)
	at app//org.apache.solr.BaseDistributedSearchTestCase$ShardsRepeatRule$ShardsStatement.evaluate(BaseDistributedSearchTestCase.java:1050)
	at app//com.carrotsearch.randomizedtesting.rules.SystemPropertiesRestoreRule$1.evaluate(SystemPropertiesRestoreRule.java:80)
	at app//org.junit.rules.RunRules.evaluate(RunRules.java:20)
	at app//org.apache.lucene.tests.util.TestRuleSetupTeardownChained$1.evaluate(TestRuleSetupTeardownChained.java:48)
	at app//org.apache.lucene.tests.util.AbstractBeforeAfterRule$1.evaluate(AbstractBeforeAfterRule.java:43)
	at app//org.apache.lucene.tests.util.TestRuleThreadAndTestName$1.evaluate(TestRuleThreadAndTestName.java:45)
	at app//org.apache.lucene.tests.util.TestRuleIgnoreAfterMaxFailures$1.evaluate(TestRuleIgnoreAfterMaxFailures.java:60)
	at app//org.apache.lucene.tests.util.TestRuleMarkFailure$1.evaluate(TestRuleMarkFailure.java:44)
	at app//org.junit.rules.RunRules.evaluate(RunRules.java:20)
	at app//com.carrotsearch.randomizedtesting.rules.StatementAdapter.evaluate(StatementAdapter.java:36)
	at app//com.carrotsearch.randomizedtesting.ThreadLeakControl$StatementRunner.run(ThreadLeakControl.java:390)
	at app//com.carrotsearch.randomizedtesting.ThreadLeakControl.forkTimeoutingTask(ThreadLeakControl.java:843)
	at app//com.carrotsearch.randomizedtesting.ThreadLeakControl$3.evaluate(ThreadLeakControl.java:490)
	at app//com.carrotsearch.randomizedtesting.RandomizedRunner.runSingleTest(RandomizedRunner.java:955)
	at app//com.carrotsearch.randomizedtesting.RandomizedRunner$5.evaluate(RandomizedRunner.java:840)
	at app//com.carrotsearch.randomizedtesting.RandomizedRunner$6.evaluate(RandomizedRunner.java:891)
	at app//com.carrotsearch.randomizedtesting.RandomizedRunner$7.evaluate(RandomizedRunner.java:902)
	at app//com.carrotsearch.randomizedtesting.rules.StatementAdapter.evaluate(StatementAdapter.java:36)
	at app//com.carrotsearch.randomizedtesting.rules.StatementAdapter.evaluate(StatementAdapter.java:36)
	at app//org.apache.lucene.tests.util.AbstractBeforeAfterRule$1.evaluate(AbstractBeforeAfterRule.java:43)
	at app//com.carrotsearch.randomizedtesting.rules.SystemPropertiesRestoreRule$1.evaluate(SystemPropertiesRestoreRule.java:80)
	at app//org.junit.rules.RunRules.evaluate(RunRules.java:20)
	at app//org.apache.lucene.tests.util.AbstractBeforeAfterRule$1.evaluate(AbstractBeforeAfterRule.java:43)
	at app//com.carrotsearch.randomizedtesting.rules.StatementAdapter.evaluate(StatementAdapter.java:36)
	at app//org.apache.lucene.tests.util.TestRuleStoreClassName$1.evaluate(TestRuleStoreClassName.java:38)
	at app//com.carrotsearch.randomizedtesting.rules.NoShadowingOrOverridesOnMethodsRule$1.evaluate(NoShadowingOrOverridesOnMethodsRule.java:40)
	at app//com.carrotsearch.randomizedtesting.rules.NoShadowingOrOverridesOnMethodsRule$1.evaluate(NoShadowingOrOverridesOnMethodsRule.java:40)
	at app//com.carrotsearch.randomizedtesting.rules.StatementAdapter.evaluate(StatementAdapter.java:36)
	at app//com.carrotsearch.randomizedtesting.rules.StatementAdapter.evaluate(StatementAdapter.java:36)
	at app//org.apache.lucene.tests.util.TestRuleAssertionsRequired$1.evaluate(TestRuleAssertionsRequired.java:53)
	at app//org.apache.lucene.tests.util.AbstractBeforeAfterRule$1.evaluate(AbstractBeforeAfterRule.java:43)
	at app//org.apache.lucene.tests.util.TestRuleMarkFailure$1.evaluate(TestRuleMarkFailure.java:44)
	at app//org.apache.lucene.tests.util.TestRuleIgnoreAfterMaxFailures$1.evaluate(TestRuleIgnoreAfterMaxFailures.java:60)
	at app//org.apache.lucene.tests.util.TestRuleIgnoreTestSuites$1.evaluate(TestRuleIgnoreTestSuites.java:47)
	at app//org.junit.rules.RunRules.evaluate(RunRules.java:20)
	at app//com.carrotsearch.randomizedtesting.rules.StatementAdapter.evaluate(StatementAdapter.java:36)
	at app//com.carrotsearch.randomizedtesting.ThreadLeakControl$StatementRunner.run(ThreadLeakControl.java:390)
	at app//com.carrotsearch.randomizedtesting.ThreadLeakControl.lambda$forkTimeoutingTask$0(ThreadLeakControl.java:850)
	at java.base@21.0.1/java.lang.Thread.run(Thread.java:1583)

[JENKINS] Solr-main-MacOSX (64bit/hotspot/jdk-20) - Build # 3709 - Still Failing!

Posted by Policeman Jenkins Server <je...@thetaphi.de>.
Build: https://jenkins.thetaphi.de/job/Solr-main-MacOSX/3709/
Java: 64bit/hotspot/jdk-20 -XX:-UseCompressedOops -XX:+UseSerialGC

No tests ran.

[JENKINS] Solr-main-MacOSX (64bit/hotspot/jdk-21.0.1) - Build # 3708 - Failure!

Posted by Policeman Jenkins Server <je...@thetaphi.de>.
Build: https://jenkins.thetaphi.de/job/Solr-main-MacOSX/3708/
Java: 64bit/hotspot/jdk-21.0.1 -XX:+UseCompressedOops -XX:+UseSerialGC

3 tests failed.
FAILED:  TEST-org.apache.solr.client.solrj.embedded.SolrExampleStreamingBinaryTest.xml.[failed-to-read]

Error Message:


Stack Trace:
Failed to read test report file /Users/jenkins/workspace/Solr-main-MacOSX/solr/solrj/build/test-results/test/TEST-org.apache.solr.client.solrj.embedded.SolrExampleStreamingBinaryTest.xml
org.dom4j.DocumentException: Error on line 377 of document  : XML document structures must start and end within the same entity.
	at org.dom4j.io.SAXReader.read(SAXReader.java:511)
	at org.dom4j.io.SAXReader.read(SAXReader.java:392)
	at hudson.tasks.junit.SuiteResult.parse(SuiteResult.java:186)
	at hudson.tasks.junit.TestResult.parse(TestResult.java:390)
	at hudson.tasks.junit.TestResult.parsePossiblyEmpty(TestResult.java:320)
	at hudson.tasks.junit.TestResult.parse(TestResult.java:262)
	at hudson.tasks.junit.TestResult.parse(TestResult.java:248)
	at hudson.tasks.junit.TestResult.parse(TestResult.java:226)
	at hudson.tasks.junit.TestResult.<init>(TestResult.java:179)
	at hudson.tasks.junit.JUnitParser$ParseResultCallable.invoke(JUnitParser.java:180)
	at hudson.FilePath$FileCallableWrapper.call(FilePath.java:3578)
	at hudson.remoting.UserRequest.perform(UserRequest.java:211)
	at hudson.remoting.UserRequest.perform(UserRequest.java:54)
	at hudson.remoting.Request$2.run(Request.java:377)
	at hudson.remoting.InterceptingExecutorService.lambda$wrap$0(InterceptingExecutorService.java:78)
	at java.base/java.util.concurrent.FutureTask.run(FutureTask.java:264)
	at java.base/java.util.concurrent.ThreadPoolExecutor.runWorker(ThreadPoolExecutor.java:1128)
	at java.base/java.util.concurrent.ThreadPoolExecutor$Worker.run(ThreadPoolExecutor.java:628)
	at java.base/java.lang.Thread.run(Thread.java:829)
Caused by: org.xml.sax.SAXParseException; lineNumber: 377; columnNumber: 55; XML document structures must start and end within the same entity.
	at java.xml/com.sun.org.apache.xerces.internal.util.ErrorHandlerWrapper.createSAXParseException(ErrorHandlerWrapper.java:204)
	at java.xml/com.sun.org.apache.xerces.internal.util.ErrorHandlerWrapper.fatalError(ErrorHandlerWrapper.java:178)
	at java.xml/com.sun.org.apache.xerces.internal.impl.XMLErrorReporter.reportError(XMLErrorReporter.java:400)
	at java.xml/com.sun.org.apache.xerces.internal.impl.XMLErrorReporter.reportError(XMLErrorReporter.java:327)
	at java.xml/com.sun.org.apache.xerces.internal.impl.XMLScanner.reportFatalError(XMLScanner.java:1465)
	at java.xml/com.sun.org.apache.xerces.internal.impl.XMLDocumentFragmentScannerImpl.endEntity(XMLDocumentFragmentScannerImpl.java:933)
	at java.xml/com.sun.org.apache.xerces.internal.impl.XMLDocumentScannerImpl.endEntity(XMLDocumentScannerImpl.java:562)
	at java.xml/com.sun.org.apache.xerces.internal.impl.XMLEntityManager.endEntity(XMLEntityManager.java:1502)
	at java.xml/com.sun.org.apache.xerces.internal.impl.XMLEntityScanner.load(XMLEntityScanner.java:1720)
	at java.xml/com.sun.org.apache.xerces.internal.impl.XMLEntityScanner.scanData(XMLEntityScanner.java:1256)
	at java.xml/com.sun.org.apache.xerces.internal.impl.XMLDocumentFragmentScannerImpl.scanCDATASection(XMLDocumentFragmentScannerImpl.java:1618)
	at java.xml/com.sun.org.apache.xerces.internal.impl.XMLDocumentFragmentScannerImpl$FragmentContentDriver.next(XMLDocumentFragmentScannerImpl.java:2932)
	at java.xml/com.sun.org.apache.xerces.internal.impl.XMLDocumentScannerImpl.next(XMLDocumentScannerImpl.java:605)
	at java.xml/com.sun.org.apache.xerces.internal.impl.XMLNSDocumentScannerImpl.next(XMLNSDocumentScannerImpl.java:112)
	at java.xml/com.sun.org.apache.xerces.internal.impl.XMLDocumentFragmentScannerImpl.scanDocument(XMLDocumentFragmentScannerImpl.java:534)
	at java.xml/com.sun.org.apache.xerces.internal.parsers.XML11Configuration.parse(XML11Configuration.java:888)
	at java.xml/com.sun.org.apache.xerces.internal.parsers.XML11Configuration.parse(XML11Configuration.java:824)
	at java.xml/com.sun.org.apache.xerces.internal.parsers.XMLParser.parse(XMLParser.java:141)
	at java.xml/com.sun.org.apache.xerces.internal.parsers.AbstractSAXParser.parse(AbstractSAXParser.java:1216)
	at java.xml/com.sun.org.apache.xerces.internal.jaxp.SAXParserImpl$JAXPSAXParser.parse(SAXParserImpl.java:635)
	at org.dom4j.io.SAXReader.read(SAXReader.java:494)
	... 18 more


FAILED:  TEST-org.apache.solr.client.solrj.impl.ConcurrentUpdateHttp2SolrClientMultiCollectionTest.xml.[failed-to-read]

Error Message:


Stack Trace:
Failed to read test report file /Users/jenkins/workspace/Solr-main-MacOSX/solr/solrj/build/test-results/test/TEST-org.apache.solr.client.solrj.impl.ConcurrentUpdateHttp2SolrClientMultiCollectionTest.xml
org.dom4j.DocumentException: Error on line 178 of document  : XML document structures must start and end within the same entity.
	at org.dom4j.io.SAXReader.read(SAXReader.java:511)
	at org.dom4j.io.SAXReader.read(SAXReader.java:392)
	at hudson.tasks.junit.SuiteResult.parse(SuiteResult.java:186)
	at hudson.tasks.junit.TestResult.parse(TestResult.java:390)
	at hudson.tasks.junit.TestResult.parsePossiblyEmpty(TestResult.java:320)
	at hudson.tasks.junit.TestResult.parse(TestResult.java:262)
	at hudson.tasks.junit.TestResult.parse(TestResult.java:248)
	at hudson.tasks.junit.TestResult.parse(TestResult.java:226)
	at hudson.tasks.junit.TestResult.<init>(TestResult.java:179)
	at hudson.tasks.junit.JUnitParser$ParseResultCallable.invoke(JUnitParser.java:180)
	at hudson.FilePath$FileCallableWrapper.call(FilePath.java:3578)
	at hudson.remoting.UserRequest.perform(UserRequest.java:211)
	at hudson.remoting.UserRequest.perform(UserRequest.java:54)
	at hudson.remoting.Request$2.run(Request.java:377)
	at hudson.remoting.InterceptingExecutorService.lambda$wrap$0(InterceptingExecutorService.java:78)
	at java.base/java.util.concurrent.FutureTask.run(FutureTask.java:264)
	at java.base/java.util.concurrent.ThreadPoolExecutor.runWorker(ThreadPoolExecutor.java:1128)
	at java.base/java.util.concurrent.ThreadPoolExecutor$Worker.run(ThreadPoolExecutor.java:628)
	at java.base/java.lang.Thread.run(Thread.java:829)
Caused by: org.xml.sax.SAXParseException; lineNumber: 178; columnNumber: 29; XML document structures must start and end within the same entity.
	at java.xml/com.sun.org.apache.xerces.internal.util.ErrorHandlerWrapper.createSAXParseException(ErrorHandlerWrapper.java:204)
	at java.xml/com.sun.org.apache.xerces.internal.util.ErrorHandlerWrapper.fatalError(ErrorHandlerWrapper.java:178)
	at java.xml/com.sun.org.apache.xerces.internal.impl.XMLErrorReporter.reportError(XMLErrorReporter.java:400)
	at java.xml/com.sun.org.apache.xerces.internal.impl.XMLErrorReporter.reportError(XMLErrorReporter.java:327)
	at java.xml/com.sun.org.apache.xerces.internal.impl.XMLScanner.reportFatalError(XMLScanner.java:1465)
	at java.xml/com.sun.org.apache.xerces.internal.impl.XMLDocumentFragmentScannerImpl.endEntity(XMLDocumentFragmentScannerImpl.java:933)
	at java.xml/com.sun.org.apache.xerces.internal.impl.XMLDocumentScannerImpl.endEntity(XMLDocumentScannerImpl.java:562)
	at java.xml/com.sun.org.apache.xerces.internal.impl.XMLEntityManager.endEntity(XMLEntityManager.java:1502)
	at java.xml/com.sun.org.apache.xerces.internal.impl.XMLEntityScanner.load(XMLEntityScanner.java:1720)
	at java.xml/com.sun.org.apache.xerces.internal.impl.XMLEntityScanner.scanData(XMLEntityScanner.java:1256)
	at java.xml/com.sun.org.apache.xerces.internal.impl.XMLDocumentFragmentScannerImpl.scanCDATASection(XMLDocumentFragmentScannerImpl.java:1618)
	at java.xml/com.sun.org.apache.xerces.internal.impl.XMLDocumentFragmentScannerImpl$FragmentContentDriver.next(XMLDocumentFragmentScannerImpl.java:2932)
	at java.xml/com.sun.org.apache.xerces.internal.impl.XMLDocumentScannerImpl.next(XMLDocumentScannerImpl.java:605)
	at java.xml/com.sun.org.apache.xerces.internal.impl.XMLNSDocumentScannerImpl.next(XMLNSDocumentScannerImpl.java:112)
	at java.xml/com.sun.org.apache.xerces.internal.impl.XMLDocumentFragmentScannerImpl.scanDocument(XMLDocumentFragmentScannerImpl.java:534)
	at java.xml/com.sun.org.apache.xerces.internal.parsers.XML11Configuration.parse(XML11Configuration.java:888)
	at java.xml/com.sun.org.apache.xerces.internal.parsers.XML11Configuration.parse(XML11Configuration.java:824)
	at java.xml/com.sun.org.apache.xerces.internal.parsers.XMLParser.parse(XMLParser.java:141)
	at java.xml/com.sun.org.apache.xerces.internal.parsers.AbstractSAXParser.parse(AbstractSAXParser.java:1216)
	at java.xml/com.sun.org.apache.xerces.internal.jaxp.SAXParserImpl$JAXPSAXParser.parse(SAXParserImpl.java:635)
	at org.dom4j.io.SAXReader.read(SAXReader.java:494)
	... 18 more


FAILED:  TEST-org.apache.solr.client.solrj.impl.ConcurrentUpdateHttp2SolrClientTest.xml.[empty]

Error Message:


Stack Trace:
Test report file /Users/jenkins/workspace/Solr-main-MacOSX/solr/solrj/build/test-results/test/TEST-org.apache.solr.client.solrj.impl.ConcurrentUpdateHttp2SolrClientTest.xml was length 0

[JENKINS] Solr-main-MacOSX (64bit/hotspot/jdk-19) - Build # 3707 - Still unstable!

Posted by Policeman Jenkins Server <je...@thetaphi.de>.
Build: https://jenkins.thetaphi.de/job/Solr-main-MacOSX/3707/
Java: 64bit/hotspot/jdk-19 -XX:+UseCompressedOops -XX:+UseSerialGC

4 tests failed.
FAILED:  org.apache.solr.cloud.PeerSyncReplicationTest.test

Error Message:
java.lang.AssertionError: expected:<0> but was:<1>

Stack Trace:
java.lang.AssertionError: expected:<0> but was:<1>
	at __randomizedtesting.SeedInfo.seed([9715A2A5212DDE15:1F419D7F8FD1B3ED]:0)
	at org.junit.Assert.fail(Assert.java:89)
	at org.junit.Assert.failNotEquals(Assert.java:835)
	at org.junit.Assert.assertEquals(Assert.java:647)
	at org.junit.Assert.assertEquals(Assert.java:633)
	at org.apache.solr.cloud.PeerSyncReplicationTest.test(PeerSyncReplicationTest.java:204)
	at java.base/jdk.internal.reflect.DirectMethodHandleAccessor.invoke(DirectMethodHandleAccessor.java:104)
	at java.base/java.lang.reflect.Method.invoke(Method.java:578)
	at com.carrotsearch.randomizedtesting.RandomizedRunner.invoke(RandomizedRunner.java:1758)
	at com.carrotsearch.randomizedtesting.RandomizedRunner$8.evaluate(RandomizedRunner.java:946)
	at com.carrotsearch.randomizedtesting.RandomizedRunner$9.evaluate(RandomizedRunner.java:982)
	at com.carrotsearch.randomizedtesting.RandomizedRunner$10.evaluate(RandomizedRunner.java:996)
	at org.apache.solr.BaseDistributedSearchTestCase$ShardsRepeatRule$ShardsFixedStatement.callStatement(BaseDistributedSearchTestCase.java:1079)
	at org.apache.solr.BaseDistributedSearchTestCase$ShardsRepeatRule$ShardsStatement.evaluate(BaseDistributedSearchTestCase.java:1050)
	at com.carrotsearch.randomizedtesting.rules.SystemPropertiesRestoreRule$1.evaluate(SystemPropertiesRestoreRule.java:80)
	at org.junit.rules.RunRules.evaluate(RunRules.java:20)
	at org.apache.lucene.tests.util.TestRuleSetupTeardownChained$1.evaluate(TestRuleSetupTeardownChained.java:48)
	at org.apache.lucene.tests.util.AbstractBeforeAfterRule$1.evaluate(AbstractBeforeAfterRule.java:43)
	at org.apache.lucene.tests.util.TestRuleThreadAndTestName$1.evaluate(TestRuleThreadAndTestName.java:45)
	at org.apache.lucene.tests.util.TestRuleIgnoreAfterMaxFailures$1.evaluate(TestRuleIgnoreAfterMaxFailures.java:60)
	at org.apache.lucene.tests.util.TestRuleMarkFailure$1.evaluate(TestRuleMarkFailure.java:44)
	at org.junit.rules.RunRules.evaluate(RunRules.java:20)
	at com.carrotsearch.randomizedtesting.rules.StatementAdapter.evaluate(StatementAdapter.java:36)
	at com.carrotsearch.randomizedtesting.ThreadLeakControl$StatementRunner.run(ThreadLeakControl.java:390)
	at com.carrotsearch.randomizedtesting.ThreadLeakControl.forkTimeoutingTask(ThreadLeakControl.java:843)
	at com.carrotsearch.randomizedtesting.ThreadLeakControl$3.evaluate(ThreadLeakControl.java:490)
	at com.carrotsearch.randomizedtesting.RandomizedRunner.runSingleTest(RandomizedRunner.java:955)
	at com.carrotsearch.randomizedtesting.RandomizedRunner$5.evaluate(RandomizedRunner.java:840)
	at com.carrotsearch.randomizedtesting.RandomizedRunner$6.evaluate(RandomizedRunner.java:891)
	at com.carrotsearch.randomizedtesting.RandomizedRunner$7.evaluate(RandomizedRunner.java:902)
	at com.carrotsearch.randomizedtesting.rules.StatementAdapter.evaluate(StatementAdapter.java:36)
	at com.carrotsearch.randomizedtesting.rules.StatementAdapter.evaluate(StatementAdapter.java:36)
	at org.apache.lucene.tests.util.AbstractBeforeAfterRule$1.evaluate(AbstractBeforeAfterRule.java:43)
	at com.carrotsearch.randomizedtesting.rules.SystemPropertiesRestoreRule$1.evaluate(SystemPropertiesRestoreRule.java:80)
	at org.junit.rules.RunRules.evaluate(RunRules.java:20)
	at org.apache.lucene.tests.util.AbstractBeforeAfterRule$1.evaluate(AbstractBeforeAfterRule.java:43)
	at com.carrotsearch.randomizedtesting.rules.StatementAdapter.evaluate(StatementAdapter.java:36)
	at org.apache.lucene.tests.util.TestRuleStoreClassName$1.evaluate(TestRuleStoreClassName.java:38)
	at com.carrotsearch.randomizedtesting.rules.NoShadowingOrOverridesOnMethodsRule$1.evaluate(NoShadowingOrOverridesOnMethodsRule.java:40)
	at com.carrotsearch.randomizedtesting.rules.NoShadowingOrOverridesOnMethodsRule$1.evaluate(NoShadowingOrOverridesOnMethodsRule.java:40)
	at com.carrotsearch.randomizedtesting.rules.StatementAdapter.evaluate(StatementAdapter.java:36)
	at com.carrotsearch.randomizedtesting.rules.StatementAdapter.evaluate(StatementAdapter.java:36)
	at org.apache.lucene.tests.util.TestRuleAssertionsRequired$1.evaluate(TestRuleAssertionsRequired.java:53)
	at org.apache.lucene.tests.util.AbstractBeforeAfterRule$1.evaluate(AbstractBeforeAfterRule.java:43)
	at org.apache.lucene.tests.util.TestRuleMarkFailure$1.evaluate(TestRuleMarkFailure.java:44)
	at org.apache.lucene.tests.util.TestRuleIgnoreAfterMaxFailures$1.evaluate(TestRuleIgnoreAfterMaxFailures.java:60)
	at org.apache.lucene.tests.util.TestRuleIgnoreTestSuites$1.evaluate(TestRuleIgnoreTestSuites.java:47)
	at org.junit.rules.RunRules.evaluate(RunRules.java:20)
	at com.carrotsearch.randomizedtesting.rules.StatementAdapter.evaluate(StatementAdapter.java:36)
	at com.carrotsearch.randomizedtesting.ThreadLeakControl$StatementRunner.run(ThreadLeakControl.java:390)
	at com.carrotsearch.randomizedtesting.ThreadLeakControl.lambda$forkTimeoutingTask$0(ThreadLeakControl.java:850)
	at java.base/java.lang.Thread.run(Thread.java:1589)


FAILED:  org.apache.solr.cluster.placement.impl.PlacementPluginIntegrationTest.testDynamicReconfiguration

Error Message:
java.lang.AssertionError

Stack Trace:
java.lang.AssertionError
	at __randomizedtesting.SeedInfo.seed([9715A2A5212DDE15:6D70E5026F804C2E]:0)
	at org.junit.Assert.fail(Assert.java:87)
	at org.junit.Assert.assertTrue(Assert.java:42)
	at org.junit.Assert.assertNotNull(Assert.java:713)
	at org.junit.Assert.assertNotNull(Assert.java:723)
	at org.apache.solr.cluster.placement.impl.PlacementPluginIntegrationTest.testDynamicReconfiguration(PlacementPluginIntegrationTest.java:219)
	at java.base/jdk.internal.reflect.DirectMethodHandleAccessor.invoke(DirectMethodHandleAccessor.java:104)
	at java.base/java.lang.reflect.Method.invoke(Method.java:578)
	at com.carrotsearch.randomizedtesting.RandomizedRunner.invoke(RandomizedRunner.java:1758)
	at com.carrotsearch.randomizedtesting.RandomizedRunner$8.evaluate(RandomizedRunner.java:946)
	at com.carrotsearch.randomizedtesting.RandomizedRunner$9.evaluate(RandomizedRunner.java:982)
	at com.carrotsearch.randomizedtesting.RandomizedRunner$10.evaluate(RandomizedRunner.java:996)
	at com.carrotsearch.randomizedtesting.rules.StatementAdapter.evaluate(StatementAdapter.java:36)
	at com.carrotsearch.randomizedtesting.rules.SystemPropertiesRestoreRule$1.evaluate(SystemPropertiesRestoreRule.java:80)
	at org.junit.rules.RunRules.evaluate(RunRules.java:20)
	at org.apache.lucene.tests.util.TestRuleSetupTeardownChained$1.evaluate(TestRuleSetupTeardownChained.java:48)
	at org.apache.lucene.tests.util.AbstractBeforeAfterRule$1.evaluate(AbstractBeforeAfterRule.java:43)
	at org.apache.lucene.tests.util.TestRuleThreadAndTestName$1.evaluate(TestRuleThreadAndTestName.java:45)
	at org.apache.lucene.tests.util.TestRuleIgnoreAfterMaxFailures$1.evaluate(TestRuleIgnoreAfterMaxFailures.java:60)
	at org.apache.lucene.tests.util.TestRuleMarkFailure$1.evaluate(TestRuleMarkFailure.java:44)
	at org.junit.rules.RunRules.evaluate(RunRules.java:20)
	at com.carrotsearch.randomizedtesting.rules.StatementAdapter.evaluate(StatementAdapter.java:36)
	at com.carrotsearch.randomizedtesting.ThreadLeakControl$StatementRunner.run(ThreadLeakControl.java:390)
	at com.carrotsearch.randomizedtesting.ThreadLeakControl.forkTimeoutingTask(ThreadLeakControl.java:843)
	at com.carrotsearch.randomizedtesting.ThreadLeakControl$3.evaluate(ThreadLeakControl.java:490)
	at com.carrotsearch.randomizedtesting.RandomizedRunner.runSingleTest(RandomizedRunner.java:955)
	at com.carrotsearch.randomizedtesting.RandomizedRunner$5.evaluate(RandomizedRunner.java:840)
	at com.carrotsearch.randomizedtesting.RandomizedRunner$6.evaluate(RandomizedRunner.java:891)
	at com.carrotsearch.randomizedtesting.RandomizedRunner$7.evaluate(RandomizedRunner.java:902)
	at com.carrotsearch.randomizedtesting.rules.StatementAdapter.evaluate(StatementAdapter.java:36)
	at com.carrotsearch.randomizedtesting.rules.StatementAdapter.evaluate(StatementAdapter.java:36)
	at org.apache.lucene.tests.util.AbstractBeforeAfterRule$1.evaluate(AbstractBeforeAfterRule.java:43)
	at com.carrotsearch.randomizedtesting.rules.SystemPropertiesRestoreRule$1.evaluate(SystemPropertiesRestoreRule.java:80)
	at org.junit.rules.RunRules.evaluate(RunRules.java:20)
	at org.apache.lucene.tests.util.AbstractBeforeAfterRule$1.evaluate(AbstractBeforeAfterRule.java:43)
	at com.carrotsearch.randomizedtesting.rules.StatementAdapter.evaluate(StatementAdapter.java:36)
	at org.apache.lucene.tests.util.TestRuleStoreClassName$1.evaluate(TestRuleStoreClassName.java:38)
	at com.carrotsearch.randomizedtesting.rules.NoShadowingOrOverridesOnMethodsRule$1.evaluate(NoShadowingOrOverridesOnMethodsRule.java:40)
	at com.carrotsearch.randomizedtesting.rules.NoShadowingOrOverridesOnMethodsRule$1.evaluate(NoShadowingOrOverridesOnMethodsRule.java:40)
	at com.carrotsearch.randomizedtesting.rules.StatementAdapter.evaluate(StatementAdapter.java:36)
	at com.carrotsearch.randomizedtesting.rules.StatementAdapter.evaluate(StatementAdapter.java:36)
	at org.apache.lucene.tests.util.TestRuleAssertionsRequired$1.evaluate(TestRuleAssertionsRequired.java:53)
	at org.apache.lucene.tests.util.AbstractBeforeAfterRule$1.evaluate(AbstractBeforeAfterRule.java:43)
	at org.apache.lucene.tests.util.TestRuleMarkFailure$1.evaluate(TestRuleMarkFailure.java:44)
	at org.apache.lucene.tests.util.TestRuleIgnoreAfterMaxFailures$1.evaluate(TestRuleIgnoreAfterMaxFailures.java:60)
	at org.apache.lucene.tests.util.TestRuleIgnoreTestSuites$1.evaluate(TestRuleIgnoreTestSuites.java:47)
	at org.junit.rules.RunRules.evaluate(RunRules.java:20)
	at com.carrotsearch.randomizedtesting.rules.StatementAdapter.evaluate(StatementAdapter.java:36)
	at com.carrotsearch.randomizedtesting.ThreadLeakControl$StatementRunner.run(ThreadLeakControl.java:390)
	at com.carrotsearch.randomizedtesting.ThreadLeakControl.lambda$forkTimeoutingTask$0(ThreadLeakControl.java:850)
	at java.base/java.lang.Thread.run(Thread.java:1589)


FAILED:  org.apache.solr.core.TestFileSystemConfigSetService.classMethod

Error Message:
java.lang.RuntimeException: file handle leaks: [InputStream(/Users/jenkins/workspace/Solr-main-MacOSX/solr/core/build/tmp/tests-tmp/solr.core.TestFileSystemConfigSetService_9715A2A5212DDE15-001/tempDir-001/testconfig/schema.xml), InputStream(/Users/jenkins/workspace/Solr-main-MacOSX/solr/core/build/tmp/tests-tmp/solr.core.TestFileSystemConfigSetService_9715A2A5212DDE15-001/tempDir-001/testconfig/solrconfig.xml), InputStream(/Users/jenkins/workspace/Solr-main-MacOSX/solr/core/build/tmp/tests-tmp/solr.core.TestFileSystemConfigSetService_9715A2A5212DDE15-001/tempDir-001/testconfig/solrconfig.xml), InputStream(/Users/jenkins/workspace/Solr-main-MacOSX/solr/core/build/tmp/tests-tmp/solr.core.TestFileSystemConfigSetService_9715A2A5212DDE15-001/tempDir-001/testconfig/schema.xml)]

Stack Trace:
java.lang.RuntimeException: file handle leaks: [InputStream(/Users/jenkins/workspace/Solr-main-MacOSX/solr/core/build/tmp/tests-tmp/solr.core.TestFileSystemConfigSetService_9715A2A5212DDE15-001/tempDir-001/testconfig/schema.xml), InputStream(/Users/jenkins/workspace/Solr-main-MacOSX/solr/core/build/tmp/tests-tmp/solr.core.TestFileSystemConfigSetService_9715A2A5212DDE15-001/tempDir-001/testconfig/solrconfig.xml), InputStream(/Users/jenkins/workspace/Solr-main-MacOSX/solr/core/build/tmp/tests-tmp/solr.core.TestFileSystemConfigSetService_9715A2A5212DDE15-001/tempDir-001/testconfig/solrconfig.xml), InputStream(/Users/jenkins/workspace/Solr-main-MacOSX/solr/core/build/tmp/tests-tmp/solr.core.TestFileSystemConfigSetService_9715A2A5212DDE15-001/tempDir-001/testconfig/schema.xml)]
	at __randomizedtesting.SeedInfo.seed([9715A2A5212DDE15]:0)
	at org.apache.lucene.tests.mockfile.LeakFS.onClose(LeakFS.java:63)
	at org.apache.lucene.tests.mockfile.FilterFileSystem.close(FilterFileSystem.java:69)
	at org.apache.lucene.tests.mockfile.FilterFileSystem.close(FilterFileSystem.java:70)
	at org.apache.lucene.tests.util.TestRuleTemporaryFilesCleanup.afterAlways(TestRuleTemporaryFilesCleanup.java:223)
	at com.carrotsearch.randomizedtesting.rules.TestRuleAdapter$1.afterAlways(TestRuleAdapter.java:31)
	at com.carrotsearch.randomizedtesting.rules.StatementAdapter.evaluate(StatementAdapter.java:43)
	at com.carrotsearch.randomizedtesting.rules.StatementAdapter.evaluate(StatementAdapter.java:36)
	at org.apache.lucene.tests.util.TestRuleAssertionsRequired$1.evaluate(TestRuleAssertionsRequired.java:53)
	at org.apache.lucene.tests.util.AbstractBeforeAfterRule$1.evaluate(AbstractBeforeAfterRule.java:43)
	at org.apache.lucene.tests.util.TestRuleMarkFailure$1.evaluate(TestRuleMarkFailure.java:44)
	at org.apache.lucene.tests.util.TestRuleIgnoreAfterMaxFailures$1.evaluate(TestRuleIgnoreAfterMaxFailures.java:60)
	at org.apache.lucene.tests.util.TestRuleIgnoreTestSuites$1.evaluate(TestRuleIgnoreTestSuites.java:47)
	at org.junit.rules.RunRules.evaluate(RunRules.java:20)
	at com.carrotsearch.randomizedtesting.rules.StatementAdapter.evaluate(StatementAdapter.java:36)
	at com.carrotsearch.randomizedtesting.ThreadLeakControl$StatementRunner.run(ThreadLeakControl.java:390)
	at com.carrotsearch.randomizedtesting.ThreadLeakControl.lambda$forkTimeoutingTask$0(ThreadLeakControl.java:850)
	at java.base/java.lang.Thread.run(Thread.java:1589)
Caused by: java.lang.Exception
	at org.apache.lucene.tests.mockfile.LeakFS.onOpen(LeakFS.java:46)
	at org.apache.lucene.tests.mockfile.HandleTrackingFS.callOpenHook(HandleTrackingFS.java:82)
	at org.apache.lucene.tests.mockfile.HandleTrackingFS.newInputStream(HandleTrackingFS.java:125)
	at org.apache.lucene.tests.mockfile.FilterFileSystemProvider.newInputStream(FilterFileSystemProvider.java:193)
	at org.apache.lucene.tests.mockfile.HandleTrackingFS.newInputStream(HandleTrackingFS.java:94)
	at java.base/java.nio.file.Files.newInputStream(Files.java:160)
	at org.apache.solr.core.FileSystemConfigSetService$2.visitFile(FileSystemConfigSetService.java:217)
	at org.apache.solr.core.FileSystemConfigSetService$2.visitFile(FileSystemConfigSetService.java:201)
	at java.base/java.nio.file.Files.walkFileTree(Files.java:2810)
	at java.base/java.nio.file.Files.walkFileTree(Files.java:2881)
	at org.apache.solr.core.FileSystemConfigSetService.copyRecursively(FileSystemConfigSetService.java:199)
	at org.apache.solr.core.FileSystemConfigSetService.copyConfig(FileSystemConfigSetService.java:114)
	at org.apache.solr.core.TestFileSystemConfigSetService.testUploadAndDeleteConfig(TestFileSystemConfigSetService.java:79)
	at java.base/jdk.internal.reflect.DirectMethodHandleAccessor.invoke(DirectMethodHandleAccessor.java:104)
	at java.base/java.lang.reflect.Method.invoke(Method.java:578)
	at com.carrotsearch.randomizedtesting.RandomizedRunner.invoke(RandomizedRunner.java:1758)
	at com.carrotsearch.randomizedtesting.RandomizedRunner$8.evaluate(RandomizedRunner.java:946)
	at com.carrotsearch.randomizedtesting.RandomizedRunner$9.evaluate(RandomizedRunner.java:982)
	at com.carrotsearch.randomizedtesting.RandomizedRunner$10.evaluate(RandomizedRunner.java:996)
	at com.carrotsearch.randomizedtesting.rules.SystemPropertiesRestoreRule$1.evaluate(SystemPropertiesRestoreRule.java:80)
	at org.junit.rules.RunRules.evaluate(RunRules.java:20)
	at org.apache.lucene.tests.util.TestRuleSetupTeardownChained$1.evaluate(TestRuleSetupTeardownChained.java:48)
	at org.apache.lucene.tests.util.AbstractBeforeAfterRule$1.evaluate(AbstractBeforeAfterRule.java:43)
	at org.apache.lucene.tests.util.TestRuleThreadAndTestName$1.evaluate(TestRuleThreadAndTestName.java:45)
	at org.apache.lucene.tests.util.TestRuleIgnoreAfterMaxFailures$1.evaluate(TestRuleIgnoreAfterMaxFailures.java:60)
	at org.apache.lucene.tests.util.TestRuleMarkFailure$1.evaluate(TestRuleMarkFailure.java:44)
	at org.junit.rules.RunRules.evaluate(RunRules.java:20)
	at com.carrotsearch.randomizedtesting.rules.StatementAdapter.evaluate(StatementAdapter.java:36)
	at com.carrotsearch.randomizedtesting.ThreadLeakControl$StatementRunner.run(ThreadLeakControl.java:390)
	at com.carrotsearch.randomizedtesting.ThreadLeakControl.forkTimeoutingTask(ThreadLeakControl.java:843)
	at com.carrotsearch.randomizedtesting.ThreadLeakControl$3.evaluate(ThreadLeakControl.java:490)
	at com.carrotsearch.randomizedtesting.RandomizedRunner.runSingleTest(RandomizedRunner.java:955)
	at com.carrotsearch.randomizedtesting.RandomizedRunner$5.evaluate(RandomizedRunner.java:840)
	at com.carrotsearch.randomizedtesting.RandomizedRunner$6.evaluate(RandomizedRunner.java:891)
	at com.carrotsearch.randomizedtesting.RandomizedRunner$7.evaluate(RandomizedRunner.java:902)
	at com.carrotsearch.randomizedtesting.rules.StatementAdapter.evaluate(StatementAdapter.java:36)
	at com.carrotsearch.randomizedtesting.rules.StatementAdapter.evaluate(StatementAdapter.java:36)
	at org.apache.lucene.tests.util.AbstractBeforeAfterRule$1.evaluate(AbstractBeforeAfterRule.java:43)
	at com.carrotsearch.randomizedtesting.rules.SystemPropertiesRestoreRule$1.evaluate(SystemPropertiesRestoreRule.java:80)
	at org.junit.rules.RunRules.evaluate(RunRules.java:20)
	at org.apache.lucene.tests.util.AbstractBeforeAfterRule$1.evaluate(AbstractBeforeAfterRule.java:43)
	at com.carrotsearch.randomizedtesting.rules.StatementAdapter.evaluate(StatementAdapter.java:36)
	at org.apache.lucene.tests.util.TestRuleStoreClassName$1.evaluate(TestRuleStoreClassName.java:38)
	at com.carrotsearch.randomizedtesting.rules.NoShadowingOrOverridesOnMethodsRule$1.evaluate(NoShadowingOrOverridesOnMethodsRule.java:40)
	at com.carrotsearch.randomizedtesting.rules.NoShadowingOrOverridesOnMethodsRule$1.evaluate(NoShadowingOrOverridesOnMethodsRule.java:40)
	at com.carrotsearch.randomizedtesting.rules.StatementAdapter.evaluate(StatementAdapter.java:36)
	... 11 more


FAILED:  org.apache.solr.core.TestConfigSetService.classMethod

Error Message:
java.lang.RuntimeException: file handle leaks: [InputStream(/Users/jenkins/workspace/Solr-main-MacOSX/solr/core/build/tmp/tests-tmp/solr.core.TestConfigSetService_9715A2A5212DDE15-001/configsets-001/testconfig/solrconfig.xml), InputStream(/Users/jenkins/workspace/Solr-main-MacOSX/solr/core/build/tmp/tests-tmp/solr.core.TestConfigSetService_9715A2A5212DDE15-001/testconfig-001/subdir/file3), InputStream(/Users/jenkins/workspace/Solr-main-MacOSX/solr/core/build/tmp/tests-tmp/solr.core.TestConfigSetService_9715A2A5212DDE15-001/configsets-001/testconfig/subdir/file4), InputStream(/Users/jenkins/workspace/Solr-main-MacOSX/solr/core/build/tmp/tests-tmp/solr.core.TestConfigSetService_9715A2A5212DDE15-001/configsets-001/testconfig/.metadata.json), InputStream(/Users/jenkins/workspace/Solr-main-MacOSX/solr/core/build/tmp/tests-tmp/solr.core.TestConfigSetService_9715A2A5212DDE15-001/configsets-001/testconfig/subdir/file3), InputStream(/Users/jenkins/workspace/Solr-main-MacOSX/solr/core/build/tmp/tests-tmp/solr.core.TestConfigSetService_9715A2A5212DDE15-001/configsets-001/testconfig/file1), InputStream(/Users/jenkins/workspace/Solr-main-MacOSX/solr/core/build/tmp/tests-tmp/solr.core.TestConfigSetService_9715A2A5212DDE15-001/testconfig-001/file2), InputStream(/Users/jenkins/workspace/Solr-main-MacOSX/solr/core/build/tmp/tests-tmp/solr.core.TestConfigSetService_9715A2A5212DDE15-001/configsets-001/testconfig/file2), InputStream(/Users/jenkins/workspace/Solr-main-MacOSX/solr/core/build/tmp/tests-tmp/solr.core.TestConfigSetService_9715A2A5212DDE15-001/testconfig-001/file1), InputStream(/Users/jenkins/workspace/Solr-main-MacOSX/solr/core/build/tmp/tests-tmp/solr.core.TestConfigSetService_9715A2A5212DDE15-001/testconfig-001/solrconfig.xml)]

Stack Trace:
java.lang.RuntimeException: file handle leaks: [InputStream(/Users/jenkins/workspace/Solr-main-MacOSX/solr/core/build/tmp/tests-tmp/solr.core.TestConfigSetService_9715A2A5212DDE15-001/configsets-001/testconfig/solrconfig.xml), InputStream(/Users/jenkins/workspace/Solr-main-MacOSX/solr/core/build/tmp/tests-tmp/solr.core.TestConfigSetService_9715A2A5212DDE15-001/testconfig-001/subdir/file3), InputStream(/Users/jenkins/workspace/Solr-main-MacOSX/solr/core/build/tmp/tests-tmp/solr.core.TestConfigSetService_9715A2A5212DDE15-001/configsets-001/testconfig/subdir/file4), InputStream(/Users/jenkins/workspace/Solr-main-MacOSX/solr/core/build/tmp/tests-tmp/solr.core.TestConfigSetService_9715A2A5212DDE15-001/configsets-001/testconfig/.metadata.json), InputStream(/Users/jenkins/workspace/Solr-main-MacOSX/solr/core/build/tmp/tests-tmp/solr.core.TestConfigSetService_9715A2A5212DDE15-001/configsets-001/testconfig/subdir/file3), InputStream(/Users/jenkins/workspace/Solr-main-MacOSX/solr/core/build/tmp/tests-tmp/solr.core.TestConfigSetService_9715A2A5212DDE15-001/configsets-001/testconfig/file1), InputStream(/Users/jenkins/workspace/Solr-main-MacOSX/solr/core/build/tmp/tests-tmp/solr.core.TestConfigSetService_9715A2A5212DDE15-001/testconfig-001/file2), InputStream(/Users/jenkins/workspace/Solr-main-MacOSX/solr/core/build/tmp/tests-tmp/solr.core.TestConfigSetService_9715A2A5212DDE15-001/configsets-001/testconfig/file2), InputStream(/Users/jenkins/workspace/Solr-main-MacOSX/solr/core/build/tmp/tests-tmp/solr.core.TestConfigSetService_9715A2A5212DDE15-001/testconfig-001/file1), InputStream(/Users/jenkins/workspace/Solr-main-MacOSX/solr/core/build/tmp/tests-tmp/solr.core.TestConfigSetService_9715A2A5212DDE15-001/testconfig-001/solrconfig.xml)]
	at __randomizedtesting.SeedInfo.seed([9715A2A5212DDE15]:0)
	at org.apache.lucene.tests.mockfile.LeakFS.onClose(LeakFS.java:63)
	at org.apache.lucene.tests.mockfile.FilterFileSystem.close(FilterFileSystem.java:69)
	at org.apache.lucene.tests.mockfile.FilterFileSystem.close(FilterFileSystem.java:70)
	at org.apache.lucene.tests.util.TestRuleTemporaryFilesCleanup.afterAlways(TestRuleTemporaryFilesCleanup.java:223)
	at com.carrotsearch.randomizedtesting.rules.TestRuleAdapter$1.afterAlways(TestRuleAdapter.java:31)
	at com.carrotsearch.randomizedtesting.rules.StatementAdapter.evaluate(StatementAdapter.java:43)
	at com.carrotsearch.randomizedtesting.rules.StatementAdapter.evaluate(StatementAdapter.java:36)
	at org.apache.lucene.tests.util.TestRuleAssertionsRequired$1.evaluate(TestRuleAssertionsRequired.java:53)
	at org.apache.lucene.tests.util.AbstractBeforeAfterRule$1.evaluate(AbstractBeforeAfterRule.java:43)
	at org.apache.lucene.tests.util.TestRuleMarkFailure$1.evaluate(TestRuleMarkFailure.java:44)
	at org.apache.lucene.tests.util.TestRuleIgnoreAfterMaxFailures$1.evaluate(TestRuleIgnoreAfterMaxFailures.java:60)
	at org.apache.lucene.tests.util.TestRuleIgnoreTestSuites$1.evaluate(TestRuleIgnoreTestSuites.java:47)
	at org.junit.rules.RunRules.evaluate(RunRules.java:20)
	at com.carrotsearch.randomizedtesting.rules.StatementAdapter.evaluate(StatementAdapter.java:36)
	at com.carrotsearch.randomizedtesting.ThreadLeakControl$StatementRunner.run(ThreadLeakControl.java:390)
	at com.carrotsearch.randomizedtesting.ThreadLeakControl.lambda$forkTimeoutingTask$0(ThreadLeakControl.java:850)
	at java.base/java.lang.Thread.run(Thread.java:1589)
Caused by: java.lang.Exception
	at org.apache.lucene.tests.mockfile.LeakFS.onOpen(LeakFS.java:46)
	at org.apache.lucene.tests.mockfile.HandleTrackingFS.callOpenHook(HandleTrackingFS.java:82)
	at org.apache.lucene.tests.mockfile.HandleTrackingFS.newInputStream(HandleTrackingFS.java:125)
	at org.apache.lucene.tests.mockfile.FilterFileSystemProvider.newInputStream(FilterFileSystemProvider.java:193)
	at org.apache.lucene.tests.mockfile.HandleTrackingFS.newInputStream(HandleTrackingFS.java:94)
	at java.base/java.nio.file.Files.newInputStream(Files.java:160)
	at org.apache.solr.core.FileSystemConfigSetService$2.visitFile(FileSystemConfigSetService.java:217)
	at org.apache.solr.core.FileSystemConfigSetService$2.visitFile(FileSystemConfigSetService.java:201)
	at java.base/java.nio.file.Files.walkFileTree(Files.java:2810)
	at java.base/java.nio.file.Files.walkFileTree(Files.java:2881)
	at org.apache.solr.core.FileSystemConfigSetService.copyRecursively(FileSystemConfigSetService.java:199)
	at org.apache.solr.core.FileSystemConfigSetService.copyConfig(FileSystemConfigSetService.java:114)
	at org.apache.solr.core.TestConfigSetService.testConfigSetServiceOperations(TestConfigSetService.java:113)
	at java.base/jdk.internal.reflect.DirectMethodHandleAccessor.invoke(DirectMethodHandleAccessor.java:104)
	at java.base/java.lang.reflect.Method.invoke(Method.java:578)
	at com.carrotsearch.randomizedtesting.RandomizedRunner.invoke(RandomizedRunner.java:1758)
	at com.carrotsearch.randomizedtesting.RandomizedRunner$8.evaluate(RandomizedRunner.java:946)
	at com.carrotsearch.randomizedtesting.RandomizedRunner$9.evaluate(RandomizedRunner.java:982)
	at com.carrotsearch.randomizedtesting.RandomizedRunner$10.evaluate(RandomizedRunner.java:996)
	at com.carrotsearch.randomizedtesting.rules.SystemPropertiesRestoreRule$1.evaluate(SystemPropertiesRestoreRule.java:80)
	at org.junit.rules.RunRules.evaluate(RunRules.java:20)
	at org.apache.lucene.tests.util.TestRuleSetupTeardownChained$1.evaluate(TestRuleSetupTeardownChained.java:48)
	at org.apache.lucene.tests.util.AbstractBeforeAfterRule$1.evaluate(AbstractBeforeAfterRule.java:43)
	at org.apache.lucene.tests.util.TestRuleThreadAndTestName$1.evaluate(TestRuleThreadAndTestName.java:45)
	at org.apache.lucene.tests.util.TestRuleIgnoreAfterMaxFailures$1.evaluate(TestRuleIgnoreAfterMaxFailures.java:60)
	at org.apache.lucene.tests.util.TestRuleMarkFailure$1.evaluate(TestRuleMarkFailure.java:44)
	at org.junit.rules.RunRules.evaluate(RunRules.java:20)
	at com.carrotsearch.randomizedtesting.rules.StatementAdapter.evaluate(StatementAdapter.java:36)
	at com.carrotsearch.randomizedtesting.ThreadLeakControl$StatementRunner.run(ThreadLeakControl.java:390)
	at com.carrotsearch.randomizedtesting.ThreadLeakControl.forkTimeoutingTask(ThreadLeakControl.java:843)
	at com.carrotsearch.randomizedtesting.ThreadLeakControl$3.evaluate(ThreadLeakControl.java:490)
	at com.carrotsearch.randomizedtesting.RandomizedRunner.runSingleTest(RandomizedRunner.java:955)
	at com.carrotsearch.randomizedtesting.RandomizedRunner$5.evaluate(RandomizedRunner.java:840)
	at com.carrotsearch.randomizedtesting.RandomizedRunner$6.evaluate(RandomizedRunner.java:891)
	at com.carrotsearch.randomizedtesting.RandomizedRunner$7.evaluate(RandomizedRunner.java:902)
	at com.carrotsearch.randomizedtesting.rules.StatementAdapter.evaluate(StatementAdapter.java:36)
	at com.carrotsearch.randomizedtesting.rules.StatementAdapter.evaluate(StatementAdapter.java:36)
	at org.apache.lucene.tests.util.AbstractBeforeAfterRule$1.evaluate(AbstractBeforeAfterRule.java:43)
	at com.carrotsearch.randomizedtesting.rules.SystemPropertiesRestoreRule$1.evaluate(SystemPropertiesRestoreRule.java:80)
	at org.junit.rules.RunRules.evaluate(RunRules.java:20)
	at org.apache.lucene.tests.util.AbstractBeforeAfterRule$1.evaluate(AbstractBeforeAfterRule.java:43)
	at com.carrotsearch.randomizedtesting.rules.StatementAdapter.evaluate(StatementAdapter.java:36)
	at org.apache.lucene.tests.util.TestRuleStoreClassName$1.evaluate(TestRuleStoreClassName.java:38)
	at com.carrotsearch.randomizedtesting.rules.NoShadowingOrOverridesOnMethodsRule$1.evaluate(NoShadowingOrOverridesOnMethodsRule.java:40)
	at com.carrotsearch.randomizedtesting.rules.NoShadowingOrOverridesOnMethodsRule$1.evaluate(NoShadowingOrOverridesOnMethodsRule.java:40)
	at com.carrotsearch.randomizedtesting.rules.StatementAdapter.evaluate(StatementAdapter.java:36)
	... 11 more

[JENKINS] Solr-main-MacOSX (64bit/hotspot/jdk-20) - Build # 3706 - Failure!

Posted by Policeman Jenkins Server <je...@thetaphi.de>.
Build: https://jenkins.thetaphi.de/job/Solr-main-MacOSX/3706/
Java: 64bit/hotspot/jdk-20 -XX:+UseCompressedOops -XX:+UseSerialGC

No tests ran.

[JENKINS] Solr-main-MacOSX (64bit/hotspot/jdk-17.0.9) - Build # 3705 - Still Unstable!

Posted by Policeman Jenkins Server <je...@thetaphi.de>.
Build: https://jenkins.thetaphi.de/job/Solr-main-MacOSX/3705/
Java: 64bit/hotspot/jdk-17.0.9 -XX:-UseCompressedOops -XX:+UseSerialGC

1 tests failed.
FAILED:  org.apache.solr.core.TestConfigSetService.classMethod

Error Message:
java.lang.RuntimeException: file handle leaks: [InputStream(/Users/jenkins/workspace/Solr-main-MacOSX/solr/core/build/tmp/tests-tmp/solr.core.TestConfigSetService_6FBA609B06FED26E-001/configsets-001/testconfig/file2), InputStream(/Users/jenkins/workspace/Solr-main-MacOSX/solr/core/build/tmp/tests-tmp/solr.core.TestConfigSetService_6FBA609B06FED26E-001/configsets-001/testconfig/.metadata.json), InputStream(/Users/jenkins/workspace/Solr-main-MacOSX/solr/core/build/tmp/tests-tmp/solr.core.TestConfigSetService_6FBA609B06FED26E-001/configsets-001/testconfig/file1), InputStream(/Users/jenkins/workspace/Solr-main-MacOSX/solr/core/build/tmp/tests-tmp/solr.core.TestConfigSetService_6FBA609B06FED26E-001/configsets-001/testconfig/solrconfig.xml), InputStream(/Users/jenkins/workspace/Solr-main-MacOSX/solr/core/build/tmp/tests-tmp/solr.core.TestConfigSetService_6FBA609B06FED26E-001/configsets-001/testconfig/subdir/file4), InputStream(/Users/jenkins/workspace/Solr-main-MacOSX/solr/core/build/tmp/tests-tmp/solr.core.TestConfigSetService_6FBA609B06FED26E-001/testconfig-002/file1), InputStream(/Users/jenkins/workspace/Solr-main-MacOSX/solr/core/build/tmp/tests-tmp/solr.core.TestConfigSetService_6FBA609B06FED26E-001/testconfig-002/subdir/file3), InputStream(/Users/jenkins/workspace/Solr-main-MacOSX/solr/core/build/tmp/tests-tmp/solr.core.TestConfigSetService_6FBA609B06FED26E-001/configsets-001/testconfig/subdir/file3), InputStream(/Users/jenkins/workspace/Solr-main-MacOSX/solr/core/build/tmp/tests-tmp/solr.core.TestConfigSetService_6FBA609B06FED26E-001/testconfig-002/file2), InputStream(/Users/jenkins/workspace/Solr-main-MacOSX/solr/core/build/tmp/tests-tmp/solr.core.TestConfigSetService_6FBA609B06FED26E-001/testconfig-002/solrconfig.xml)]

Stack Trace:
java.lang.RuntimeException: file handle leaks: [InputStream(/Users/jenkins/workspace/Solr-main-MacOSX/solr/core/build/tmp/tests-tmp/solr.core.TestConfigSetService_6FBA609B06FED26E-001/configsets-001/testconfig/file2), InputStream(/Users/jenkins/workspace/Solr-main-MacOSX/solr/core/build/tmp/tests-tmp/solr.core.TestConfigSetService_6FBA609B06FED26E-001/configsets-001/testconfig/.metadata.json), InputStream(/Users/jenkins/workspace/Solr-main-MacOSX/solr/core/build/tmp/tests-tmp/solr.core.TestConfigSetService_6FBA609B06FED26E-001/configsets-001/testconfig/file1), InputStream(/Users/jenkins/workspace/Solr-main-MacOSX/solr/core/build/tmp/tests-tmp/solr.core.TestConfigSetService_6FBA609B06FED26E-001/configsets-001/testconfig/solrconfig.xml), InputStream(/Users/jenkins/workspace/Solr-main-MacOSX/solr/core/build/tmp/tests-tmp/solr.core.TestConfigSetService_6FBA609B06FED26E-001/configsets-001/testconfig/subdir/file4), InputStream(/Users/jenkins/workspace/Solr-main-MacOSX/solr/core/build/tmp/tests-tmp/solr.core.TestConfigSetService_6FBA609B06FED26E-001/testconfig-002/file1), InputStream(/Users/jenkins/workspace/Solr-main-MacOSX/solr/core/build/tmp/tests-tmp/solr.core.TestConfigSetService_6FBA609B06FED26E-001/testconfig-002/subdir/file3), InputStream(/Users/jenkins/workspace/Solr-main-MacOSX/solr/core/build/tmp/tests-tmp/solr.core.TestConfigSetService_6FBA609B06FED26E-001/configsets-001/testconfig/subdir/file3), InputStream(/Users/jenkins/workspace/Solr-main-MacOSX/solr/core/build/tmp/tests-tmp/solr.core.TestConfigSetService_6FBA609B06FED26E-001/testconfig-002/file2), InputStream(/Users/jenkins/workspace/Solr-main-MacOSX/solr/core/build/tmp/tests-tmp/solr.core.TestConfigSetService_6FBA609B06FED26E-001/testconfig-002/solrconfig.xml)]
	at __randomizedtesting.SeedInfo.seed([6FBA609B06FED26E]:0)
	at org.apache.lucene.tests.mockfile.LeakFS.onClose(LeakFS.java:63)
	at org.apache.lucene.tests.mockfile.FilterFileSystem.close(FilterFileSystem.java:69)
	at org.apache.lucene.tests.mockfile.FilterFileSystem.close(FilterFileSystem.java:70)
	at org.apache.lucene.tests.util.TestRuleTemporaryFilesCleanup.afterAlways(TestRuleTemporaryFilesCleanup.java:223)
	at com.carrotsearch.randomizedtesting.rules.TestRuleAdapter$1.afterAlways(TestRuleAdapter.java:31)
	at com.carrotsearch.randomizedtesting.rules.StatementAdapter.evaluate(StatementAdapter.java:43)
	at com.carrotsearch.randomizedtesting.rules.StatementAdapter.evaluate(StatementAdapter.java:36)
	at org.apache.lucene.tests.util.TestRuleAssertionsRequired$1.evaluate(TestRuleAssertionsRequired.java:53)
	at org.apache.lucene.tests.util.AbstractBeforeAfterRule$1.evaluate(AbstractBeforeAfterRule.java:43)
	at org.apache.lucene.tests.util.TestRuleMarkFailure$1.evaluate(TestRuleMarkFailure.java:44)
	at org.apache.lucene.tests.util.TestRuleIgnoreAfterMaxFailures$1.evaluate(TestRuleIgnoreAfterMaxFailures.java:60)
	at org.apache.lucene.tests.util.TestRuleIgnoreTestSuites$1.evaluate(TestRuleIgnoreTestSuites.java:47)
	at org.junit.rules.RunRules.evaluate(RunRules.java:20)
	at com.carrotsearch.randomizedtesting.rules.StatementAdapter.evaluate(StatementAdapter.java:36)
	at com.carrotsearch.randomizedtesting.ThreadLeakControl$StatementRunner.run(ThreadLeakControl.java:390)
	at com.carrotsearch.randomizedtesting.ThreadLeakControl.lambda$forkTimeoutingTask$0(ThreadLeakControl.java:850)
	at java.base/java.lang.Thread.run(Thread.java:840)
Caused by: java.lang.Exception
	at org.apache.lucene.tests.mockfile.LeakFS.onOpen(LeakFS.java:46)
	at org.apache.lucene.tests.mockfile.HandleTrackingFS.callOpenHook(HandleTrackingFS.java:82)
	at org.apache.lucene.tests.mockfile.HandleTrackingFS.newInputStream(HandleTrackingFS.java:125)
	at org.apache.lucene.tests.mockfile.FilterFileSystemProvider.newInputStream(FilterFileSystemProvider.java:193)
	at org.apache.lucene.tests.mockfile.HandleTrackingFS.newInputStream(HandleTrackingFS.java:94)
	at java.base/java.nio.file.Files.newInputStream(Files.java:160)
	at org.apache.solr.core.FileSystemConfigSetService$2.visitFile(FileSystemConfigSetService.java:217)
	at org.apache.solr.core.FileSystemConfigSetService$2.visitFile(FileSystemConfigSetService.java:201)
	at java.base/java.nio.file.Files.walkFileTree(Files.java:2811)
	at java.base/java.nio.file.Files.walkFileTree(Files.java:2882)
	at org.apache.solr.core.FileSystemConfigSetService.copyRecursively(FileSystemConfigSetService.java:199)
	at org.apache.solr.core.FileSystemConfigSetService.copyConfig(FileSystemConfigSetService.java:114)
	at org.apache.solr.core.TestConfigSetService.testConfigSetServiceOperations(TestConfigSetService.java:113)
	at java.base/jdk.internal.reflect.NativeMethodAccessorImpl.invoke0(Native Method)
	at java.base/jdk.internal.reflect.NativeMethodAccessorImpl.invoke(NativeMethodAccessorImpl.java:77)
	at java.base/jdk.internal.reflect.DelegatingMethodAccessorImpl.invoke(DelegatingMethodAccessorImpl.java:43)
	at java.base/java.lang.reflect.Method.invoke(Method.java:568)
	at com.carrotsearch.randomizedtesting.RandomizedRunner.invoke(RandomizedRunner.java:1758)
	at com.carrotsearch.randomizedtesting.RandomizedRunner$8.evaluate(RandomizedRunner.java:946)
	at com.carrotsearch.randomizedtesting.RandomizedRunner$9.evaluate(RandomizedRunner.java:982)
	at com.carrotsearch.randomizedtesting.RandomizedRunner$10.evaluate(RandomizedRunner.java:996)
	at com.carrotsearch.randomizedtesting.rules.SystemPropertiesRestoreRule$1.evaluate(SystemPropertiesRestoreRule.java:80)
	at org.junit.rules.RunRules.evaluate(RunRules.java:20)
	at org.apache.lucene.tests.util.TestRuleSetupTeardownChained$1.evaluate(TestRuleSetupTeardownChained.java:48)
	at org.apache.lucene.tests.util.AbstractBeforeAfterRule$1.evaluate(AbstractBeforeAfterRule.java:43)
	at org.apache.lucene.tests.util.TestRuleThreadAndTestName$1.evaluate(TestRuleThreadAndTestName.java:45)
	at org.apache.lucene.tests.util.TestRuleIgnoreAfterMaxFailures$1.evaluate(TestRuleIgnoreAfterMaxFailures.java:60)
	at org.apache.lucene.tests.util.TestRuleMarkFailure$1.evaluate(TestRuleMarkFailure.java:44)
	at org.junit.rules.RunRules.evaluate(RunRules.java:20)
	at com.carrotsearch.randomizedtesting.rules.StatementAdapter.evaluate(StatementAdapter.java:36)
	at com.carrotsearch.randomizedtesting.ThreadLeakControl$StatementRunner.run(ThreadLeakControl.java:390)
	at com.carrotsearch.randomizedtesting.ThreadLeakControl.forkTimeoutingTask(ThreadLeakControl.java:843)
	at com.carrotsearch.randomizedtesting.ThreadLeakControl$3.evaluate(ThreadLeakControl.java:490)
	at com.carrotsearch.randomizedtesting.RandomizedRunner.runSingleTest(RandomizedRunner.java:955)
	at com.carrotsearch.randomizedtesting.RandomizedRunner$5.evaluate(RandomizedRunner.java:840)
	at com.carrotsearch.randomizedtesting.RandomizedRunner$6.evaluate(RandomizedRunner.java:891)
	at com.carrotsearch.randomizedtesting.RandomizedRunner$7.evaluate(RandomizedRunner.java:902)
	at com.carrotsearch.randomizedtesting.rules.StatementAdapter.evaluate(StatementAdapter.java:36)
	at com.carrotsearch.randomizedtesting.rules.StatementAdapter.evaluate(StatementAdapter.java:36)
	at org.apache.lucene.tests.util.AbstractBeforeAfterRule$1.evaluate(AbstractBeforeAfterRule.java:43)
	at com.carrotsearch.randomizedtesting.rules.SystemPropertiesRestoreRule$1.evaluate(SystemPropertiesRestoreRule.java:80)
	at org.junit.rules.RunRules.evaluate(RunRules.java:20)
	at org.apache.lucene.tests.util.AbstractBeforeAfterRule$1.evaluate(AbstractBeforeAfterRule.java:43)
	at com.carrotsearch.randomizedtesting.rules.StatementAdapter.evaluate(StatementAdapter.java:36)
	at org.apache.lucene.tests.util.TestRuleStoreClassName$1.evaluate(TestRuleStoreClassName.java:38)
	at com.carrotsearch.randomizedtesting.rules.NoShadowingOrOverridesOnMethodsRule$1.evaluate(NoShadowingOrOverridesOnMethodsRule.java:40)
	at com.carrotsearch.randomizedtesting.rules.NoShadowingOrOverridesOnMethodsRule$1.evaluate(NoShadowingOrOverridesOnMethodsRule.java:40)
	at com.carrotsearch.randomizedtesting.rules.StatementAdapter.evaluate(StatementAdapter.java:36)
	... 11 more

[JENKINS] Solr-main-MacOSX (64bit/hotspot/jdk-17.0.9) - Build # 3704 - Still Unstable!

Posted by Policeman Jenkins Server <je...@thetaphi.de>.
Build: https://jenkins.thetaphi.de/job/Solr-main-MacOSX/3704/
Java: 64bit/hotspot/jdk-17.0.9 -XX:-UseCompressedOops -XX:+UseParallelGC

2 tests failed.
FAILED:  org.apache.solr.core.TestConfigSetService.classMethod

Error Message:
java.lang.RuntimeException: file handle leaks: [InputStream(/Users/jenkins/workspace/Solr-main-MacOSX/solr/core/build/tmp/tests-tmp/solr.core.TestConfigSetService_433C4D26BCA96DD5-001/testconfig-001/subdir/file3), InputStream(/Users/jenkins/workspace/Solr-main-MacOSX/solr/core/build/tmp/tests-tmp/solr.core.TestConfigSetService_433C4D26BCA96DD5-001/configsets-001/testconfig/solrconfig.xml), InputStream(/Users/jenkins/workspace/Solr-main-MacOSX/solr/core/build/tmp/tests-tmp/solr.core.TestConfigSetService_433C4D26BCA96DD5-001/testconfig-001/solrconfig.xml), InputStream(/Users/jenkins/workspace/Solr-main-MacOSX/solr/core/build/tmp/tests-tmp/solr.core.TestConfigSetService_433C4D26BCA96DD5-001/configsets-001/testconfig/.metadata.json), InputStream(/Users/jenkins/workspace/Solr-main-MacOSX/solr/core/build/tmp/tests-tmp/solr.core.TestConfigSetService_433C4D26BCA96DD5-001/testconfig-001/file2), InputStream(/Users/jenkins/workspace/Solr-main-MacOSX/solr/core/build/tmp/tests-tmp/solr.core.TestConfigSetService_433C4D26BCA96DD5-001/configsets-001/testconfig/subdir/file4), InputStream(/Users/jenkins/workspace/Solr-main-MacOSX/solr/core/build/tmp/tests-tmp/solr.core.TestConfigSetService_433C4D26BCA96DD5-001/configsets-001/testconfig/file1), InputStream(/Users/jenkins/workspace/Solr-main-MacOSX/solr/core/build/tmp/tests-tmp/solr.core.TestConfigSetService_433C4D26BCA96DD5-001/configsets-001/testconfig/subdir/file3), InputStream(/Users/jenkins/workspace/Solr-main-MacOSX/solr/core/build/tmp/tests-tmp/solr.core.TestConfigSetService_433C4D26BCA96DD5-001/configsets-001/testconfig/file2), InputStream(/Users/jenkins/workspace/Solr-main-MacOSX/solr/core/build/tmp/tests-tmp/solr.core.TestConfigSetService_433C4D26BCA96DD5-001/testconfig-001/file1)]

Stack Trace:
java.lang.RuntimeException: file handle leaks: [InputStream(/Users/jenkins/workspace/Solr-main-MacOSX/solr/core/build/tmp/tests-tmp/solr.core.TestConfigSetService_433C4D26BCA96DD5-001/testconfig-001/subdir/file3), InputStream(/Users/jenkins/workspace/Solr-main-MacOSX/solr/core/build/tmp/tests-tmp/solr.core.TestConfigSetService_433C4D26BCA96DD5-001/configsets-001/testconfig/solrconfig.xml), InputStream(/Users/jenkins/workspace/Solr-main-MacOSX/solr/core/build/tmp/tests-tmp/solr.core.TestConfigSetService_433C4D26BCA96DD5-001/testconfig-001/solrconfig.xml), InputStream(/Users/jenkins/workspace/Solr-main-MacOSX/solr/core/build/tmp/tests-tmp/solr.core.TestConfigSetService_433C4D26BCA96DD5-001/configsets-001/testconfig/.metadata.json), InputStream(/Users/jenkins/workspace/Solr-main-MacOSX/solr/core/build/tmp/tests-tmp/solr.core.TestConfigSetService_433C4D26BCA96DD5-001/testconfig-001/file2), InputStream(/Users/jenkins/workspace/Solr-main-MacOSX/solr/core/build/tmp/tests-tmp/solr.core.TestConfigSetService_433C4D26BCA96DD5-001/configsets-001/testconfig/subdir/file4), InputStream(/Users/jenkins/workspace/Solr-main-MacOSX/solr/core/build/tmp/tests-tmp/solr.core.TestConfigSetService_433C4D26BCA96DD5-001/configsets-001/testconfig/file1), InputStream(/Users/jenkins/workspace/Solr-main-MacOSX/solr/core/build/tmp/tests-tmp/solr.core.TestConfigSetService_433C4D26BCA96DD5-001/configsets-001/testconfig/subdir/file3), InputStream(/Users/jenkins/workspace/Solr-main-MacOSX/solr/core/build/tmp/tests-tmp/solr.core.TestConfigSetService_433C4D26BCA96DD5-001/configsets-001/testconfig/file2), InputStream(/Users/jenkins/workspace/Solr-main-MacOSX/solr/core/build/tmp/tests-tmp/solr.core.TestConfigSetService_433C4D26BCA96DD5-001/testconfig-001/file1)]
	at __randomizedtesting.SeedInfo.seed([433C4D26BCA96DD5]:0)
	at org.apache.lucene.tests.mockfile.LeakFS.onClose(LeakFS.java:63)
	at org.apache.lucene.tests.mockfile.FilterFileSystem.close(FilterFileSystem.java:69)
	at org.apache.lucene.tests.mockfile.FilterFileSystem.close(FilterFileSystem.java:70)
	at org.apache.lucene.tests.util.TestRuleTemporaryFilesCleanup.afterAlways(TestRuleTemporaryFilesCleanup.java:223)
	at com.carrotsearch.randomizedtesting.rules.TestRuleAdapter$1.afterAlways(TestRuleAdapter.java:31)
	at com.carrotsearch.randomizedtesting.rules.StatementAdapter.evaluate(StatementAdapter.java:43)
	at com.carrotsearch.randomizedtesting.rules.StatementAdapter.evaluate(StatementAdapter.java:36)
	at org.apache.lucene.tests.util.TestRuleAssertionsRequired$1.evaluate(TestRuleAssertionsRequired.java:53)
	at org.apache.lucene.tests.util.AbstractBeforeAfterRule$1.evaluate(AbstractBeforeAfterRule.java:43)
	at org.apache.lucene.tests.util.TestRuleMarkFailure$1.evaluate(TestRuleMarkFailure.java:44)
	at org.apache.lucene.tests.util.TestRuleIgnoreAfterMaxFailures$1.evaluate(TestRuleIgnoreAfterMaxFailures.java:60)
	at org.apache.lucene.tests.util.TestRuleIgnoreTestSuites$1.evaluate(TestRuleIgnoreTestSuites.java:47)
	at org.junit.rules.RunRules.evaluate(RunRules.java:20)
	at com.carrotsearch.randomizedtesting.rules.StatementAdapter.evaluate(StatementAdapter.java:36)
	at com.carrotsearch.randomizedtesting.ThreadLeakControl$StatementRunner.run(ThreadLeakControl.java:390)
	at com.carrotsearch.randomizedtesting.ThreadLeakControl.lambda$forkTimeoutingTask$0(ThreadLeakControl.java:850)
	at java.base/java.lang.Thread.run(Thread.java:840)
Caused by: java.lang.Exception
	at org.apache.lucene.tests.mockfile.LeakFS.onOpen(LeakFS.java:46)
	at org.apache.lucene.tests.mockfile.HandleTrackingFS.callOpenHook(HandleTrackingFS.java:82)
	at org.apache.lucene.tests.mockfile.HandleTrackingFS.newInputStream(HandleTrackingFS.java:125)
	at org.apache.lucene.tests.mockfile.FilterFileSystemProvider.newInputStream(FilterFileSystemProvider.java:193)
	at org.apache.lucene.tests.mockfile.HandleTrackingFS.newInputStream(HandleTrackingFS.java:94)
	at java.base/java.nio.file.Files.newInputStream(Files.java:160)
	at org.apache.solr.core.FileSystemConfigSetService$2.visitFile(FileSystemConfigSetService.java:217)
	at org.apache.solr.core.FileSystemConfigSetService$2.visitFile(FileSystemConfigSetService.java:201)
	at java.base/java.nio.file.Files.walkFileTree(Files.java:2811)
	at java.base/java.nio.file.Files.walkFileTree(Files.java:2882)
	at org.apache.solr.core.FileSystemConfigSetService.copyRecursively(FileSystemConfigSetService.java:199)
	at org.apache.solr.core.FileSystemConfigSetService.uploadConfig(FileSystemConfigSetService.java:144)
	at org.apache.solr.core.TestConfigSetService.testConfigSetServiceOperations(TestConfigSetService.java:81)
	at java.base/jdk.internal.reflect.NativeMethodAccessorImpl.invoke0(Native Method)
	at java.base/jdk.internal.reflect.NativeMethodAccessorImpl.invoke(NativeMethodAccessorImpl.java:77)
	at java.base/jdk.internal.reflect.DelegatingMethodAccessorImpl.invoke(DelegatingMethodAccessorImpl.java:43)
	at java.base/java.lang.reflect.Method.invoke(Method.java:568)
	at com.carrotsearch.randomizedtesting.RandomizedRunner.invoke(RandomizedRunner.java:1758)
	at com.carrotsearch.randomizedtesting.RandomizedRunner$8.evaluate(RandomizedRunner.java:946)
	at com.carrotsearch.randomizedtesting.RandomizedRunner$9.evaluate(RandomizedRunner.java:982)
	at com.carrotsearch.randomizedtesting.RandomizedRunner$10.evaluate(RandomizedRunner.java:996)
	at com.carrotsearch.randomizedtesting.rules.SystemPropertiesRestoreRule$1.evaluate(SystemPropertiesRestoreRule.java:80)
	at org.junit.rules.RunRules.evaluate(RunRules.java:20)
	at org.apache.lucene.tests.util.TestRuleSetupTeardownChained$1.evaluate(TestRuleSetupTeardownChained.java:48)
	at org.apache.lucene.tests.util.AbstractBeforeAfterRule$1.evaluate(AbstractBeforeAfterRule.java:43)
	at org.apache.lucene.tests.util.TestRuleThreadAndTestName$1.evaluate(TestRuleThreadAndTestName.java:45)
	at org.apache.lucene.tests.util.TestRuleIgnoreAfterMaxFailures$1.evaluate(TestRuleIgnoreAfterMaxFailures.java:60)
	at org.apache.lucene.tests.util.TestRuleMarkFailure$1.evaluate(TestRuleMarkFailure.java:44)
	at org.junit.rules.RunRules.evaluate(RunRules.java:20)
	at com.carrotsearch.randomizedtesting.rules.StatementAdapter.evaluate(StatementAdapter.java:36)
	at com.carrotsearch.randomizedtesting.ThreadLeakControl$StatementRunner.run(ThreadLeakControl.java:390)
	at com.carrotsearch.randomizedtesting.ThreadLeakControl.forkTimeoutingTask(ThreadLeakControl.java:843)
	at com.carrotsearch.randomizedtesting.ThreadLeakControl$3.evaluate(ThreadLeakControl.java:490)
	at com.carrotsearch.randomizedtesting.RandomizedRunner.runSingleTest(RandomizedRunner.java:955)
	at com.carrotsearch.randomizedtesting.RandomizedRunner$5.evaluate(RandomizedRunner.java:840)
	at com.carrotsearch.randomizedtesting.RandomizedRunner$6.evaluate(RandomizedRunner.java:891)
	at com.carrotsearch.randomizedtesting.RandomizedRunner$7.evaluate(RandomizedRunner.java:902)
	at com.carrotsearch.randomizedtesting.rules.StatementAdapter.evaluate(StatementAdapter.java:36)
	at com.carrotsearch.randomizedtesting.rules.StatementAdapter.evaluate(StatementAdapter.java:36)
	at org.apache.lucene.tests.util.AbstractBeforeAfterRule$1.evaluate(AbstractBeforeAfterRule.java:43)
	at com.carrotsearch.randomizedtesting.rules.SystemPropertiesRestoreRule$1.evaluate(SystemPropertiesRestoreRule.java:80)
	at org.junit.rules.RunRules.evaluate(RunRules.java:20)
	at org.apache.lucene.tests.util.AbstractBeforeAfterRule$1.evaluate(AbstractBeforeAfterRule.java:43)
	at com.carrotsearch.randomizedtesting.rules.StatementAdapter.evaluate(StatementAdapter.java:36)
	at org.apache.lucene.tests.util.TestRuleStoreClassName$1.evaluate(TestRuleStoreClassName.java:38)
	at com.carrotsearch.randomizedtesting.rules.NoShadowingOrOverridesOnMethodsRule$1.evaluate(NoShadowingOrOverridesOnMethodsRule.java:40)
	at com.carrotsearch.randomizedtesting.rules.NoShadowingOrOverridesOnMethodsRule$1.evaluate(NoShadowingOrOverridesOnMethodsRule.java:40)
	at com.carrotsearch.randomizedtesting.rules.StatementAdapter.evaluate(StatementAdapter.java:36)
	... 11 more


FAILED:  org.apache.solr.core.TestFileSystemConfigSetService.classMethod

Error Message:
java.lang.RuntimeException: file handle leaks: [InputStream(/Users/jenkins/workspace/Solr-main-MacOSX/solr/core/build/tmp/tests-tmp/solr.core.TestFileSystemConfigSetService_433C4D26BCA96DD5-001/tempDir-001/testconfig/solrconfig.xml), InputStream(/Users/jenkins/workspace/Solr-main-MacOSX/solr/core/build/tmp/tests-tmp/solr.core.TestFileSystemConfigSetService_433C4D26BCA96DD5-001/tempDir-001/testconfig/schema.xml), InputStream(/Users/jenkins/workspace/Solr-main-MacOSX/solr/core/build/tmp/tests-tmp/solr.core.TestFileSystemConfigSetService_433C4D26BCA96DD5-001/tempDir-001/testconfig/solrconfig.xml), InputStream(/Users/jenkins/workspace/Solr-main-MacOSX/solr/core/build/tmp/tests-tmp/solr.core.TestFileSystemConfigSetService_433C4D26BCA96DD5-001/tempDir-001/testconfig/schema.xml)]

Stack Trace:
java.lang.RuntimeException: file handle leaks: [InputStream(/Users/jenkins/workspace/Solr-main-MacOSX/solr/core/build/tmp/tests-tmp/solr.core.TestFileSystemConfigSetService_433C4D26BCA96DD5-001/tempDir-001/testconfig/solrconfig.xml), InputStream(/Users/jenkins/workspace/Solr-main-MacOSX/solr/core/build/tmp/tests-tmp/solr.core.TestFileSystemConfigSetService_433C4D26BCA96DD5-001/tempDir-001/testconfig/schema.xml), InputStream(/Users/jenkins/workspace/Solr-main-MacOSX/solr/core/build/tmp/tests-tmp/solr.core.TestFileSystemConfigSetService_433C4D26BCA96DD5-001/tempDir-001/testconfig/solrconfig.xml), InputStream(/Users/jenkins/workspace/Solr-main-MacOSX/solr/core/build/tmp/tests-tmp/solr.core.TestFileSystemConfigSetService_433C4D26BCA96DD5-001/tempDir-001/testconfig/schema.xml)]
	at __randomizedtesting.SeedInfo.seed([433C4D26BCA96DD5]:0)
	at org.apache.lucene.tests.mockfile.LeakFS.onClose(LeakFS.java:63)
	at org.apache.lucene.tests.mockfile.FilterFileSystem.close(FilterFileSystem.java:69)
	at org.apache.lucene.tests.mockfile.FilterFileSystem.close(FilterFileSystem.java:70)
	at org.apache.lucene.tests.util.TestRuleTemporaryFilesCleanup.afterAlways(TestRuleTemporaryFilesCleanup.java:223)
	at com.carrotsearch.randomizedtesting.rules.TestRuleAdapter$1.afterAlways(TestRuleAdapter.java:31)
	at com.carrotsearch.randomizedtesting.rules.StatementAdapter.evaluate(StatementAdapter.java:43)
	at com.carrotsearch.randomizedtesting.rules.StatementAdapter.evaluate(StatementAdapter.java:36)
	at org.apache.lucene.tests.util.TestRuleAssertionsRequired$1.evaluate(TestRuleAssertionsRequired.java:53)
	at org.apache.lucene.tests.util.AbstractBeforeAfterRule$1.evaluate(AbstractBeforeAfterRule.java:43)
	at org.apache.lucene.tests.util.TestRuleMarkFailure$1.evaluate(TestRuleMarkFailure.java:44)
	at org.apache.lucene.tests.util.TestRuleIgnoreAfterMaxFailures$1.evaluate(TestRuleIgnoreAfterMaxFailures.java:60)
	at org.apache.lucene.tests.util.TestRuleIgnoreTestSuites$1.evaluate(TestRuleIgnoreTestSuites.java:47)
	at org.junit.rules.RunRules.evaluate(RunRules.java:20)
	at com.carrotsearch.randomizedtesting.rules.StatementAdapter.evaluate(StatementAdapter.java:36)
	at com.carrotsearch.randomizedtesting.ThreadLeakControl$StatementRunner.run(ThreadLeakControl.java:390)
	at com.carrotsearch.randomizedtesting.ThreadLeakControl.lambda$forkTimeoutingTask$0(ThreadLeakControl.java:850)
	at java.base/java.lang.Thread.run(Thread.java:840)
Caused by: java.lang.Exception
	at org.apache.lucene.tests.mockfile.LeakFS.onOpen(LeakFS.java:46)
	at org.apache.lucene.tests.mockfile.HandleTrackingFS.callOpenHook(HandleTrackingFS.java:82)
	at org.apache.lucene.tests.mockfile.HandleTrackingFS.newInputStream(HandleTrackingFS.java:125)
	at org.apache.lucene.tests.mockfile.FilterFileSystemProvider.newInputStream(FilterFileSystemProvider.java:193)
	at org.apache.lucene.tests.mockfile.HandleTrackingFS.newInputStream(HandleTrackingFS.java:94)
	at java.base/java.nio.file.Files.newInputStream(Files.java:160)
	at org.apache.solr.core.FileSystemConfigSetService$2.visitFile(FileSystemConfigSetService.java:217)
	at org.apache.solr.core.FileSystemConfigSetService$2.visitFile(FileSystemConfigSetService.java:201)
	at java.base/java.nio.file.Files.walkFileTree(Files.java:2811)
	at java.base/java.nio.file.Files.walkFileTree(Files.java:2882)
	at org.apache.solr.core.FileSystemConfigSetService.copyRecursively(FileSystemConfigSetService.java:199)
	at org.apache.solr.core.FileSystemConfigSetService.copyConfig(FileSystemConfigSetService.java:114)
	at org.apache.solr.core.TestFileSystemConfigSetService.testUploadAndDeleteConfig(TestFileSystemConfigSetService.java:79)
	at java.base/jdk.internal.reflect.NativeMethodAccessorImpl.invoke0(Native Method)
	at java.base/jdk.internal.reflect.NativeMethodAccessorImpl.invoke(NativeMethodAccessorImpl.java:77)
	at java.base/jdk.internal.reflect.DelegatingMethodAccessorImpl.invoke(DelegatingMethodAccessorImpl.java:43)
	at java.base/java.lang.reflect.Method.invoke(Method.java:568)
	at com.carrotsearch.randomizedtesting.RandomizedRunner.invoke(RandomizedRunner.java:1758)
	at com.carrotsearch.randomizedtesting.RandomizedRunner$8.evaluate(RandomizedRunner.java:946)
	at com.carrotsearch.randomizedtesting.RandomizedRunner$9.evaluate(RandomizedRunner.java:982)
	at com.carrotsearch.randomizedtesting.RandomizedRunner$10.evaluate(RandomizedRunner.java:996)
	at com.carrotsearch.randomizedtesting.rules.SystemPropertiesRestoreRule$1.evaluate(SystemPropertiesRestoreRule.java:80)
	at org.junit.rules.RunRules.evaluate(RunRules.java:20)
	at org.apache.lucene.tests.util.TestRuleSetupTeardownChained$1.evaluate(TestRuleSetupTeardownChained.java:48)
	at org.apache.lucene.tests.util.AbstractBeforeAfterRule$1.evaluate(AbstractBeforeAfterRule.java:43)
	at org.apache.lucene.tests.util.TestRuleThreadAndTestName$1.evaluate(TestRuleThreadAndTestName.java:45)
	at org.apache.lucene.tests.util.TestRuleIgnoreAfterMaxFailures$1.evaluate(TestRuleIgnoreAfterMaxFailures.java:60)
	at org.apache.lucene.tests.util.TestRuleMarkFailure$1.evaluate(TestRuleMarkFailure.java:44)
	at org.junit.rules.RunRules.evaluate(RunRules.java:20)
	at com.carrotsearch.randomizedtesting.rules.StatementAdapter.evaluate(StatementAdapter.java:36)
	at com.carrotsearch.randomizedtesting.ThreadLeakControl$StatementRunner.run(ThreadLeakControl.java:390)
	at com.carrotsearch.randomizedtesting.ThreadLeakControl.forkTimeoutingTask(ThreadLeakControl.java:843)
	at com.carrotsearch.randomizedtesting.ThreadLeakControl$3.evaluate(ThreadLeakControl.java:490)
	at com.carrotsearch.randomizedtesting.RandomizedRunner.runSingleTest(RandomizedRunner.java:955)
	at com.carrotsearch.randomizedtesting.RandomizedRunner$5.evaluate(RandomizedRunner.java:840)
	at com.carrotsearch.randomizedtesting.RandomizedRunner$6.evaluate(RandomizedRunner.java:891)
	at com.carrotsearch.randomizedtesting.RandomizedRunner$7.evaluate(RandomizedRunner.java:902)
	at com.carrotsearch.randomizedtesting.rules.StatementAdapter.evaluate(StatementAdapter.java:36)
	at com.carrotsearch.randomizedtesting.rules.StatementAdapter.evaluate(StatementAdapter.java:36)
	at org.apache.lucene.tests.util.AbstractBeforeAfterRule$1.evaluate(AbstractBeforeAfterRule.java:43)
	at com.carrotsearch.randomizedtesting.rules.SystemPropertiesRestoreRule$1.evaluate(SystemPropertiesRestoreRule.java:80)
	at org.junit.rules.RunRules.evaluate(RunRules.java:20)
	at org.apache.lucene.tests.util.AbstractBeforeAfterRule$1.evaluate(AbstractBeforeAfterRule.java:43)
	at com.carrotsearch.randomizedtesting.rules.StatementAdapter.evaluate(StatementAdapter.java:36)
	at org.apache.lucene.tests.util.TestRuleStoreClassName$1.evaluate(TestRuleStoreClassName.java:38)
	at com.carrotsearch.randomizedtesting.rules.NoShadowingOrOverridesOnMethodsRule$1.evaluate(NoShadowingOrOverridesOnMethodsRule.java:40)
	at com.carrotsearch.randomizedtesting.rules.NoShadowingOrOverridesOnMethodsRule$1.evaluate(NoShadowingOrOverridesOnMethodsRule.java:40)
	at com.carrotsearch.randomizedtesting.rules.StatementAdapter.evaluate(StatementAdapter.java:36)
	... 11 more

[JENKINS] Solr-main-MacOSX (64bit/hotspot/jdk-11.0.21) - Build # 3703 - Still Unstable!

Posted by Policeman Jenkins Server <je...@thetaphi.de>.
Build: https://jenkins.thetaphi.de/job/Solr-main-MacOSX/3703/
Java: 64bit/hotspot/jdk-11.0.21 -XX:+UseCompressedOops -XX:+UseParallelGC

3 tests failed.
FAILED:  org.apache.solr.cloud.ReplaceNodeTest.testGoodSpreadDuringAssignWithNoTarget

Error Message:
java.lang.AssertionError: There should be no more replicas on the sourceNode after a replaceNode request. expected:<[]> but was:<[core_node12:{
  "core":"replacenodetest_coll_shard1_replica_n10",
  "node_name":"127.0.0.1:61090_solr",
  "base_url":"http://127.0.0.1:61090/solr",
  "state":"active",
  "type":"NRT",
  "force_set_state":"false"}, core_node7:{
  "core":"replacenodetest_coll_shard2_replica_n4",
  "leader":"true",
  "node_name":"127.0.0.1:61090_solr",
  "base_url":"http://127.0.0.1:61090/solr",
  "state":"active",
  "type":"NRT",
  "force_set_state":"false"}, core_node9:{
  "core":"replacenodetest_coll_shard3_replica_n6",
  "leader":"true",
  "node_name":"127.0.0.1:61090_solr",
  "base_url":"http://127.0.0.1:61090/solr",
  "state":"active",
  "type":"NRT",
  "force_set_state":"false"}]>

Stack Trace:
java.lang.AssertionError: There should be no more replicas on the sourceNode after a replaceNode request. expected:<[]> but was:<[core_node12:{
  "core":"replacenodetest_coll_shard1_replica_n10",
  "node_name":"127.0.0.1:61090_solr",
  "base_url":"http://127.0.0.1:61090/solr",
  "state":"active",
  "type":"NRT",
  "force_set_state":"false"}, core_node7:{
  "core":"replacenodetest_coll_shard2_replica_n4",
  "leader":"true",
  "node_name":"127.0.0.1:61090_solr",
  "base_url":"http://127.0.0.1:61090/solr",
  "state":"active",
  "type":"NRT",
  "force_set_state":"false"}, core_node9:{
  "core":"replacenodetest_coll_shard3_replica_n6",
  "leader":"true",
  "node_name":"127.0.0.1:61090_solr",
  "base_url":"http://127.0.0.1:61090/solr",
  "state":"active",
  "type":"NRT",
  "force_set_state":"false"}]>
	at __randomizedtesting.SeedInfo.seed([92A967A4BD001ECA:BCC2B39E8863CFBE]:0)
	at org.junit.Assert.fail(Assert.java:89)
	at org.junit.Assert.failNotEquals(Assert.java:835)
	at org.junit.Assert.assertEquals(Assert.java:120)
	at org.apache.solr.cloud.ReplaceNodeTest.testGoodSpreadDuringAssignWithNoTarget(ReplaceNodeTest.java:273)
	at java.base/jdk.internal.reflect.NativeMethodAccessorImpl.invoke0(Native Method)
	at java.base/jdk.internal.reflect.NativeMethodAccessorImpl.invoke(NativeMethodAccessorImpl.java:62)
	at java.base/jdk.internal.reflect.DelegatingMethodAccessorImpl.invoke(DelegatingMethodAccessorImpl.java:43)
	at java.base/java.lang.reflect.Method.invoke(Method.java:566)
	at com.carrotsearch.randomizedtesting.RandomizedRunner.invoke(RandomizedRunner.java:1758)
	at com.carrotsearch.randomizedtesting.RandomizedRunner$8.evaluate(RandomizedRunner.java:946)
	at com.carrotsearch.randomizedtesting.RandomizedRunner$9.evaluate(RandomizedRunner.java:982)
	at com.carrotsearch.randomizedtesting.RandomizedRunner$10.evaluate(RandomizedRunner.java:996)
	at com.carrotsearch.randomizedtesting.rules.SystemPropertiesRestoreRule$1.evaluate(SystemPropertiesRestoreRule.java:80)
	at org.junit.rules.RunRules.evaluate(RunRules.java:20)
	at org.apache.lucene.tests.util.TestRuleSetupTeardownChained$1.evaluate(TestRuleSetupTeardownChained.java:48)
	at org.apache.lucene.tests.util.AbstractBeforeAfterRule$1.evaluate(AbstractBeforeAfterRule.java:43)
	at org.apache.lucene.tests.util.TestRuleThreadAndTestName$1.evaluate(TestRuleThreadAndTestName.java:45)
	at org.apache.lucene.tests.util.TestRuleIgnoreAfterMaxFailures$1.evaluate(TestRuleIgnoreAfterMaxFailures.java:60)
	at org.apache.lucene.tests.util.TestRuleMarkFailure$1.evaluate(TestRuleMarkFailure.java:44)
	at org.junit.rules.RunRules.evaluate(RunRules.java:20)
	at com.carrotsearch.randomizedtesting.rules.StatementAdapter.evaluate(StatementAdapter.java:36)
	at com.carrotsearch.randomizedtesting.ThreadLeakControl$StatementRunner.run(ThreadLeakControl.java:390)
	at com.carrotsearch.randomizedtesting.ThreadLeakControl.forkTimeoutingTask(ThreadLeakControl.java:843)
	at com.carrotsearch.randomizedtesting.ThreadLeakControl$3.evaluate(ThreadLeakControl.java:490)
	at com.carrotsearch.randomizedtesting.RandomizedRunner.runSingleTest(RandomizedRunner.java:955)
	at com.carrotsearch.randomizedtesting.RandomizedRunner$5.evaluate(RandomizedRunner.java:840)
	at com.carrotsearch.randomizedtesting.RandomizedRunner$6.evaluate(RandomizedRunner.java:891)
	at com.carrotsearch.randomizedtesting.RandomizedRunner$7.evaluate(RandomizedRunner.java:902)
	at com.carrotsearch.randomizedtesting.rules.StatementAdapter.evaluate(StatementAdapter.java:36)
	at com.carrotsearch.randomizedtesting.rules.StatementAdapter.evaluate(StatementAdapter.java:36)
	at org.apache.lucene.tests.util.AbstractBeforeAfterRule$1.evaluate(AbstractBeforeAfterRule.java:43)
	at com.carrotsearch.randomizedtesting.rules.SystemPropertiesRestoreRule$1.evaluate(SystemPropertiesRestoreRule.java:80)
	at org.junit.rules.RunRules.evaluate(RunRules.java:20)
	at org.apache.lucene.tests.util.AbstractBeforeAfterRule$1.evaluate(AbstractBeforeAfterRule.java:43)
	at com.carrotsearch.randomizedtesting.rules.StatementAdapter.evaluate(StatementAdapter.java:36)
	at org.apache.lucene.tests.util.TestRuleStoreClassName$1.evaluate(TestRuleStoreClassName.java:38)
	at com.carrotsearch.randomizedtesting.rules.NoShadowingOrOverridesOnMethodsRule$1.evaluate(NoShadowingOrOverridesOnMethodsRule.java:40)
	at com.carrotsearch.randomizedtesting.rules.NoShadowingOrOverridesOnMethodsRule$1.evaluate(NoShadowingOrOverridesOnMethodsRule.java:40)
	at com.carrotsearch.randomizedtesting.rules.StatementAdapter.evaluate(StatementAdapter.java:36)
	at com.carrotsearch.randomizedtesting.rules.StatementAdapter.evaluate(StatementAdapter.java:36)
	at org.apache.lucene.tests.util.TestRuleAssertionsRequired$1.evaluate(TestRuleAssertionsRequired.java:53)
	at org.apache.lucene.tests.util.AbstractBeforeAfterRule$1.evaluate(AbstractBeforeAfterRule.java:43)
	at org.apache.lucene.tests.util.TestRuleMarkFailure$1.evaluate(TestRuleMarkFailure.java:44)
	at org.apache.lucene.tests.util.TestRuleIgnoreAfterMaxFailures$1.evaluate(TestRuleIgnoreAfterMaxFailures.java:60)
	at org.apache.lucene.tests.util.TestRuleIgnoreTestSuites$1.evaluate(TestRuleIgnoreTestSuites.java:47)
	at org.junit.rules.RunRules.evaluate(RunRules.java:20)
	at com.carrotsearch.randomizedtesting.rules.StatementAdapter.evaluate(StatementAdapter.java:36)
	at com.carrotsearch.randomizedtesting.ThreadLeakControl$StatementRunner.run(ThreadLeakControl.java:390)
	at com.carrotsearch.randomizedtesting.ThreadLeakControl.lambda$forkTimeoutingTask$0(ThreadLeakControl.java:850)
	at java.base/java.lang.Thread.run(Thread.java:829)


FAILED:  org.apache.solr.core.TestConfigSetService.classMethod

Error Message:
java.lang.RuntimeException: file handle leaks: [InputStream(/Users/jenkins/workspace/Solr-main-MacOSX/solr/core/build/tmp/tests-tmp/solr.core.TestConfigSetService_92A967A4BD001ECA-001/configsets-001/testconfig/.metadata.json), InputStream(/Users/jenkins/workspace/Solr-main-MacOSX/solr/core/build/tmp/tests-tmp/solr.core.TestConfigSetService_92A967A4BD001ECA-001/configsets-001/testconfig/subdir/file3), InputStream(/Users/jenkins/workspace/Solr-main-MacOSX/solr/core/build/tmp/tests-tmp/solr.core.TestConfigSetService_92A967A4BD001ECA-001/configsets-001/testconfig/subdir/file4), InputStream(/Users/jenkins/workspace/Solr-main-MacOSX/solr/core/build/tmp/tests-tmp/solr.core.TestConfigSetService_92A967A4BD001ECA-001/configsets-001/testconfig/file1), InputStream(/Users/jenkins/workspace/Solr-main-MacOSX/solr/core/build/tmp/tests-tmp/solr.core.TestConfigSetService_92A967A4BD001ECA-001/testconfig-002/subdir/file3), InputStream(/Users/jenkins/workspace/Solr-main-MacOSX/solr/core/build/tmp/tests-tmp/solr.core.TestConfigSetService_92A967A4BD001ECA-001/testconfig-002/solrconfig.xml), InputStream(/Users/jenkins/workspace/Solr-main-MacOSX/solr/core/build/tmp/tests-tmp/solr.core.TestConfigSetService_92A967A4BD001ECA-001/testconfig-002/file1), InputStream(/Users/jenkins/workspace/Solr-main-MacOSX/solr/core/build/tmp/tests-tmp/solr.core.TestConfigSetService_92A967A4BD001ECA-001/configsets-001/testconfig/solrconfig.xml), InputStream(/Users/jenkins/workspace/Solr-main-MacOSX/solr/core/build/tmp/tests-tmp/solr.core.TestConfigSetService_92A967A4BD001ECA-001/testconfig-002/file2), InputStream(/Users/jenkins/workspace/Solr-main-MacOSX/solr/core/build/tmp/tests-tmp/solr.core.TestConfigSetService_92A967A4BD001ECA-001/configsets-001/testconfig/file2)]

Stack Trace:
java.lang.RuntimeException: file handle leaks: [InputStream(/Users/jenkins/workspace/Solr-main-MacOSX/solr/core/build/tmp/tests-tmp/solr.core.TestConfigSetService_92A967A4BD001ECA-001/configsets-001/testconfig/.metadata.json), InputStream(/Users/jenkins/workspace/Solr-main-MacOSX/solr/core/build/tmp/tests-tmp/solr.core.TestConfigSetService_92A967A4BD001ECA-001/configsets-001/testconfig/subdir/file3), InputStream(/Users/jenkins/workspace/Solr-main-MacOSX/solr/core/build/tmp/tests-tmp/solr.core.TestConfigSetService_92A967A4BD001ECA-001/configsets-001/testconfig/subdir/file4), InputStream(/Users/jenkins/workspace/Solr-main-MacOSX/solr/core/build/tmp/tests-tmp/solr.core.TestConfigSetService_92A967A4BD001ECA-001/configsets-001/testconfig/file1), InputStream(/Users/jenkins/workspace/Solr-main-MacOSX/solr/core/build/tmp/tests-tmp/solr.core.TestConfigSetService_92A967A4BD001ECA-001/testconfig-002/subdir/file3), InputStream(/Users/jenkins/workspace/Solr-main-MacOSX/solr/core/build/tmp/tests-tmp/solr.core.TestConfigSetService_92A967A4BD001ECA-001/testconfig-002/solrconfig.xml), InputStream(/Users/jenkins/workspace/Solr-main-MacOSX/solr/core/build/tmp/tests-tmp/solr.core.TestConfigSetService_92A967A4BD001ECA-001/testconfig-002/file1), InputStream(/Users/jenkins/workspace/Solr-main-MacOSX/solr/core/build/tmp/tests-tmp/solr.core.TestConfigSetService_92A967A4BD001ECA-001/configsets-001/testconfig/solrconfig.xml), InputStream(/Users/jenkins/workspace/Solr-main-MacOSX/solr/core/build/tmp/tests-tmp/solr.core.TestConfigSetService_92A967A4BD001ECA-001/testconfig-002/file2), InputStream(/Users/jenkins/workspace/Solr-main-MacOSX/solr/core/build/tmp/tests-tmp/solr.core.TestConfigSetService_92A967A4BD001ECA-001/configsets-001/testconfig/file2)]
	at __randomizedtesting.SeedInfo.seed([92A967A4BD001ECA]:0)
	at org.apache.lucene.tests.mockfile.LeakFS.onClose(LeakFS.java:63)
	at org.apache.lucene.tests.mockfile.FilterFileSystem.close(FilterFileSystem.java:69)
	at org.apache.lucene.tests.mockfile.FilterFileSystem.close(FilterFileSystem.java:70)
	at org.apache.lucene.tests.util.TestRuleTemporaryFilesCleanup.afterAlways(TestRuleTemporaryFilesCleanup.java:223)
	at com.carrotsearch.randomizedtesting.rules.TestRuleAdapter$1.afterAlways(TestRuleAdapter.java:31)
	at com.carrotsearch.randomizedtesting.rules.StatementAdapter.evaluate(StatementAdapter.java:43)
	at com.carrotsearch.randomizedtesting.rules.StatementAdapter.evaluate(StatementAdapter.java:36)
	at org.apache.lucene.tests.util.TestRuleAssertionsRequired$1.evaluate(TestRuleAssertionsRequired.java:53)
	at org.apache.lucene.tests.util.AbstractBeforeAfterRule$1.evaluate(AbstractBeforeAfterRule.java:43)
	at org.apache.lucene.tests.util.TestRuleMarkFailure$1.evaluate(TestRuleMarkFailure.java:44)
	at org.apache.lucene.tests.util.TestRuleIgnoreAfterMaxFailures$1.evaluate(TestRuleIgnoreAfterMaxFailures.java:60)
	at org.apache.lucene.tests.util.TestRuleIgnoreTestSuites$1.evaluate(TestRuleIgnoreTestSuites.java:47)
	at org.junit.rules.RunRules.evaluate(RunRules.java:20)
	at com.carrotsearch.randomizedtesting.rules.StatementAdapter.evaluate(StatementAdapter.java:36)
	at com.carrotsearch.randomizedtesting.ThreadLeakControl$StatementRunner.run(ThreadLeakControl.java:390)
	at com.carrotsearch.randomizedtesting.ThreadLeakControl.lambda$forkTimeoutingTask$0(ThreadLeakControl.java:850)
	at java.base/java.lang.Thread.run(Thread.java:829)
Caused by: java.lang.Exception
	at org.apache.lucene.tests.mockfile.LeakFS.onOpen(LeakFS.java:46)
	at org.apache.lucene.tests.mockfile.HandleTrackingFS.callOpenHook(HandleTrackingFS.java:82)
	at org.apache.lucene.tests.mockfile.HandleTrackingFS.newInputStream(HandleTrackingFS.java:125)
	at org.apache.lucene.tests.mockfile.FilterFileSystemProvider.newInputStream(FilterFileSystemProvider.java:193)
	at org.apache.lucene.tests.mockfile.HandleTrackingFS.newInputStream(HandleTrackingFS.java:94)
	at java.base/java.nio.file.Files.newInputStream(Files.java:156)
	at org.apache.solr.core.FileSystemConfigSetService$2.visitFile(FileSystemConfigSetService.java:217)
	at org.apache.solr.core.FileSystemConfigSetService$2.visitFile(FileSystemConfigSetService.java:201)
	at java.base/java.nio.file.Files.walkFileTree(Files.java:2725)
	at java.base/java.nio.file.Files.walkFileTree(Files.java:2797)
	at org.apache.solr.core.FileSystemConfigSetService.copyRecursively(FileSystemConfigSetService.java:199)
	at org.apache.solr.core.FileSystemConfigSetService.copyConfig(FileSystemConfigSetService.java:114)
	at org.apache.solr.core.TestConfigSetService.testConfigSetServiceOperations(TestConfigSetService.java:113)
	at java.base/jdk.internal.reflect.NativeMethodAccessorImpl.invoke0(Native Method)
	at java.base/jdk.internal.reflect.NativeMethodAccessorImpl.invoke(NativeMethodAccessorImpl.java:62)
	at java.base/jdk.internal.reflect.DelegatingMethodAccessorImpl.invoke(DelegatingMethodAccessorImpl.java:43)
	at java.base/java.lang.reflect.Method.invoke(Method.java:566)
	at com.carrotsearch.randomizedtesting.RandomizedRunner.invoke(RandomizedRunner.java:1758)
	at com.carrotsearch.randomizedtesting.RandomizedRunner$8.evaluate(RandomizedRunner.java:946)
	at com.carrotsearch.randomizedtesting.RandomizedRunner$9.evaluate(RandomizedRunner.java:982)
	at com.carrotsearch.randomizedtesting.RandomizedRunner$10.evaluate(RandomizedRunner.java:996)
	at com.carrotsearch.randomizedtesting.rules.SystemPropertiesRestoreRule$1.evaluate(SystemPropertiesRestoreRule.java:80)
	at org.junit.rules.RunRules.evaluate(RunRules.java:20)
	at org.apache.lucene.tests.util.TestRuleSetupTeardownChained$1.evaluate(TestRuleSetupTeardownChained.java:48)
	at org.apache.lucene.tests.util.AbstractBeforeAfterRule$1.evaluate(AbstractBeforeAfterRule.java:43)
	at org.apache.lucene.tests.util.TestRuleThreadAndTestName$1.evaluate(TestRuleThreadAndTestName.java:45)
	at org.apache.lucene.tests.util.TestRuleIgnoreAfterMaxFailures$1.evaluate(TestRuleIgnoreAfterMaxFailures.java:60)
	at org.apache.lucene.tests.util.TestRuleMarkFailure$1.evaluate(TestRuleMarkFailure.java:44)
	at org.junit.rules.RunRules.evaluate(RunRules.java:20)
	at com.carrotsearch.randomizedtesting.rules.StatementAdapter.evaluate(StatementAdapter.java:36)
	at com.carrotsearch.randomizedtesting.ThreadLeakControl$StatementRunner.run(ThreadLeakControl.java:390)
	at com.carrotsearch.randomizedtesting.ThreadLeakControl.forkTimeoutingTask(ThreadLeakControl.java:843)
	at com.carrotsearch.randomizedtesting.ThreadLeakControl$3.evaluate(ThreadLeakControl.java:490)
	at com.carrotsearch.randomizedtesting.RandomizedRunner.runSingleTest(RandomizedRunner.java:955)
	at com.carrotsearch.randomizedtesting.RandomizedRunner$5.evaluate(RandomizedRunner.java:840)
	at com.carrotsearch.randomizedtesting.RandomizedRunner$6.evaluate(RandomizedRunner.java:891)
	at com.carrotsearch.randomizedtesting.RandomizedRunner$7.evaluate(RandomizedRunner.java:902)
	at com.carrotsearch.randomizedtesting.rules.StatementAdapter.evaluate(StatementAdapter.java:36)
	at com.carrotsearch.randomizedtesting.rules.StatementAdapter.evaluate(StatementAdapter.java:36)
	at org.apache.lucene.tests.util.AbstractBeforeAfterRule$1.evaluate(AbstractBeforeAfterRule.java:43)
	at com.carrotsearch.randomizedtesting.rules.SystemPropertiesRestoreRule$1.evaluate(SystemPropertiesRestoreRule.java:80)
	at org.junit.rules.RunRules.evaluate(RunRules.java:20)
	at org.apache.lucene.tests.util.AbstractBeforeAfterRule$1.evaluate(AbstractBeforeAfterRule.java:43)
	at com.carrotsearch.randomizedtesting.rules.StatementAdapter.evaluate(StatementAdapter.java:36)
	at org.apache.lucene.tests.util.TestRuleStoreClassName$1.evaluate(TestRuleStoreClassName.java:38)
	at com.carrotsearch.randomizedtesting.rules.NoShadowingOrOverridesOnMethodsRule$1.evaluate(NoShadowingOrOverridesOnMethodsRule.java:40)
	at com.carrotsearch.randomizedtesting.rules.NoShadowingOrOverridesOnMethodsRule$1.evaluate(NoShadowingOrOverridesOnMethodsRule.java:40)
	at com.carrotsearch.randomizedtesting.rules.StatementAdapter.evaluate(StatementAdapter.java:36)
	... 11 more


FAILED:  org.apache.solr.core.TestFileSystemConfigSetService.classMethod

Error Message:
java.lang.RuntimeException: file handle leaks: [InputStream(/Users/jenkins/workspace/Solr-main-MacOSX/solr/core/build/tmp/tests-tmp/solr.core.TestFileSystemConfigSetService_92A967A4BD001ECA-001/tempDir-001/testconfig/solrconfig.xml), InputStream(/Users/jenkins/workspace/Solr-main-MacOSX/solr/core/build/tmp/tests-tmp/solr.core.TestFileSystemConfigSetService_92A967A4BD001ECA-001/tempDir-001/testconfig/schema.xml), InputStream(/Users/jenkins/workspace/Solr-main-MacOSX/solr/core/build/tmp/tests-tmp/solr.core.TestFileSystemConfigSetService_92A967A4BD001ECA-001/tempDir-001/testconfig/solrconfig.xml), InputStream(/Users/jenkins/workspace/Solr-main-MacOSX/solr/core/build/tmp/tests-tmp/solr.core.TestFileSystemConfigSetService_92A967A4BD001ECA-001/tempDir-001/testconfig/schema.xml)]

Stack Trace:
java.lang.RuntimeException: file handle leaks: [InputStream(/Users/jenkins/workspace/Solr-main-MacOSX/solr/core/build/tmp/tests-tmp/solr.core.TestFileSystemConfigSetService_92A967A4BD001ECA-001/tempDir-001/testconfig/solrconfig.xml), InputStream(/Users/jenkins/workspace/Solr-main-MacOSX/solr/core/build/tmp/tests-tmp/solr.core.TestFileSystemConfigSetService_92A967A4BD001ECA-001/tempDir-001/testconfig/schema.xml), InputStream(/Users/jenkins/workspace/Solr-main-MacOSX/solr/core/build/tmp/tests-tmp/solr.core.TestFileSystemConfigSetService_92A967A4BD001ECA-001/tempDir-001/testconfig/solrconfig.xml), InputStream(/Users/jenkins/workspace/Solr-main-MacOSX/solr/core/build/tmp/tests-tmp/solr.core.TestFileSystemConfigSetService_92A967A4BD001ECA-001/tempDir-001/testconfig/schema.xml)]
	at __randomizedtesting.SeedInfo.seed([92A967A4BD001ECA]:0)
	at org.apache.lucene.tests.mockfile.LeakFS.onClose(LeakFS.java:63)
	at org.apache.lucene.tests.mockfile.FilterFileSystem.close(FilterFileSystem.java:69)
	at org.apache.lucene.tests.mockfile.FilterFileSystem.close(FilterFileSystem.java:70)
	at org.apache.lucene.tests.util.TestRuleTemporaryFilesCleanup.afterAlways(TestRuleTemporaryFilesCleanup.java:223)
	at com.carrotsearch.randomizedtesting.rules.TestRuleAdapter$1.afterAlways(TestRuleAdapter.java:31)
	at com.carrotsearch.randomizedtesting.rules.StatementAdapter.evaluate(StatementAdapter.java:43)
	at com.carrotsearch.randomizedtesting.rules.StatementAdapter.evaluate(StatementAdapter.java:36)
	at org.apache.lucene.tests.util.TestRuleAssertionsRequired$1.evaluate(TestRuleAssertionsRequired.java:53)
	at org.apache.lucene.tests.util.AbstractBeforeAfterRule$1.evaluate(AbstractBeforeAfterRule.java:43)
	at org.apache.lucene.tests.util.TestRuleMarkFailure$1.evaluate(TestRuleMarkFailure.java:44)
	at org.apache.lucene.tests.util.TestRuleIgnoreAfterMaxFailures$1.evaluate(TestRuleIgnoreAfterMaxFailures.java:60)
	at org.apache.lucene.tests.util.TestRuleIgnoreTestSuites$1.evaluate(TestRuleIgnoreTestSuites.java:47)
	at org.junit.rules.RunRules.evaluate(RunRules.java:20)
	at com.carrotsearch.randomizedtesting.rules.StatementAdapter.evaluate(StatementAdapter.java:36)
	at com.carrotsearch.randomizedtesting.ThreadLeakControl$StatementRunner.run(ThreadLeakControl.java:390)
	at com.carrotsearch.randomizedtesting.ThreadLeakControl.lambda$forkTimeoutingTask$0(ThreadLeakControl.java:850)
	at java.base/java.lang.Thread.run(Thread.java:829)
Caused by: java.lang.Exception
	at org.apache.lucene.tests.mockfile.LeakFS.onOpen(LeakFS.java:46)
	at org.apache.lucene.tests.mockfile.HandleTrackingFS.callOpenHook(HandleTrackingFS.java:82)
	at org.apache.lucene.tests.mockfile.HandleTrackingFS.newInputStream(HandleTrackingFS.java:125)
	at org.apache.lucene.tests.mockfile.FilterFileSystemProvider.newInputStream(FilterFileSystemProvider.java:193)
	at org.apache.lucene.tests.mockfile.HandleTrackingFS.newInputStream(HandleTrackingFS.java:94)
	at java.base/java.nio.file.Files.newInputStream(Files.java:156)
	at org.apache.solr.core.FileSystemConfigSetService$2.visitFile(FileSystemConfigSetService.java:217)
	at org.apache.solr.core.FileSystemConfigSetService$2.visitFile(FileSystemConfigSetService.java:201)
	at java.base/java.nio.file.Files.walkFileTree(Files.java:2725)
	at java.base/java.nio.file.Files.walkFileTree(Files.java:2797)
	at org.apache.solr.core.FileSystemConfigSetService.copyRecursively(FileSystemConfigSetService.java:199)
	at org.apache.solr.core.FileSystemConfigSetService.copyConfig(FileSystemConfigSetService.java:114)
	at org.apache.solr.core.TestFileSystemConfigSetService.testUploadAndDeleteConfig(TestFileSystemConfigSetService.java:79)
	at java.base/jdk.internal.reflect.NativeMethodAccessorImpl.invoke0(Native Method)
	at java.base/jdk.internal.reflect.NativeMethodAccessorImpl.invoke(NativeMethodAccessorImpl.java:62)
	at java.base/jdk.internal.reflect.DelegatingMethodAccessorImpl.invoke(DelegatingMethodAccessorImpl.java:43)
	at java.base/java.lang.reflect.Method.invoke(Method.java:566)
	at com.carrotsearch.randomizedtesting.RandomizedRunner.invoke(RandomizedRunner.java:1758)
	at com.carrotsearch.randomizedtesting.RandomizedRunner$8.evaluate(RandomizedRunner.java:946)
	at com.carrotsearch.randomizedtesting.RandomizedRunner$9.evaluate(RandomizedRunner.java:982)
	at com.carrotsearch.randomizedtesting.RandomizedRunner$10.evaluate(RandomizedRunner.java:996)
	at com.carrotsearch.randomizedtesting.rules.SystemPropertiesRestoreRule$1.evaluate(SystemPropertiesRestoreRule.java:80)
	at org.junit.rules.RunRules.evaluate(RunRules.java:20)
	at org.apache.lucene.tests.util.TestRuleSetupTeardownChained$1.evaluate(TestRuleSetupTeardownChained.java:48)
	at org.apache.lucene.tests.util.AbstractBeforeAfterRule$1.evaluate(AbstractBeforeAfterRule.java:43)
	at org.apache.lucene.tests.util.TestRuleThreadAndTestName$1.evaluate(TestRuleThreadAndTestName.java:45)
	at org.apache.lucene.tests.util.TestRuleIgnoreAfterMaxFailures$1.evaluate(TestRuleIgnoreAfterMaxFailures.java:60)
	at org.apache.lucene.tests.util.TestRuleMarkFailure$1.evaluate(TestRuleMarkFailure.java:44)
	at org.junit.rules.RunRules.evaluate(RunRules.java:20)
	at com.carrotsearch.randomizedtesting.rules.StatementAdapter.evaluate(StatementAdapter.java:36)
	at com.carrotsearch.randomizedtesting.ThreadLeakControl$StatementRunner.run(ThreadLeakControl.java:390)
	at com.carrotsearch.randomizedtesting.ThreadLeakControl.forkTimeoutingTask(ThreadLeakControl.java:843)
	at com.carrotsearch.randomizedtesting.ThreadLeakControl$3.evaluate(ThreadLeakControl.java:490)
	at com.carrotsearch.randomizedtesting.RandomizedRunner.runSingleTest(RandomizedRunner.java:955)
	at com.carrotsearch.randomizedtesting.RandomizedRunner$5.evaluate(RandomizedRunner.java:840)
	at com.carrotsearch.randomizedtesting.RandomizedRunner$6.evaluate(RandomizedRunner.java:891)
	at com.carrotsearch.randomizedtesting.RandomizedRunner$7.evaluate(RandomizedRunner.java:902)
	at com.carrotsearch.randomizedtesting.rules.StatementAdapter.evaluate(StatementAdapter.java:36)
	at com.carrotsearch.randomizedtesting.rules.StatementAdapter.evaluate(StatementAdapter.java:36)
	at org.apache.lucene.tests.util.AbstractBeforeAfterRule$1.evaluate(AbstractBeforeAfterRule.java:43)
	at com.carrotsearch.randomizedtesting.rules.SystemPropertiesRestoreRule$1.evaluate(SystemPropertiesRestoreRule.java:80)
	at org.junit.rules.RunRules.evaluate(RunRules.java:20)
	at org.apache.lucene.tests.util.AbstractBeforeAfterRule$1.evaluate(AbstractBeforeAfterRule.java:43)
	at com.carrotsearch.randomizedtesting.rules.StatementAdapter.evaluate(StatementAdapter.java:36)
	at org.apache.lucene.tests.util.TestRuleStoreClassName$1.evaluate(TestRuleStoreClassName.java:38)
	at com.carrotsearch.randomizedtesting.rules.NoShadowingOrOverridesOnMethodsRule$1.evaluate(NoShadowingOrOverridesOnMethodsRule.java:40)
	at com.carrotsearch.randomizedtesting.rules.NoShadowingOrOverridesOnMethodsRule$1.evaluate(NoShadowingOrOverridesOnMethodsRule.java:40)
	at com.carrotsearch.randomizedtesting.rules.StatementAdapter.evaluate(StatementAdapter.java:36)
	... 11 more

[JENKINS] Solr-main-MacOSX (64bit/hotspot/jdk-21.0.1) - Build # 3702 - Still Unstable!

Posted by Policeman Jenkins Server <je...@thetaphi.de>.
Build: https://jenkins.thetaphi.de/job/Solr-main-MacOSX/3702/
Java: 64bit/hotspot/jdk-21.0.1 -XX:-UseCompressedOops -XX:+UseParallelGC

4 tests failed.
FAILED:  org.apache.solr.s3.S3IncrementalBackupTest.testRestoreToOriginalCollection

Error Message:
java.lang.AssertionError: expected:<COMPLETED> but was:<RUNNING>

Stack Trace:
java.lang.AssertionError: expected:<COMPLETED> but was:<RUNNING>
	at __randomizedtesting.SeedInfo.seed([4291B8E2FDFF8196:776553B91623B7C8]:0)
	at org.junit.Assert.fail(Assert.java:89)
	at org.junit.Assert.failNotEquals(Assert.java:835)
	at org.junit.Assert.assertEquals(Assert.java:120)
	at org.junit.Assert.assertEquals(Assert.java:146)
	at org.apache.solr.cloud.api.collections.AbstractIncrementalBackupTest.testRestoreToOriginalCollection(AbstractIncrementalBackupTest.java:212)
	at java.base/jdk.internal.reflect.DirectMethodHandleAccessor.invoke(DirectMethodHandleAccessor.java:103)
	at java.base/java.lang.reflect.Method.invoke(Method.java:580)
	at com.carrotsearch.randomizedtesting.RandomizedRunner.invoke(RandomizedRunner.java:1758)
	at com.carrotsearch.randomizedtesting.RandomizedRunner$8.evaluate(RandomizedRunner.java:946)
	at com.carrotsearch.randomizedtesting.RandomizedRunner$9.evaluate(RandomizedRunner.java:982)
	at com.carrotsearch.randomizedtesting.RandomizedRunner$10.evaluate(RandomizedRunner.java:996)
	at com.carrotsearch.randomizedtesting.rules.SystemPropertiesRestoreRule$1.evaluate(SystemPropertiesRestoreRule.java:80)
	at org.junit.rules.RunRules.evaluate(RunRules.java:20)
	at org.apache.lucene.tests.util.TestRuleSetupTeardownChained$1.evaluate(TestRuleSetupTeardownChained.java:48)
	at org.apache.lucene.tests.util.AbstractBeforeAfterRule$1.evaluate(AbstractBeforeAfterRule.java:43)
	at org.apache.lucene.tests.util.TestRuleThreadAndTestName$1.evaluate(TestRuleThreadAndTestName.java:45)
	at org.apache.lucene.tests.util.TestRuleIgnoreAfterMaxFailures$1.evaluate(TestRuleIgnoreAfterMaxFailures.java:60)
	at org.apache.lucene.tests.util.TestRuleMarkFailure$1.evaluate(TestRuleMarkFailure.java:44)
	at org.junit.rules.RunRules.evaluate(RunRules.java:20)
	at com.carrotsearch.randomizedtesting.rules.StatementAdapter.evaluate(StatementAdapter.java:36)
	at com.carrotsearch.randomizedtesting.ThreadLeakControl$StatementRunner.run(ThreadLeakControl.java:390)
	at com.carrotsearch.randomizedtesting.ThreadLeakControl.forkTimeoutingTask(ThreadLeakControl.java:843)
	at com.carrotsearch.randomizedtesting.ThreadLeakControl$3.evaluate(ThreadLeakControl.java:490)
	at com.carrotsearch.randomizedtesting.RandomizedRunner.runSingleTest(RandomizedRunner.java:955)
	at com.carrotsearch.randomizedtesting.RandomizedRunner$5.evaluate(RandomizedRunner.java:840)
	at com.carrotsearch.randomizedtesting.RandomizedRunner$6.evaluate(RandomizedRunner.java:891)
	at com.carrotsearch.randomizedtesting.RandomizedRunner$7.evaluate(RandomizedRunner.java:902)
	at com.adobe.testing.s3mock.junit4.S3MockRule$1.evaluate(S3MockRule.java:66)
	at com.carrotsearch.randomizedtesting.rules.StatementAdapter.evaluate(StatementAdapter.java:36)
	at com.carrotsearch.randomizedtesting.rules.StatementAdapter.evaluate(StatementAdapter.java:36)
	at org.apache.lucene.tests.util.AbstractBeforeAfterRule$1.evaluate(AbstractBeforeAfterRule.java:43)
	at com.carrotsearch.randomizedtesting.rules.SystemPropertiesRestoreRule$1.evaluate(SystemPropertiesRestoreRule.java:80)
	at org.junit.rules.RunRules.evaluate(RunRules.java:20)
	at org.apache.lucene.tests.util.AbstractBeforeAfterRule$1.evaluate(AbstractBeforeAfterRule.java:43)
	at com.carrotsearch.randomizedtesting.rules.StatementAdapter.evaluate(StatementAdapter.java:36)
	at org.apache.lucene.tests.util.TestRuleStoreClassName$1.evaluate(TestRuleStoreClassName.java:38)
	at com.carrotsearch.randomizedtesting.rules.NoShadowingOrOverridesOnMethodsRule$1.evaluate(NoShadowingOrOverridesOnMethodsRule.java:40)
	at com.carrotsearch.randomizedtesting.rules.NoShadowingOrOverridesOnMethodsRule$1.evaluate(NoShadowingOrOverridesOnMethodsRule.java:40)
	at com.carrotsearch.randomizedtesting.rules.StatementAdapter.evaluate(StatementAdapter.java:36)
	at com.carrotsearch.randomizedtesting.rules.StatementAdapter.evaluate(StatementAdapter.java:36)
	at org.apache.lucene.tests.util.TestRuleAssertionsRequired$1.evaluate(TestRuleAssertionsRequired.java:53)
	at org.apache.lucene.tests.util.AbstractBeforeAfterRule$1.evaluate(AbstractBeforeAfterRule.java:43)
	at org.apache.lucene.tests.util.TestRuleMarkFailure$1.evaluate(TestRuleMarkFailure.java:44)
	at org.apache.lucene.tests.util.TestRuleIgnoreAfterMaxFailures$1.evaluate(TestRuleIgnoreAfterMaxFailures.java:60)
	at org.apache.lucene.tests.util.TestRuleIgnoreTestSuites$1.evaluate(TestRuleIgnoreTestSuites.java:47)
	at org.junit.rules.RunRules.evaluate(RunRules.java:20)
	at com.carrotsearch.randomizedtesting.rules.StatementAdapter.evaluate(StatementAdapter.java:36)
	at com.carrotsearch.randomizedtesting.ThreadLeakControl$StatementRunner.run(ThreadLeakControl.java:390)
	at com.carrotsearch.randomizedtesting.ThreadLeakControl.lambda$forkTimeoutingTask$0(ThreadLeakControl.java:850)
	at java.base/java.lang.Thread.run(Thread.java:1583)


FAILED:  org.apache.solr.s3.S3IncrementalBackupTest.testSkipConfigset

Error Message:
java.lang.AssertionError: Configset shouldn't be part of the backup but found:
s3:/mytestbackuptestskipconfigset/
s3:/mytestbackuptestskipconfigset/backuprestore_testskipconfigset/
s3:/mytestbackuptestskipconfigset/backuprestore_testskipconfigset/
s3:/mytestbackuptestskipconfigset/backuprestore_testskipconfigset/index/
s3:/mytestbackuptestskipconfigset/backuprestore_testskipconfigset/shard_backup_metadata/
s3:/mytestbackuptestskipconfigset/backuprestore_testskipconfigset/
s3:/mytestbackuptestskipconfigset/backuprestore_testskipconfigset/
s3:/mytestbackuptestbackuprestoretooriginal/backuprestore_testbackuprestoretooriginal/zk_backup_0/
s3:/mytestbackuptestbackuprestoretooriginal/backuprestore_testbackuprestoretooriginal/zk_backup_0/configs/
s3:/mytestbackuptestbackuprestoretooriginal/backuprestore_testbackuprestoretooriginal/zk_backup_0/configs/conf1/
s3:/mytestbackuptestskipconfigset/backuprestore_testskipconfigset/zk_backup_0/

Stack Trace:
java.lang.AssertionError: Configset shouldn't be part of the backup but found:
s3:/mytestbackuptestskipconfigset/
s3:/mytestbackuptestskipconfigset/backuprestore_testskipconfigset/
s3:/mytestbackuptestskipconfigset/backuprestore_testskipconfigset/
s3:/mytestbackuptestskipconfigset/backuprestore_testskipconfigset/index/
s3:/mytestbackuptestskipconfigset/backuprestore_testskipconfigset/shard_backup_metadata/
s3:/mytestbackuptestskipconfigset/backuprestore_testskipconfigset/
s3:/mytestbackuptestskipconfigset/backuprestore_testskipconfigset/
s3:/mytestbackuptestbackuprestoretooriginal/backuprestore_testbackuprestoretooriginal/zk_backup_0/
s3:/mytestbackuptestbackuprestoretooriginal/backuprestore_testbackuprestoretooriginal/zk_backup_0/configs/
s3:/mytestbackuptestbackuprestoretooriginal/backuprestore_testbackuprestoretooriginal/zk_backup_0/configs/conf1/
s3:/mytestbackuptestskipconfigset/backuprestore_testskipconfigset/zk_backup_0/
	at __randomizedtesting.SeedInfo.seed([4291B8E2FDFF8196:496827EB65BDD781]:0)
	at org.junit.Assert.fail(Assert.java:89)
	at org.junit.Assert.assertTrue(Assert.java:42)
	at org.junit.Assert.assertFalse(Assert.java:65)
	at org.apache.solr.cloud.api.collections.AbstractIncrementalBackupTest.testSkipConfigset(AbstractIncrementalBackupTest.java:375)
	at java.base/jdk.internal.reflect.DirectMethodHandleAccessor.invoke(DirectMethodHandleAccessor.java:103)
	at java.base/java.lang.reflect.Method.invoke(Method.java:580)
	at com.carrotsearch.randomizedtesting.RandomizedRunner.invoke(RandomizedRunner.java:1758)
	at com.carrotsearch.randomizedtesting.RandomizedRunner$8.evaluate(RandomizedRunner.java:946)
	at com.carrotsearch.randomizedtesting.RandomizedRunner$9.evaluate(RandomizedRunner.java:982)
	at com.carrotsearch.randomizedtesting.RandomizedRunner$10.evaluate(RandomizedRunner.java:996)
	at com.carrotsearch.randomizedtesting.rules.SystemPropertiesRestoreRule$1.evaluate(SystemPropertiesRestoreRule.java:80)
	at org.junit.rules.RunRules.evaluate(RunRules.java:20)
	at org.apache.lucene.tests.util.TestRuleSetupTeardownChained$1.evaluate(TestRuleSetupTeardownChained.java:48)
	at org.apache.lucene.tests.util.AbstractBeforeAfterRule$1.evaluate(AbstractBeforeAfterRule.java:43)
	at org.apache.lucene.tests.util.TestRuleThreadAndTestName$1.evaluate(TestRuleThreadAndTestName.java:45)
	at org.apache.lucene.tests.util.TestRuleIgnoreAfterMaxFailures$1.evaluate(TestRuleIgnoreAfterMaxFailures.java:60)
	at org.apache.lucene.tests.util.TestRuleMarkFailure$1.evaluate(TestRuleMarkFailure.java:44)
	at org.junit.rules.RunRules.evaluate(RunRules.java:20)
	at com.carrotsearch.randomizedtesting.rules.StatementAdapter.evaluate(StatementAdapter.java:36)
	at com.carrotsearch.randomizedtesting.ThreadLeakControl$StatementRunner.run(ThreadLeakControl.java:390)
	at com.carrotsearch.randomizedtesting.ThreadLeakControl.forkTimeoutingTask(ThreadLeakControl.java:843)
	at com.carrotsearch.randomizedtesting.ThreadLeakControl$3.evaluate(ThreadLeakControl.java:490)
	at com.carrotsearch.randomizedtesting.RandomizedRunner.runSingleTest(RandomizedRunner.java:955)
	at com.carrotsearch.randomizedtesting.RandomizedRunner$5.evaluate(RandomizedRunner.java:840)
	at com.carrotsearch.randomizedtesting.RandomizedRunner$6.evaluate(RandomizedRunner.java:891)
	at com.carrotsearch.randomizedtesting.RandomizedRunner$7.evaluate(RandomizedRunner.java:902)
	at com.adobe.testing.s3mock.junit4.S3MockRule$1.evaluate(S3MockRule.java:66)
	at com.carrotsearch.randomizedtesting.rules.StatementAdapter.evaluate(StatementAdapter.java:36)
	at com.carrotsearch.randomizedtesting.rules.StatementAdapter.evaluate(StatementAdapter.java:36)
	at org.apache.lucene.tests.util.AbstractBeforeAfterRule$1.evaluate(AbstractBeforeAfterRule.java:43)
	at com.carrotsearch.randomizedtesting.rules.SystemPropertiesRestoreRule$1.evaluate(SystemPropertiesRestoreRule.java:80)
	at org.junit.rules.RunRules.evaluate(RunRules.java:20)
	at org.apache.lucene.tests.util.AbstractBeforeAfterRule$1.evaluate(AbstractBeforeAfterRule.java:43)
	at com.carrotsearch.randomizedtesting.rules.StatementAdapter.evaluate(StatementAdapter.java:36)
	at org.apache.lucene.tests.util.TestRuleStoreClassName$1.evaluate(TestRuleStoreClassName.java:38)
	at com.carrotsearch.randomizedtesting.rules.NoShadowingOrOverridesOnMethodsRule$1.evaluate(NoShadowingOrOverridesOnMethodsRule.java:40)
	at com.carrotsearch.randomizedtesting.rules.NoShadowingOrOverridesOnMethodsRule$1.evaluate(NoShadowingOrOverridesOnMethodsRule.java:40)
	at com.carrotsearch.randomizedtesting.rules.StatementAdapter.evaluate(StatementAdapter.java:36)
	at com.carrotsearch.randomizedtesting.rules.StatementAdapter.evaluate(StatementAdapter.java:36)
	at org.apache.lucene.tests.util.TestRuleAssertionsRequired$1.evaluate(TestRuleAssertionsRequired.java:53)
	at org.apache.lucene.tests.util.AbstractBeforeAfterRule$1.evaluate(AbstractBeforeAfterRule.java:43)
	at org.apache.lucene.tests.util.TestRuleMarkFailure$1.evaluate(TestRuleMarkFailure.java:44)
	at org.apache.lucene.tests.util.TestRuleIgnoreAfterMaxFailures$1.evaluate(TestRuleIgnoreAfterMaxFailures.java:60)
	at org.apache.lucene.tests.util.TestRuleIgnoreTestSuites$1.evaluate(TestRuleIgnoreTestSuites.java:47)
	at org.junit.rules.RunRules.evaluate(RunRules.java:20)
	at com.carrotsearch.randomizedtesting.rules.StatementAdapter.evaluate(StatementAdapter.java:36)
	at com.carrotsearch.randomizedtesting.ThreadLeakControl$StatementRunner.run(ThreadLeakControl.java:390)
	at com.carrotsearch.randomizedtesting.ThreadLeakControl.lambda$forkTimeoutingTask$0(ThreadLeakControl.java:850)
	at java.base/java.lang.Thread.run(Thread.java:1583)


FAILED:  org.apache.solr.core.TestConfigSetService.classMethod

Error Message:
java.lang.RuntimeException: file handle leaks: [InputStream(/Users/jenkins/workspace/Solr-main-MacOSX/solr/core/build/tmp/tests-tmp/solr.core.TestConfigSetService_4291B8E2FDFF8196-001/testconfig-002/solrconfig.xml), InputStream(/Users/jenkins/workspace/Solr-main-MacOSX/solr/core/build/tmp/tests-tmp/solr.core.TestConfigSetService_4291B8E2FDFF8196-001/testconfig-002/subdir/file3), InputStream(/Users/jenkins/workspace/Solr-main-MacOSX/solr/core/build/tmp/tests-tmp/solr.core.TestConfigSetService_4291B8E2FDFF8196-001/testconfig-002/file2), InputStream(/Users/jenkins/workspace/Solr-main-MacOSX/solr/core/build/tmp/tests-tmp/solr.core.TestConfigSetService_4291B8E2FDFF8196-001/testconfig-002/file1), InputStream(/Users/jenkins/workspace/Solr-main-MacOSX/solr/core/build/tmp/tests-tmp/solr.core.TestConfigSetService_4291B8E2FDFF8196-001/configsets-001/testconfig/.metadata.json), InputStream(/Users/jenkins/workspace/Solr-main-MacOSX/solr/core/build/tmp/tests-tmp/solr.core.TestConfigSetService_4291B8E2FDFF8196-001/configsets-001/testconfig/subdir/file3), InputStream(/Users/jenkins/workspace/Solr-main-MacOSX/solr/core/build/tmp/tests-tmp/solr.core.TestConfigSetService_4291B8E2FDFF8196-001/configsets-001/testconfig/file1), InputStream(/Users/jenkins/workspace/Solr-main-MacOSX/solr/core/build/tmp/tests-tmp/solr.core.TestConfigSetService_4291B8E2FDFF8196-001/configsets-001/testconfig/solrconfig.xml), InputStream(/Users/jenkins/workspace/Solr-main-MacOSX/solr/core/build/tmp/tests-tmp/solr.core.TestConfigSetService_4291B8E2FDFF8196-001/configsets-001/testconfig/file2), InputStream(/Users/jenkins/workspace/Solr-main-MacOSX/solr/core/build/tmp/tests-tmp/solr.core.TestConfigSetService_4291B8E2FDFF8196-001/configsets-001/testconfig/subdir/file4)]

Stack Trace:
java.lang.RuntimeException: file handle leaks: [InputStream(/Users/jenkins/workspace/Solr-main-MacOSX/solr/core/build/tmp/tests-tmp/solr.core.TestConfigSetService_4291B8E2FDFF8196-001/testconfig-002/solrconfig.xml), InputStream(/Users/jenkins/workspace/Solr-main-MacOSX/solr/core/build/tmp/tests-tmp/solr.core.TestConfigSetService_4291B8E2FDFF8196-001/testconfig-002/subdir/file3), InputStream(/Users/jenkins/workspace/Solr-main-MacOSX/solr/core/build/tmp/tests-tmp/solr.core.TestConfigSetService_4291B8E2FDFF8196-001/testconfig-002/file2), InputStream(/Users/jenkins/workspace/Solr-main-MacOSX/solr/core/build/tmp/tests-tmp/solr.core.TestConfigSetService_4291B8E2FDFF8196-001/testconfig-002/file1), InputStream(/Users/jenkins/workspace/Solr-main-MacOSX/solr/core/build/tmp/tests-tmp/solr.core.TestConfigSetService_4291B8E2FDFF8196-001/configsets-001/testconfig/.metadata.json), InputStream(/Users/jenkins/workspace/Solr-main-MacOSX/solr/core/build/tmp/tests-tmp/solr.core.TestConfigSetService_4291B8E2FDFF8196-001/configsets-001/testconfig/subdir/file3), InputStream(/Users/jenkins/workspace/Solr-main-MacOSX/solr/core/build/tmp/tests-tmp/solr.core.TestConfigSetService_4291B8E2FDFF8196-001/configsets-001/testconfig/file1), InputStream(/Users/jenkins/workspace/Solr-main-MacOSX/solr/core/build/tmp/tests-tmp/solr.core.TestConfigSetService_4291B8E2FDFF8196-001/configsets-001/testconfig/solrconfig.xml), InputStream(/Users/jenkins/workspace/Solr-main-MacOSX/solr/core/build/tmp/tests-tmp/solr.core.TestConfigSetService_4291B8E2FDFF8196-001/configsets-001/testconfig/file2), InputStream(/Users/jenkins/workspace/Solr-main-MacOSX/solr/core/build/tmp/tests-tmp/solr.core.TestConfigSetService_4291B8E2FDFF8196-001/configsets-001/testconfig/subdir/file4)]
	at __randomizedtesting.SeedInfo.seed([4291B8E2FDFF8196]:0)
	at org.apache.lucene.tests.mockfile.LeakFS.onClose(LeakFS.java:63)
	at org.apache.lucene.tests.mockfile.FilterFileSystem.close(FilterFileSystem.java:69)
	at org.apache.lucene.tests.mockfile.FilterFileSystem.close(FilterFileSystem.java:70)
	at org.apache.lucene.tests.util.TestRuleTemporaryFilesCleanup.afterAlways(TestRuleTemporaryFilesCleanup.java:223)
	at com.carrotsearch.randomizedtesting.rules.TestRuleAdapter$1.afterAlways(TestRuleAdapter.java:31)
	at com.carrotsearch.randomizedtesting.rules.StatementAdapter.evaluate(StatementAdapter.java:43)
	at com.carrotsearch.randomizedtesting.rules.StatementAdapter.evaluate(StatementAdapter.java:36)
	at org.apache.lucene.tests.util.TestRuleAssertionsRequired$1.evaluate(TestRuleAssertionsRequired.java:53)
	at org.apache.lucene.tests.util.AbstractBeforeAfterRule$1.evaluate(AbstractBeforeAfterRule.java:43)
	at org.apache.lucene.tests.util.TestRuleMarkFailure$1.evaluate(TestRuleMarkFailure.java:44)
	at org.apache.lucene.tests.util.TestRuleIgnoreAfterMaxFailures$1.evaluate(TestRuleIgnoreAfterMaxFailures.java:60)
	at org.apache.lucene.tests.util.TestRuleIgnoreTestSuites$1.evaluate(TestRuleIgnoreTestSuites.java:47)
	at org.junit.rules.RunRules.evaluate(RunRules.java:20)
	at com.carrotsearch.randomizedtesting.rules.StatementAdapter.evaluate(StatementAdapter.java:36)
	at com.carrotsearch.randomizedtesting.ThreadLeakControl$StatementRunner.run(ThreadLeakControl.java:390)
	at com.carrotsearch.randomizedtesting.ThreadLeakControl.lambda$forkTimeoutingTask$0(ThreadLeakControl.java:850)
	at java.base/java.lang.Thread.run(Thread.java:1583)
Caused by: java.lang.Exception
	at org.apache.lucene.tests.mockfile.LeakFS.onOpen(LeakFS.java:46)
	at org.apache.lucene.tests.mockfile.HandleTrackingFS.callOpenHook(HandleTrackingFS.java:82)
	at org.apache.lucene.tests.mockfile.HandleTrackingFS.newInputStream(HandleTrackingFS.java:125)
	at org.apache.lucene.tests.mockfile.FilterFileSystemProvider.newInputStream(FilterFileSystemProvider.java:193)
	at org.apache.lucene.tests.mockfile.HandleTrackingFS.newInputStream(HandleTrackingFS.java:94)
	at java.base/java.nio.file.Files.newInputStream(Files.java:159)
	at org.apache.solr.core.FileSystemConfigSetService$2.visitFile(FileSystemConfigSetService.java:217)
	at org.apache.solr.core.FileSystemConfigSetService$2.visitFile(FileSystemConfigSetService.java:201)
	at java.base/java.nio.file.Files.walkFileTree(Files.java:2786)
	at java.base/java.nio.file.Files.walkFileTree(Files.java:2857)
	at org.apache.solr.core.FileSystemConfigSetService.copyRecursively(FileSystemConfigSetService.java:199)
	at org.apache.solr.core.FileSystemConfigSetService.uploadConfig(FileSystemConfigSetService.java:144)
	at org.apache.solr.core.TestConfigSetService.testConfigSetServiceOperations(TestConfigSetService.java:81)
	at java.base/jdk.internal.reflect.DirectMethodHandleAccessor.invoke(DirectMethodHandleAccessor.java:103)
	at java.base/java.lang.reflect.Method.invoke(Method.java:580)
	at com.carrotsearch.randomizedtesting.RandomizedRunner.invoke(RandomizedRunner.java:1758)
	at com.carrotsearch.randomizedtesting.RandomizedRunner$8.evaluate(RandomizedRunner.java:946)
	at com.carrotsearch.randomizedtesting.RandomizedRunner$9.evaluate(RandomizedRunner.java:982)
	at com.carrotsearch.randomizedtesting.RandomizedRunner$10.evaluate(RandomizedRunner.java:996)
	at com.carrotsearch.randomizedtesting.rules.SystemPropertiesRestoreRule$1.evaluate(SystemPropertiesRestoreRule.java:80)
	at org.junit.rules.RunRules.evaluate(RunRules.java:20)
	at org.apache.lucene.tests.util.TestRuleSetupTeardownChained$1.evaluate(TestRuleSetupTeardownChained.java:48)
	at org.apache.lucene.tests.util.AbstractBeforeAfterRule$1.evaluate(AbstractBeforeAfterRule.java:43)
	at org.apache.lucene.tests.util.TestRuleThreadAndTestName$1.evaluate(TestRuleThreadAndTestName.java:45)
	at org.apache.lucene.tests.util.TestRuleIgnoreAfterMaxFailures$1.evaluate(TestRuleIgnoreAfterMaxFailures.java:60)
	at org.apache.lucene.tests.util.TestRuleMarkFailure$1.evaluate(TestRuleMarkFailure.java:44)
	at org.junit.rules.RunRules.evaluate(RunRules.java:20)
	at com.carrotsearch.randomizedtesting.rules.StatementAdapter.evaluate(StatementAdapter.java:36)
	at com.carrotsearch.randomizedtesting.ThreadLeakControl$StatementRunner.run(ThreadLeakControl.java:390)
	at com.carrotsearch.randomizedtesting.ThreadLeakControl.forkTimeoutingTask(ThreadLeakControl.java:843)
	at com.carrotsearch.randomizedtesting.ThreadLeakControl$3.evaluate(ThreadLeakControl.java:490)
	at com.carrotsearch.randomizedtesting.RandomizedRunner.runSingleTest(RandomizedRunner.java:955)
	at com.carrotsearch.randomizedtesting.RandomizedRunner$5.evaluate(RandomizedRunner.java:840)
	at com.carrotsearch.randomizedtesting.RandomizedRunner$6.evaluate(RandomizedRunner.java:891)
	at com.carrotsearch.randomizedtesting.RandomizedRunner$7.evaluate(RandomizedRunner.java:902)
	at com.carrotsearch.randomizedtesting.rules.StatementAdapter.evaluate(StatementAdapter.java:36)
	at com.carrotsearch.randomizedtesting.rules.StatementAdapter.evaluate(StatementAdapter.java:36)
	at org.apache.lucene.tests.util.AbstractBeforeAfterRule$1.evaluate(AbstractBeforeAfterRule.java:43)
	at com.carrotsearch.randomizedtesting.rules.SystemPropertiesRestoreRule$1.evaluate(SystemPropertiesRestoreRule.java:80)
	at org.junit.rules.RunRules.evaluate(RunRules.java:20)
	at org.apache.lucene.tests.util.AbstractBeforeAfterRule$1.evaluate(AbstractBeforeAfterRule.java:43)
	at com.carrotsearch.randomizedtesting.rules.StatementAdapter.evaluate(StatementAdapter.java:36)
	at org.apache.lucene.tests.util.TestRuleStoreClassName$1.evaluate(TestRuleStoreClassName.java:38)
	at com.carrotsearch.randomizedtesting.rules.NoShadowingOrOverridesOnMethodsRule$1.evaluate(NoShadowingOrOverridesOnMethodsRule.java:40)
	at com.carrotsearch.randomizedtesting.rules.NoShadowingOrOverridesOnMethodsRule$1.evaluate(NoShadowingOrOverridesOnMethodsRule.java:40)
	at com.carrotsearch.randomizedtesting.rules.StatementAdapter.evaluate(StatementAdapter.java:36)
	... 11 more


FAILED:  org.apache.solr.core.TestFileSystemConfigSetService.classMethod

Error Message:
java.lang.RuntimeException: file handle leaks: [InputStream(/Users/jenkins/workspace/Solr-main-MacOSX/solr/core/build/tmp/tests-tmp/solr.core.TestFileSystemConfigSetService_4291B8E2FDFF8196-001/tempDir-001/testconfig/solrconfig.xml), InputStream(/Users/jenkins/workspace/Solr-main-MacOSX/solr/core/build/tmp/tests-tmp/solr.core.TestFileSystemConfigSetService_4291B8E2FDFF8196-001/tempDir-001/testconfig/schema.xml), InputStream(/Users/jenkins/workspace/Solr-main-MacOSX/solr/core/build/tmp/tests-tmp/solr.core.TestFileSystemConfigSetService_4291B8E2FDFF8196-001/tempDir-001/testconfig/solrconfig.xml), InputStream(/Users/jenkins/workspace/Solr-main-MacOSX/solr/core/build/tmp/tests-tmp/solr.core.TestFileSystemConfigSetService_4291B8E2FDFF8196-001/tempDir-001/testconfig/schema.xml)]

Stack Trace:
java.lang.RuntimeException: file handle leaks: [InputStream(/Users/jenkins/workspace/Solr-main-MacOSX/solr/core/build/tmp/tests-tmp/solr.core.TestFileSystemConfigSetService_4291B8E2FDFF8196-001/tempDir-001/testconfig/solrconfig.xml), InputStream(/Users/jenkins/workspace/Solr-main-MacOSX/solr/core/build/tmp/tests-tmp/solr.core.TestFileSystemConfigSetService_4291B8E2FDFF8196-001/tempDir-001/testconfig/schema.xml), InputStream(/Users/jenkins/workspace/Solr-main-MacOSX/solr/core/build/tmp/tests-tmp/solr.core.TestFileSystemConfigSetService_4291B8E2FDFF8196-001/tempDir-001/testconfig/solrconfig.xml), InputStream(/Users/jenkins/workspace/Solr-main-MacOSX/solr/core/build/tmp/tests-tmp/solr.core.TestFileSystemConfigSetService_4291B8E2FDFF8196-001/tempDir-001/testconfig/schema.xml)]
	at __randomizedtesting.SeedInfo.seed([4291B8E2FDFF8196]:0)
	at org.apache.lucene.tests.mockfile.LeakFS.onClose(LeakFS.java:63)
	at org.apache.lucene.tests.mockfile.FilterFileSystem.close(FilterFileSystem.java:69)
	at org.apache.lucene.tests.mockfile.FilterFileSystem.close(FilterFileSystem.java:70)
	at org.apache.lucene.tests.util.TestRuleTemporaryFilesCleanup.afterAlways(TestRuleTemporaryFilesCleanup.java:223)
	at com.carrotsearch.randomizedtesting.rules.TestRuleAdapter$1.afterAlways(TestRuleAdapter.java:31)
	at com.carrotsearch.randomizedtesting.rules.StatementAdapter.evaluate(StatementAdapter.java:43)
	at com.carrotsearch.randomizedtesting.rules.StatementAdapter.evaluate(StatementAdapter.java:36)
	at org.apache.lucene.tests.util.TestRuleAssertionsRequired$1.evaluate(TestRuleAssertionsRequired.java:53)
	at org.apache.lucene.tests.util.AbstractBeforeAfterRule$1.evaluate(AbstractBeforeAfterRule.java:43)
	at org.apache.lucene.tests.util.TestRuleMarkFailure$1.evaluate(TestRuleMarkFailure.java:44)
	at org.apache.lucene.tests.util.TestRuleIgnoreAfterMaxFailures$1.evaluate(TestRuleIgnoreAfterMaxFailures.java:60)
	at org.apache.lucene.tests.util.TestRuleIgnoreTestSuites$1.evaluate(TestRuleIgnoreTestSuites.java:47)
	at org.junit.rules.RunRules.evaluate(RunRules.java:20)
	at com.carrotsearch.randomizedtesting.rules.StatementAdapter.evaluate(StatementAdapter.java:36)
	at com.carrotsearch.randomizedtesting.ThreadLeakControl$StatementRunner.run(ThreadLeakControl.java:390)
	at com.carrotsearch.randomizedtesting.ThreadLeakControl.lambda$forkTimeoutingTask$0(ThreadLeakControl.java:850)
	at java.base/java.lang.Thread.run(Thread.java:1583)
Caused by: java.lang.Exception
	at org.apache.lucene.tests.mockfile.LeakFS.onOpen(LeakFS.java:46)
	at org.apache.lucene.tests.mockfile.HandleTrackingFS.callOpenHook(HandleTrackingFS.java:82)
	at org.apache.lucene.tests.mockfile.HandleTrackingFS.newInputStream(HandleTrackingFS.java:125)
	at org.apache.lucene.tests.mockfile.FilterFileSystemProvider.newInputStream(FilterFileSystemProvider.java:193)
	at org.apache.lucene.tests.mockfile.HandleTrackingFS.newInputStream(HandleTrackingFS.java:94)
	at java.base/java.nio.file.Files.newInputStream(Files.java:159)
	at org.apache.solr.core.FileSystemConfigSetService$2.visitFile(FileSystemConfigSetService.java:217)
	at org.apache.solr.core.FileSystemConfigSetService$2.visitFile(FileSystemConfigSetService.java:201)
	at java.base/java.nio.file.Files.walkFileTree(Files.java:2786)
	at java.base/java.nio.file.Files.walkFileTree(Files.java:2857)
	at org.apache.solr.core.FileSystemConfigSetService.copyRecursively(FileSystemConfigSetService.java:199)
	at org.apache.solr.core.FileSystemConfigSetService.copyConfig(FileSystemConfigSetService.java:114)
	at org.apache.solr.core.TestFileSystemConfigSetService.testUploadAndDeleteConfig(TestFileSystemConfigSetService.java:79)
	at java.base/jdk.internal.reflect.DirectMethodHandleAccessor.invoke(DirectMethodHandleAccessor.java:103)
	at java.base/java.lang.reflect.Method.invoke(Method.java:580)
	at com.carrotsearch.randomizedtesting.RandomizedRunner.invoke(RandomizedRunner.java:1758)
	at com.carrotsearch.randomizedtesting.RandomizedRunner$8.evaluate(RandomizedRunner.java:946)
	at com.carrotsearch.randomizedtesting.RandomizedRunner$9.evaluate(RandomizedRunner.java:982)
	at com.carrotsearch.randomizedtesting.RandomizedRunner$10.evaluate(RandomizedRunner.java:996)
	at com.carrotsearch.randomizedtesting.rules.SystemPropertiesRestoreRule$1.evaluate(SystemPropertiesRestoreRule.java:80)
	at org.junit.rules.RunRules.evaluate(RunRules.java:20)
	at org.apache.lucene.tests.util.TestRuleSetupTeardownChained$1.evaluate(TestRuleSetupTeardownChained.java:48)
	at org.apache.lucene.tests.util.AbstractBeforeAfterRule$1.evaluate(AbstractBeforeAfterRule.java:43)
	at org.apache.lucene.tests.util.TestRuleThreadAndTestName$1.evaluate(TestRuleThreadAndTestName.java:45)
	at org.apache.lucene.tests.util.TestRuleIgnoreAfterMaxFailures$1.evaluate(TestRuleIgnoreAfterMaxFailures.java:60)
	at org.apache.lucene.tests.util.TestRuleMarkFailure$1.evaluate(TestRuleMarkFailure.java:44)
	at org.junit.rules.RunRules.evaluate(RunRules.java:20)
	at com.carrotsearch.randomizedtesting.rules.StatementAdapter.evaluate(StatementAdapter.java:36)
	at com.carrotsearch.randomizedtesting.ThreadLeakControl$StatementRunner.run(ThreadLeakControl.java:390)
	at com.carrotsearch.randomizedtesting.ThreadLeakControl.forkTimeoutingTask(ThreadLeakControl.java:843)
	at com.carrotsearch.randomizedtesting.ThreadLeakControl$3.evaluate(ThreadLeakControl.java:490)
	at com.carrotsearch.randomizedtesting.RandomizedRunner.runSingleTest(RandomizedRunner.java:955)
	at com.carrotsearch.randomizedtesting.RandomizedRunner$5.evaluate(RandomizedRunner.java:840)
	at com.carrotsearch.randomizedtesting.RandomizedRunner$6.evaluate(RandomizedRunner.java:891)
	at com.carrotsearch.randomizedtesting.RandomizedRunner$7.evaluate(RandomizedRunner.java:902)
	at com.carrotsearch.randomizedtesting.rules.StatementAdapter.evaluate(StatementAdapter.java:36)
	at com.carrotsearch.randomizedtesting.rules.StatementAdapter.evaluate(StatementAdapter.java:36)
	at org.apache.lucene.tests.util.AbstractBeforeAfterRule$1.evaluate(AbstractBeforeAfterRule.java:43)
	at com.carrotsearch.randomizedtesting.rules.SystemPropertiesRestoreRule$1.evaluate(SystemPropertiesRestoreRule.java:80)
	at org.junit.rules.RunRules.evaluate(RunRules.java:20)
	at org.apache.lucene.tests.util.AbstractBeforeAfterRule$1.evaluate(AbstractBeforeAfterRule.java:43)
	at com.carrotsearch.randomizedtesting.rules.StatementAdapter.evaluate(StatementAdapter.java:36)
	at org.apache.lucene.tests.util.TestRuleStoreClassName$1.evaluate(TestRuleStoreClassName.java:38)
	at com.carrotsearch.randomizedtesting.rules.NoShadowingOrOverridesOnMethodsRule$1.evaluate(NoShadowingOrOverridesOnMethodsRule.java:40)
	at com.carrotsearch.randomizedtesting.rules.NoShadowingOrOverridesOnMethodsRule$1.evaluate(NoShadowingOrOverridesOnMethodsRule.java:40)
	at com.carrotsearch.randomizedtesting.rules.StatementAdapter.evaluate(StatementAdapter.java:36)
	... 11 more

[JENKINS] Solr-main-MacOSX (64bit/hotspot/jdk-11.0.21) - Build # 3701 - Still unstable!

Posted by Policeman Jenkins Server <je...@thetaphi.de>.
Build: https://jenkins.thetaphi.de/job/Solr-main-MacOSX/3701/
Java: 64bit/hotspot/jdk-11.0.21 -XX:+UseCompressedOops -XX:+UseParallelGC

5 tests failed.
FAILED:  org.apache.solr.cloud.HttpPartitionOnCommitTest.test

Error Message:
org.apache.solr.client.solrj.impl.BaseHttpSolrClient$RemoteSolrException: Error from server at http://127.0.0.1:52000/solr: Underlying core creation failed while creating collection: control_collection

Stack Trace:
org.apache.solr.client.solrj.impl.BaseHttpSolrClient$RemoteSolrException: Error from server at http://127.0.0.1:52000/solr: Underlying core creation failed while creating collection: control_collection
	at __randomizedtesting.SeedInfo.seed([33AF2439C0E61A77:BBFB1BE36E1A778F]:0)
	at app//org.apache.solr.client.solrj.impl.HttpSolrClient.executeMethod(HttpSolrClient.java:734)
	at app//org.apache.solr.client.solrj.impl.HttpSolrClient.request(HttpSolrClient.java:253)
	at app//org.apache.solr.client.solrj.impl.HttpSolrClient.request(HttpSolrClient.java:234)
	at app//org.apache.solr.client.solrj.impl.LBSolrClient.doRequest(LBSolrClient.java:389)
	at app//org.apache.solr.client.solrj.impl.LBSolrClient.request(LBSolrClient.java:352)
	at app//org.apache.solr.client.solrj.impl.CloudSolrClient.sendRequest(CloudSolrClient.java:1136)
	at app//org.apache.solr.client.solrj.impl.CloudSolrClient.requestWithRetryOnStaleState(CloudSolrClient.java:835)
	at app//org.apache.solr.client.solrj.impl.CloudSolrClient.request(CloudSolrClient.java:766)
	at app//org.apache.solr.client.solrj.SolrRequest.process(SolrRequest.java:216)
	at app//org.apache.solr.client.solrj.SolrRequest.process(SolrRequest.java:231)
	at app//org.apache.solr.cloud.AbstractFullDistribZkTestBase.createServers(AbstractFullDistribZkTestBase.java:353)
	at app//org.apache.solr.BaseDistributedSearchTestCase$ShardsRepeatRule$ShardsFixedStatement.callStatement(BaseDistributedSearchTestCase.java:1077)
	at app//org.apache.solr.BaseDistributedSearchTestCase$ShardsRepeatRule$ShardsStatement.evaluate(BaseDistributedSearchTestCase.java:1050)
	at app//com.carrotsearch.randomizedtesting.rules.SystemPropertiesRestoreRule$1.evaluate(SystemPropertiesRestoreRule.java:80)
	at app//org.junit.rules.RunRules.evaluate(RunRules.java:20)
	at app//org.apache.lucene.tests.util.TestRuleSetupTeardownChained$1.evaluate(TestRuleSetupTeardownChained.java:48)
	at app//org.apache.lucene.tests.util.AbstractBeforeAfterRule$1.evaluate(AbstractBeforeAfterRule.java:43)
	at app//org.apache.lucene.tests.util.TestRuleThreadAndTestName$1.evaluate(TestRuleThreadAndTestName.java:45)
	at app//org.apache.lucene.tests.util.TestRuleIgnoreAfterMaxFailures$1.evaluate(TestRuleIgnoreAfterMaxFailures.java:60)
	at app//org.apache.lucene.tests.util.TestRuleMarkFailure$1.evaluate(TestRuleMarkFailure.java:44)
	at app//org.junit.rules.RunRules.evaluate(RunRules.java:20)
	at app//com.carrotsearch.randomizedtesting.rules.StatementAdapter.evaluate(StatementAdapter.java:36)
	at app//com.carrotsearch.randomizedtesting.ThreadLeakControl$StatementRunner.run(ThreadLeakControl.java:390)
	at app//com.carrotsearch.randomizedtesting.ThreadLeakControl.forkTimeoutingTask(ThreadLeakControl.java:843)
	at app//com.carrotsearch.randomizedtesting.ThreadLeakControl$3.evaluate(ThreadLeakControl.java:490)
	at app//com.carrotsearch.randomizedtesting.RandomizedRunner.runSingleTest(RandomizedRunner.java:955)
	at app//com.carrotsearch.randomizedtesting.RandomizedRunner$5.evaluate(RandomizedRunner.java:840)
	at app//com.carrotsearch.randomizedtesting.RandomizedRunner$6.evaluate(RandomizedRunner.java:891)
	at app//com.carrotsearch.randomizedtesting.RandomizedRunner$7.evaluate(RandomizedRunner.java:902)
	at app//com.carrotsearch.randomizedtesting.rules.StatementAdapter.evaluate(StatementAdapter.java:36)
	at app//com.carrotsearch.randomizedtesting.rules.StatementAdapter.evaluate(StatementAdapter.java:36)
	at app//org.apache.lucene.tests.util.AbstractBeforeAfterRule$1.evaluate(AbstractBeforeAfterRule.java:43)
	at app//com.carrotsearch.randomizedtesting.rules.SystemPropertiesRestoreRule$1.evaluate(SystemPropertiesRestoreRule.java:80)
	at app//org.junit.rules.RunRules.evaluate(RunRules.java:20)
	at app//org.apache.lucene.tests.util.AbstractBeforeAfterRule$1.evaluate(AbstractBeforeAfterRule.java:43)
	at app//com.carrotsearch.randomizedtesting.rules.StatementAdapter.evaluate(StatementAdapter.java:36)
	at app//org.apache.lucene.tests.util.TestRuleStoreClassName$1.evaluate(TestRuleStoreClassName.java:38)
	at app//com.carrotsearch.randomizedtesting.rules.NoShadowingOrOverridesOnMethodsRule$1.evaluate(NoShadowingOrOverridesOnMethodsRule.java:40)
	at app//com.carrotsearch.randomizedtesting.rules.NoShadowingOrOverridesOnMethodsRule$1.evaluate(NoShadowingOrOverridesOnMethodsRule.java:40)
	at app//com.carrotsearch.randomizedtesting.rules.StatementAdapter.evaluate(StatementAdapter.java:36)
	at app//com.carrotsearch.randomizedtesting.rules.StatementAdapter.evaluate(StatementAdapter.java:36)
	at app//org.apache.lucene.tests.util.TestRuleAssertionsRequired$1.evaluate(TestRuleAssertionsRequired.java:53)
	at app//org.apache.lucene.tests.util.AbstractBeforeAfterRule$1.evaluate(AbstractBeforeAfterRule.java:43)
	at app//org.apache.lucene.tests.util.TestRuleMarkFailure$1.evaluate(TestRuleMarkFailure.java:44)
	at app//org.apache.lucene.tests.util.TestRuleIgnoreAfterMaxFailures$1.evaluate(TestRuleIgnoreAfterMaxFailures.java:60)
	at app//org.apache.lucene.tests.util.TestRuleIgnoreTestSuites$1.evaluate(TestRuleIgnoreTestSuites.java:47)
	at app//org.junit.rules.RunRules.evaluate(RunRules.java:20)
	at app//com.carrotsearch.randomizedtesting.rules.StatementAdapter.evaluate(StatementAdapter.java:36)
	at app//com.carrotsearch.randomizedtesting.ThreadLeakControl$StatementRunner.run(ThreadLeakControl.java:390)
	at app//com.carrotsearch.randomizedtesting.ThreadLeakControl.lambda$forkTimeoutingTask$0(ThreadLeakControl.java:850)
	at java.base@11.0.21/java.lang.Thread.run(Thread.java:829)


FAILED:  org.apache.solr.cloud.PeerSyncReplicationTest.test

Error Message:
java.lang.AssertionError: expected:<154> but was:<152>

Stack Trace:
java.lang.AssertionError: expected:<154> but was:<152>
	at __randomizedtesting.SeedInfo.seed([33AF2439C0E61A77:BBFB1BE36E1A778F]:0)
	at org.junit.Assert.fail(Assert.java:89)
	at org.junit.Assert.failNotEquals(Assert.java:835)
	at org.junit.Assert.assertEquals(Assert.java:647)
	at org.junit.Assert.assertEquals(Assert.java:633)
	at org.apache.solr.cloud.PeerSyncReplicationTest.test(PeerSyncReplicationTest.java:145)
	at java.base/jdk.internal.reflect.NativeMethodAccessorImpl.invoke0(Native Method)
	at java.base/jdk.internal.reflect.NativeMethodAccessorImpl.invoke(NativeMethodAccessorImpl.java:62)
	at java.base/jdk.internal.reflect.DelegatingMethodAccessorImpl.invoke(DelegatingMethodAccessorImpl.java:43)
	at java.base/java.lang.reflect.Method.invoke(Method.java:566)
	at com.carrotsearch.randomizedtesting.RandomizedRunner.invoke(RandomizedRunner.java:1758)
	at com.carrotsearch.randomizedtesting.RandomizedRunner$8.evaluate(RandomizedRunner.java:946)
	at com.carrotsearch.randomizedtesting.RandomizedRunner$9.evaluate(RandomizedRunner.java:982)
	at com.carrotsearch.randomizedtesting.RandomizedRunner$10.evaluate(RandomizedRunner.java:996)
	at org.apache.solr.BaseDistributedSearchTestCase$ShardsRepeatRule$ShardsFixedStatement.callStatement(BaseDistributedSearchTestCase.java:1079)
	at org.apache.solr.BaseDistributedSearchTestCase$ShardsRepeatRule$ShardsStatement.evaluate(BaseDistributedSearchTestCase.java:1050)
	at com.carrotsearch.randomizedtesting.rules.SystemPropertiesRestoreRule$1.evaluate(SystemPropertiesRestoreRule.java:80)
	at org.junit.rules.RunRules.evaluate(RunRules.java:20)
	at org.apache.lucene.tests.util.TestRuleSetupTeardownChained$1.evaluate(TestRuleSetupTeardownChained.java:48)
	at org.apache.lucene.tests.util.AbstractBeforeAfterRule$1.evaluate(AbstractBeforeAfterRule.java:43)
	at org.apache.lucene.tests.util.TestRuleThreadAndTestName$1.evaluate(TestRuleThreadAndTestName.java:45)
	at org.apache.lucene.tests.util.TestRuleIgnoreAfterMaxFailures$1.evaluate(TestRuleIgnoreAfterMaxFailures.java:60)
	at org.apache.lucene.tests.util.TestRuleMarkFailure$1.evaluate(TestRuleMarkFailure.java:44)
	at org.junit.rules.RunRules.evaluate(RunRules.java:20)
	at com.carrotsearch.randomizedtesting.rules.StatementAdapter.evaluate(StatementAdapter.java:36)
	at com.carrotsearch.randomizedtesting.ThreadLeakControl$StatementRunner.run(ThreadLeakControl.java:390)
	at com.carrotsearch.randomizedtesting.ThreadLeakControl.forkTimeoutingTask(ThreadLeakControl.java:843)
	at com.carrotsearch.randomizedtesting.ThreadLeakControl$3.evaluate(ThreadLeakControl.java:490)
	at com.carrotsearch.randomizedtesting.RandomizedRunner.runSingleTest(RandomizedRunner.java:955)
	at com.carrotsearch.randomizedtesting.RandomizedRunner$5.evaluate(RandomizedRunner.java:840)
	at com.carrotsearch.randomizedtesting.RandomizedRunner$6.evaluate(RandomizedRunner.java:891)
	at com.carrotsearch.randomizedtesting.RandomizedRunner$7.evaluate(RandomizedRunner.java:902)
	at com.carrotsearch.randomizedtesting.rules.StatementAdapter.evaluate(StatementAdapter.java:36)
	at com.carrotsearch.randomizedtesting.rules.StatementAdapter.evaluate(StatementAdapter.java:36)
	at org.apache.lucene.tests.util.AbstractBeforeAfterRule$1.evaluate(AbstractBeforeAfterRule.java:43)
	at com.carrotsearch.randomizedtesting.rules.SystemPropertiesRestoreRule$1.evaluate(SystemPropertiesRestoreRule.java:80)
	at org.junit.rules.RunRules.evaluate(RunRules.java:20)
	at org.apache.lucene.tests.util.AbstractBeforeAfterRule$1.evaluate(AbstractBeforeAfterRule.java:43)
	at com.carrotsearch.randomizedtesting.rules.StatementAdapter.evaluate(StatementAdapter.java:36)
	at org.apache.lucene.tests.util.TestRuleStoreClassName$1.evaluate(TestRuleStoreClassName.java:38)
	at com.carrotsearch.randomizedtesting.rules.NoShadowingOrOverridesOnMethodsRule$1.evaluate(NoShadowingOrOverridesOnMethodsRule.java:40)
	at com.carrotsearch.randomizedtesting.rules.NoShadowingOrOverridesOnMethodsRule$1.evaluate(NoShadowingOrOverridesOnMethodsRule.java:40)
	at com.carrotsearch.randomizedtesting.rules.StatementAdapter.evaluate(StatementAdapter.java:36)
	at com.carrotsearch.randomizedtesting.rules.StatementAdapter.evaluate(StatementAdapter.java:36)
	at org.apache.lucene.tests.util.TestRuleAssertionsRequired$1.evaluate(TestRuleAssertionsRequired.java:53)
	at org.apache.lucene.tests.util.AbstractBeforeAfterRule$1.evaluate(AbstractBeforeAfterRule.java:43)
	at org.apache.lucene.tests.util.TestRuleMarkFailure$1.evaluate(TestRuleMarkFailure.java:44)
	at org.apache.lucene.tests.util.TestRuleIgnoreAfterMaxFailures$1.evaluate(TestRuleIgnoreAfterMaxFailures.java:60)
	at org.apache.lucene.tests.util.TestRuleIgnoreTestSuites$1.evaluate(TestRuleIgnoreTestSuites.java:47)
	at org.junit.rules.RunRules.evaluate(RunRules.java:20)
	at com.carrotsearch.randomizedtesting.rules.StatementAdapter.evaluate(StatementAdapter.java:36)
	at com.carrotsearch.randomizedtesting.ThreadLeakControl$StatementRunner.run(ThreadLeakControl.java:390)
	at com.carrotsearch.randomizedtesting.ThreadLeakControl.lambda$forkTimeoutingTask$0(ThreadLeakControl.java:850)
	at java.base/java.lang.Thread.run(Thread.java:829)


FAILED:  org.apache.solr.cloud.api.collections.LocalFSCloudIncrementalBackupTest.testRestoreToOriginalCollection

Error Message:
java.lang.AssertionError: expected:<COMPLETED> but was:<RUNNING>

Stack Trace:
java.lang.AssertionError: expected:<COMPLETED> but was:<RUNNING>
	at __randomizedtesting.SeedInfo.seed([33AF2439C0E61A77:65BCF622B3A2C29]:0)
	at org.junit.Assert.fail(Assert.java:89)
	at org.junit.Assert.failNotEquals(Assert.java:835)
	at org.junit.Assert.assertEquals(Assert.java:120)
	at org.junit.Assert.assertEquals(Assert.java:146)
	at org.apache.solr.cloud.api.collections.AbstractIncrementalBackupTest.testRestoreToOriginalCollection(AbstractIncrementalBackupTest.java:227)
	at java.base/jdk.internal.reflect.NativeMethodAccessorImpl.invoke0(Native Method)
	at java.base/jdk.internal.reflect.NativeMethodAccessorImpl.invoke(NativeMethodAccessorImpl.java:62)
	at java.base/jdk.internal.reflect.DelegatingMethodAccessorImpl.invoke(DelegatingMethodAccessorImpl.java:43)
	at java.base/java.lang.reflect.Method.invoke(Method.java:566)
	at com.carrotsearch.randomizedtesting.RandomizedRunner.invoke(RandomizedRunner.java:1758)
	at com.carrotsearch.randomizedtesting.RandomizedRunner$8.evaluate(RandomizedRunner.java:946)
	at com.carrotsearch.randomizedtesting.RandomizedRunner$9.evaluate(RandomizedRunner.java:982)
	at com.carrotsearch.randomizedtesting.RandomizedRunner$10.evaluate(RandomizedRunner.java:996)
	at com.carrotsearch.randomizedtesting.rules.SystemPropertiesRestoreRule$1.evaluate(SystemPropertiesRestoreRule.java:80)
	at org.junit.rules.RunRules.evaluate(RunRules.java:20)
	at org.apache.lucene.tests.util.TestRuleSetupTeardownChained$1.evaluate(TestRuleSetupTeardownChained.java:48)
	at org.apache.lucene.tests.util.AbstractBeforeAfterRule$1.evaluate(AbstractBeforeAfterRule.java:43)
	at org.apache.lucene.tests.util.TestRuleThreadAndTestName$1.evaluate(TestRuleThreadAndTestName.java:45)
	at org.apache.lucene.tests.util.TestRuleIgnoreAfterMaxFailures$1.evaluate(TestRuleIgnoreAfterMaxFailures.java:60)
	at org.apache.lucene.tests.util.TestRuleMarkFailure$1.evaluate(TestRuleMarkFailure.java:44)
	at org.junit.rules.RunRules.evaluate(RunRules.java:20)
	at com.carrotsearch.randomizedtesting.rules.StatementAdapter.evaluate(StatementAdapter.java:36)
	at com.carrotsearch.randomizedtesting.ThreadLeakControl$StatementRunner.run(ThreadLeakControl.java:390)
	at com.carrotsearch.randomizedtesting.ThreadLeakControl.forkTimeoutingTask(ThreadLeakControl.java:843)
	at com.carrotsearch.randomizedtesting.ThreadLeakControl$3.evaluate(ThreadLeakControl.java:490)
	at com.carrotsearch.randomizedtesting.RandomizedRunner.runSingleTest(RandomizedRunner.java:955)
	at com.carrotsearch.randomizedtesting.RandomizedRunner$5.evaluate(RandomizedRunner.java:840)
	at com.carrotsearch.randomizedtesting.RandomizedRunner$6.evaluate(RandomizedRunner.java:891)
	at com.carrotsearch.randomizedtesting.RandomizedRunner$7.evaluate(RandomizedRunner.java:902)
	at com.carrotsearch.randomizedtesting.rules.StatementAdapter.evaluate(StatementAdapter.java:36)
	at com.carrotsearch.randomizedtesting.rules.StatementAdapter.evaluate(StatementAdapter.java:36)
	at org.apache.lucene.tests.util.AbstractBeforeAfterRule$1.evaluate(AbstractBeforeAfterRule.java:43)
	at com.carrotsearch.randomizedtesting.rules.SystemPropertiesRestoreRule$1.evaluate(SystemPropertiesRestoreRule.java:80)
	at org.junit.rules.RunRules.evaluate(RunRules.java:20)
	at org.apache.lucene.tests.util.AbstractBeforeAfterRule$1.evaluate(AbstractBeforeAfterRule.java:43)
	at com.carrotsearch.randomizedtesting.rules.StatementAdapter.evaluate(StatementAdapter.java:36)
	at org.apache.lucene.tests.util.TestRuleStoreClassName$1.evaluate(TestRuleStoreClassName.java:38)
	at com.carrotsearch.randomizedtesting.rules.NoShadowingOrOverridesOnMethodsRule$1.evaluate(NoShadowingOrOverridesOnMethodsRule.java:40)
	at com.carrotsearch.randomizedtesting.rules.NoShadowingOrOverridesOnMethodsRule$1.evaluate(NoShadowingOrOverridesOnMethodsRule.java:40)
	at com.carrotsearch.randomizedtesting.rules.StatementAdapter.evaluate(StatementAdapter.java:36)
	at com.carrotsearch.randomizedtesting.rules.StatementAdapter.evaluate(StatementAdapter.java:36)
	at org.apache.lucene.tests.util.TestRuleAssertionsRequired$1.evaluate(TestRuleAssertionsRequired.java:53)
	at org.apache.lucene.tests.util.AbstractBeforeAfterRule$1.evaluate(AbstractBeforeAfterRule.java:43)
	at org.apache.lucene.tests.util.TestRuleMarkFailure$1.evaluate(TestRuleMarkFailure.java:44)
	at org.apache.lucene.tests.util.TestRuleIgnoreAfterMaxFailures$1.evaluate(TestRuleIgnoreAfterMaxFailures.java:60)
	at org.apache.lucene.tests.util.TestRuleIgnoreTestSuites$1.evaluate(TestRuleIgnoreTestSuites.java:47)
	at org.junit.rules.RunRules.evaluate(RunRules.java:20)
	at com.carrotsearch.randomizedtesting.rules.StatementAdapter.evaluate(StatementAdapter.java:36)
	at com.carrotsearch.randomizedtesting.ThreadLeakControl$StatementRunner.run(ThreadLeakControl.java:390)
	at com.carrotsearch.randomizedtesting.ThreadLeakControl.lambda$forkTimeoutingTask$0(ThreadLeakControl.java:850)
	at java.base/java.lang.Thread.run(Thread.java:829)


FAILED:  org.apache.solr.core.TestConfigSetService.classMethod

Error Message:
java.lang.RuntimeException: file handle leaks: [InputStream(/Users/jenkins/workspace/Solr-main-MacOSX/solr/core/build/tmp/tests-tmp/solr.core.TestConfigSetService_33AF2439C0E61A77-001/testconfig-002/subdir/file3), InputStream(/Users/jenkins/workspace/Solr-main-MacOSX/solr/core/build/tmp/tests-tmp/solr.core.TestConfigSetService_33AF2439C0E61A77-001/testconfig-002/solrconfig.xml), InputStream(/Users/jenkins/workspace/Solr-main-MacOSX/solr/core/build/tmp/tests-tmp/solr.core.TestConfigSetService_33AF2439C0E61A77-001/configsets-001/testconfig/subdir/file3), InputStream(/Users/jenkins/workspace/Solr-main-MacOSX/solr/core/build/tmp/tests-tmp/solr.core.TestConfigSetService_33AF2439C0E61A77-001/configsets-001/testconfig/.metadata.json), InputStream(/Users/jenkins/workspace/Solr-main-MacOSX/solr/core/build/tmp/tests-tmp/solr.core.TestConfigSetService_33AF2439C0E61A77-001/configsets-001/testconfig/file2), InputStream(/Users/jenkins/workspace/Solr-main-MacOSX/solr/core/build/tmp/tests-tmp/solr.core.TestConfigSetService_33AF2439C0E61A77-001/configsets-001/testconfig/file1), InputStream(/Users/jenkins/workspace/Solr-main-MacOSX/solr/core/build/tmp/tests-tmp/solr.core.TestConfigSetService_33AF2439C0E61A77-001/testconfig-002/file1), InputStream(/Users/jenkins/workspace/Solr-main-MacOSX/solr/core/build/tmp/tests-tmp/solr.core.TestConfigSetService_33AF2439C0E61A77-001/configsets-001/testconfig/subdir/file4), InputStream(/Users/jenkins/workspace/Solr-main-MacOSX/solr/core/build/tmp/tests-tmp/solr.core.TestConfigSetService_33AF2439C0E61A77-001/configsets-001/testconfig/solrconfig.xml), InputStream(/Users/jenkins/workspace/Solr-main-MacOSX/solr/core/build/tmp/tests-tmp/solr.core.TestConfigSetService_33AF2439C0E61A77-001/testconfig-002/file2)]

Stack Trace:
java.lang.RuntimeException: file handle leaks: [InputStream(/Users/jenkins/workspace/Solr-main-MacOSX/solr/core/build/tmp/tests-tmp/solr.core.TestConfigSetService_33AF2439C0E61A77-001/testconfig-002/subdir/file3), InputStream(/Users/jenkins/workspace/Solr-main-MacOSX/solr/core/build/tmp/tests-tmp/solr.core.TestConfigSetService_33AF2439C0E61A77-001/testconfig-002/solrconfig.xml), InputStream(/Users/jenkins/workspace/Solr-main-MacOSX/solr/core/build/tmp/tests-tmp/solr.core.TestConfigSetService_33AF2439C0E61A77-001/configsets-001/testconfig/subdir/file3), InputStream(/Users/jenkins/workspace/Solr-main-MacOSX/solr/core/build/tmp/tests-tmp/solr.core.TestConfigSetService_33AF2439C0E61A77-001/configsets-001/testconfig/.metadata.json), InputStream(/Users/jenkins/workspace/Solr-main-MacOSX/solr/core/build/tmp/tests-tmp/solr.core.TestConfigSetService_33AF2439C0E61A77-001/configsets-001/testconfig/file2), InputStream(/Users/jenkins/workspace/Solr-main-MacOSX/solr/core/build/tmp/tests-tmp/solr.core.TestConfigSetService_33AF2439C0E61A77-001/configsets-001/testconfig/file1), InputStream(/Users/jenkins/workspace/Solr-main-MacOSX/solr/core/build/tmp/tests-tmp/solr.core.TestConfigSetService_33AF2439C0E61A77-001/testconfig-002/file1), InputStream(/Users/jenkins/workspace/Solr-main-MacOSX/solr/core/build/tmp/tests-tmp/solr.core.TestConfigSetService_33AF2439C0E61A77-001/configsets-001/testconfig/subdir/file4), InputStream(/Users/jenkins/workspace/Solr-main-MacOSX/solr/core/build/tmp/tests-tmp/solr.core.TestConfigSetService_33AF2439C0E61A77-001/configsets-001/testconfig/solrconfig.xml), InputStream(/Users/jenkins/workspace/Solr-main-MacOSX/solr/core/build/tmp/tests-tmp/solr.core.TestConfigSetService_33AF2439C0E61A77-001/testconfig-002/file2)]
	at __randomizedtesting.SeedInfo.seed([33AF2439C0E61A77]:0)
	at org.apache.lucene.tests.mockfile.LeakFS.onClose(LeakFS.java:63)
	at org.apache.lucene.tests.mockfile.FilterFileSystem.close(FilterFileSystem.java:69)
	at org.apache.lucene.tests.mockfile.FilterFileSystem.close(FilterFileSystem.java:70)
	at org.apache.lucene.tests.util.TestRuleTemporaryFilesCleanup.afterAlways(TestRuleTemporaryFilesCleanup.java:223)
	at com.carrotsearch.randomizedtesting.rules.TestRuleAdapter$1.afterAlways(TestRuleAdapter.java:31)
	at com.carrotsearch.randomizedtesting.rules.StatementAdapter.evaluate(StatementAdapter.java:43)
	at com.carrotsearch.randomizedtesting.rules.StatementAdapter.evaluate(StatementAdapter.java:36)
	at org.apache.lucene.tests.util.TestRuleAssertionsRequired$1.evaluate(TestRuleAssertionsRequired.java:53)
	at org.apache.lucene.tests.util.AbstractBeforeAfterRule$1.evaluate(AbstractBeforeAfterRule.java:43)
	at org.apache.lucene.tests.util.TestRuleMarkFailure$1.evaluate(TestRuleMarkFailure.java:44)
	at org.apache.lucene.tests.util.TestRuleIgnoreAfterMaxFailures$1.evaluate(TestRuleIgnoreAfterMaxFailures.java:60)
	at org.apache.lucene.tests.util.TestRuleIgnoreTestSuites$1.evaluate(TestRuleIgnoreTestSuites.java:47)
	at org.junit.rules.RunRules.evaluate(RunRules.java:20)
	at com.carrotsearch.randomizedtesting.rules.StatementAdapter.evaluate(StatementAdapter.java:36)
	at com.carrotsearch.randomizedtesting.ThreadLeakControl$StatementRunner.run(ThreadLeakControl.java:390)
	at com.carrotsearch.randomizedtesting.ThreadLeakControl.lambda$forkTimeoutingTask$0(ThreadLeakControl.java:850)
	at java.base/java.lang.Thread.run(Thread.java:829)
Caused by: java.lang.Exception
	at org.apache.lucene.tests.mockfile.LeakFS.onOpen(LeakFS.java:46)
	at org.apache.lucene.tests.mockfile.HandleTrackingFS.callOpenHook(HandleTrackingFS.java:82)
	at org.apache.lucene.tests.mockfile.HandleTrackingFS.newInputStream(HandleTrackingFS.java:125)
	at org.apache.lucene.tests.mockfile.FilterFileSystemProvider.newInputStream(FilterFileSystemProvider.java:193)
	at org.apache.lucene.tests.mockfile.HandleTrackingFS.newInputStream(HandleTrackingFS.java:94)
	at java.base/java.nio.file.Files.newInputStream(Files.java:156)
	at org.apache.solr.core.FileSystemConfigSetService$2.visitFile(FileSystemConfigSetService.java:217)
	at org.apache.solr.core.FileSystemConfigSetService$2.visitFile(FileSystemConfigSetService.java:201)
	at java.base/java.nio.file.Files.walkFileTree(Files.java:2725)
	at java.base/java.nio.file.Files.walkFileTree(Files.java:2797)
	at org.apache.solr.core.FileSystemConfigSetService.copyRecursively(FileSystemConfigSetService.java:199)
	at org.apache.solr.core.FileSystemConfigSetService.uploadConfig(FileSystemConfigSetService.java:144)
	at org.apache.solr.core.TestConfigSetService.testConfigSetServiceOperations(TestConfigSetService.java:81)
	at java.base/jdk.internal.reflect.NativeMethodAccessorImpl.invoke0(Native Method)
	at java.base/jdk.internal.reflect.NativeMethodAccessorImpl.invoke(NativeMethodAccessorImpl.java:62)
	at java.base/jdk.internal.reflect.DelegatingMethodAccessorImpl.invoke(DelegatingMethodAccessorImpl.java:43)
	at java.base/java.lang.reflect.Method.invoke(Method.java:566)
	at com.carrotsearch.randomizedtesting.RandomizedRunner.invoke(RandomizedRunner.java:1758)
	at com.carrotsearch.randomizedtesting.RandomizedRunner$8.evaluate(RandomizedRunner.java:946)
	at com.carrotsearch.randomizedtesting.RandomizedRunner$9.evaluate(RandomizedRunner.java:982)
	at com.carrotsearch.randomizedtesting.RandomizedRunner$10.evaluate(RandomizedRunner.java:996)
	at com.carrotsearch.randomizedtesting.rules.SystemPropertiesRestoreRule$1.evaluate(SystemPropertiesRestoreRule.java:80)
	at org.junit.rules.RunRules.evaluate(RunRules.java:20)
	at org.apache.lucene.tests.util.TestRuleSetupTeardownChained$1.evaluate(TestRuleSetupTeardownChained.java:48)
	at org.apache.lucene.tests.util.AbstractBeforeAfterRule$1.evaluate(AbstractBeforeAfterRule.java:43)
	at org.apache.lucene.tests.util.TestRuleThreadAndTestName$1.evaluate(TestRuleThreadAndTestName.java:45)
	at org.apache.lucene.tests.util.TestRuleIgnoreAfterMaxFailures$1.evaluate(TestRuleIgnoreAfterMaxFailures.java:60)
	at org.apache.lucene.tests.util.TestRuleMarkFailure$1.evaluate(TestRuleMarkFailure.java:44)
	at org.junit.rules.RunRules.evaluate(RunRules.java:20)
	at com.carrotsearch.randomizedtesting.rules.StatementAdapter.evaluate(StatementAdapter.java:36)
	at com.carrotsearch.randomizedtesting.ThreadLeakControl$StatementRunner.run(ThreadLeakControl.java:390)
	at com.carrotsearch.randomizedtesting.ThreadLeakControl.forkTimeoutingTask(ThreadLeakControl.java:843)
	at com.carrotsearch.randomizedtesting.ThreadLeakControl$3.evaluate(ThreadLeakControl.java:490)
	at com.carrotsearch.randomizedtesting.RandomizedRunner.runSingleTest(RandomizedRunner.java:955)
	at com.carrotsearch.randomizedtesting.RandomizedRunner$5.evaluate(RandomizedRunner.java:840)
	at com.carrotsearch.randomizedtesting.RandomizedRunner$6.evaluate(RandomizedRunner.java:891)
	at com.carrotsearch.randomizedtesting.RandomizedRunner$7.evaluate(RandomizedRunner.java:902)
	at com.carrotsearch.randomizedtesting.rules.StatementAdapter.evaluate(StatementAdapter.java:36)
	at com.carrotsearch.randomizedtesting.rules.StatementAdapter.evaluate(StatementAdapter.java:36)
	at org.apache.lucene.tests.util.AbstractBeforeAfterRule$1.evaluate(AbstractBeforeAfterRule.java:43)
	at com.carrotsearch.randomizedtesting.rules.SystemPropertiesRestoreRule$1.evaluate(SystemPropertiesRestoreRule.java:80)
	at org.junit.rules.RunRules.evaluate(RunRules.java:20)
	at org.apache.lucene.tests.util.AbstractBeforeAfterRule$1.evaluate(AbstractBeforeAfterRule.java:43)
	at com.carrotsearch.randomizedtesting.rules.StatementAdapter.evaluate(StatementAdapter.java:36)
	at org.apache.lucene.tests.util.TestRuleStoreClassName$1.evaluate(TestRuleStoreClassName.java:38)
	at com.carrotsearch.randomizedtesting.rules.NoShadowingOrOverridesOnMethodsRule$1.evaluate(NoShadowingOrOverridesOnMethodsRule.java:40)
	at com.carrotsearch.randomizedtesting.rules.NoShadowingOrOverridesOnMethodsRule$1.evaluate(NoShadowingOrOverridesOnMethodsRule.java:40)
	at com.carrotsearch.randomizedtesting.rules.StatementAdapter.evaluate(StatementAdapter.java:36)
	... 11 more


FAILED:  org.apache.solr.core.TestFileSystemConfigSetService.classMethod

Error Message:
java.lang.RuntimeException: file handle leaks: [InputStream(/Users/jenkins/workspace/Solr-main-MacOSX/solr/core/build/tmp/tests-tmp/solr.core.TestFileSystemConfigSetService_33AF2439C0E61A77-001/tempDir-001/testconfig/schema.xml), InputStream(/Users/jenkins/workspace/Solr-main-MacOSX/solr/core/build/tmp/tests-tmp/solr.core.TestFileSystemConfigSetService_33AF2439C0E61A77-001/tempDir-001/testconfig/solrconfig.xml), InputStream(/Users/jenkins/workspace/Solr-main-MacOSX/solr/core/build/tmp/tests-tmp/solr.core.TestFileSystemConfigSetService_33AF2439C0E61A77-001/tempDir-001/testconfig/solrconfig.xml), InputStream(/Users/jenkins/workspace/Solr-main-MacOSX/solr/core/build/tmp/tests-tmp/solr.core.TestFileSystemConfigSetService_33AF2439C0E61A77-001/tempDir-001/testconfig/schema.xml)]

Stack Trace:
java.lang.RuntimeException: file handle leaks: [InputStream(/Users/jenkins/workspace/Solr-main-MacOSX/solr/core/build/tmp/tests-tmp/solr.core.TestFileSystemConfigSetService_33AF2439C0E61A77-001/tempDir-001/testconfig/schema.xml), InputStream(/Users/jenkins/workspace/Solr-main-MacOSX/solr/core/build/tmp/tests-tmp/solr.core.TestFileSystemConfigSetService_33AF2439C0E61A77-001/tempDir-001/testconfig/solrconfig.xml), InputStream(/Users/jenkins/workspace/Solr-main-MacOSX/solr/core/build/tmp/tests-tmp/solr.core.TestFileSystemConfigSetService_33AF2439C0E61A77-001/tempDir-001/testconfig/solrconfig.xml), InputStream(/Users/jenkins/workspace/Solr-main-MacOSX/solr/core/build/tmp/tests-tmp/solr.core.TestFileSystemConfigSetService_33AF2439C0E61A77-001/tempDir-001/testconfig/schema.xml)]
	at __randomizedtesting.SeedInfo.seed([33AF2439C0E61A77]:0)
	at org.apache.lucene.tests.mockfile.LeakFS.onClose(LeakFS.java:63)
	at org.apache.lucene.tests.mockfile.FilterFileSystem.close(FilterFileSystem.java:69)
	at org.apache.lucene.tests.mockfile.FilterFileSystem.close(FilterFileSystem.java:70)
	at org.apache.lucene.tests.util.TestRuleTemporaryFilesCleanup.afterAlways(TestRuleTemporaryFilesCleanup.java:223)
	at com.carrotsearch.randomizedtesting.rules.TestRuleAdapter$1.afterAlways(TestRuleAdapter.java:31)
	at com.carrotsearch.randomizedtesting.rules.StatementAdapter.evaluate(StatementAdapter.java:43)
	at com.carrotsearch.randomizedtesting.rules.StatementAdapter.evaluate(StatementAdapter.java:36)
	at org.apache.lucene.tests.util.TestRuleAssertionsRequired$1.evaluate(TestRuleAssertionsRequired.java:53)
	at org.apache.lucene.tests.util.AbstractBeforeAfterRule$1.evaluate(AbstractBeforeAfterRule.java:43)
	at org.apache.lucene.tests.util.TestRuleMarkFailure$1.evaluate(TestRuleMarkFailure.java:44)
	at org.apache.lucene.tests.util.TestRuleIgnoreAfterMaxFailures$1.evaluate(TestRuleIgnoreAfterMaxFailures.java:60)
	at org.apache.lucene.tests.util.TestRuleIgnoreTestSuites$1.evaluate(TestRuleIgnoreTestSuites.java:47)
	at org.junit.rules.RunRules.evaluate(RunRules.java:20)
	at com.carrotsearch.randomizedtesting.rules.StatementAdapter.evaluate(StatementAdapter.java:36)
	at com.carrotsearch.randomizedtesting.ThreadLeakControl$StatementRunner.run(ThreadLeakControl.java:390)
	at com.carrotsearch.randomizedtesting.ThreadLeakControl.lambda$forkTimeoutingTask$0(ThreadLeakControl.java:850)
	at java.base/java.lang.Thread.run(Thread.java:829)
Caused by: java.lang.Exception
	at org.apache.lucene.tests.mockfile.LeakFS.onOpen(LeakFS.java:46)
	at org.apache.lucene.tests.mockfile.HandleTrackingFS.callOpenHook(HandleTrackingFS.java:82)
	at org.apache.lucene.tests.mockfile.HandleTrackingFS.newInputStream(HandleTrackingFS.java:125)
	at org.apache.lucene.tests.mockfile.FilterFileSystemProvider.newInputStream(FilterFileSystemProvider.java:193)
	at org.apache.lucene.tests.mockfile.HandleTrackingFS.newInputStream(HandleTrackingFS.java:94)
	at java.base/java.nio.file.Files.newInputStream(Files.java:156)
	at org.apache.solr.core.FileSystemConfigSetService$2.visitFile(FileSystemConfigSetService.java:217)
	at org.apache.solr.core.FileSystemConfigSetService$2.visitFile(FileSystemConfigSetService.java:201)
	at java.base/java.nio.file.Files.walkFileTree(Files.java:2725)
	at java.base/java.nio.file.Files.walkFileTree(Files.java:2797)
	at org.apache.solr.core.FileSystemConfigSetService.copyRecursively(FileSystemConfigSetService.java:199)
	at org.apache.solr.core.FileSystemConfigSetService.downloadConfig(FileSystemConfigSetService.java:194)
	at org.apache.solr.core.TestFileSystemConfigSetService.testUploadAndDeleteConfig(TestFileSystemConfigSetService.java:86)
	at java.base/jdk.internal.reflect.NativeMethodAccessorImpl.invoke0(Native Method)
	at java.base/jdk.internal.reflect.NativeMethodAccessorImpl.invoke(NativeMethodAccessorImpl.java:62)
	at java.base/jdk.internal.reflect.DelegatingMethodAccessorImpl.invoke(DelegatingMethodAccessorImpl.java:43)
	at java.base/java.lang.reflect.Method.invoke(Method.java:566)
	at com.carrotsearch.randomizedtesting.RandomizedRunner.invoke(RandomizedRunner.java:1758)
	at com.carrotsearch.randomizedtesting.RandomizedRunner$8.evaluate(RandomizedRunner.java:946)
	at com.carrotsearch.randomizedtesting.RandomizedRunner$9.evaluate(RandomizedRunner.java:982)
	at com.carrotsearch.randomizedtesting.RandomizedRunner$10.evaluate(RandomizedRunner.java:996)
	at com.carrotsearch.randomizedtesting.rules.SystemPropertiesRestoreRule$1.evaluate(SystemPropertiesRestoreRule.java:80)
	at org.junit.rules.RunRules.evaluate(RunRules.java:20)
	at org.apache.lucene.tests.util.TestRuleSetupTeardownChained$1.evaluate(TestRuleSetupTeardownChained.java:48)
	at org.apache.lucene.tests.util.AbstractBeforeAfterRule$1.evaluate(AbstractBeforeAfterRule.java:43)
	at org.apache.lucene.tests.util.TestRuleThreadAndTestName$1.evaluate(TestRuleThreadAndTestName.java:45)
	at org.apache.lucene.tests.util.TestRuleIgnoreAfterMaxFailures$1.evaluate(TestRuleIgnoreAfterMaxFailures.java:60)
	at org.apache.lucene.tests.util.TestRuleMarkFailure$1.evaluate(TestRuleMarkFailure.java:44)
	at org.junit.rules.RunRules.evaluate(RunRules.java:20)
	at com.carrotsearch.randomizedtesting.rules.StatementAdapter.evaluate(StatementAdapter.java:36)
	at com.carrotsearch.randomizedtesting.ThreadLeakControl$StatementRunner.run(ThreadLeakControl.java:390)
	at com.carrotsearch.randomizedtesting.ThreadLeakControl.forkTimeoutingTask(ThreadLeakControl.java:843)
	at com.carrotsearch.randomizedtesting.ThreadLeakControl$3.evaluate(ThreadLeakControl.java:490)
	at com.carrotsearch.randomizedtesting.RandomizedRunner.runSingleTest(RandomizedRunner.java:955)
	at com.carrotsearch.randomizedtesting.RandomizedRunner$5.evaluate(RandomizedRunner.java:840)
	at com.carrotsearch.randomizedtesting.RandomizedRunner$6.evaluate(RandomizedRunner.java:891)
	at com.carrotsearch.randomizedtesting.RandomizedRunner$7.evaluate(RandomizedRunner.java:902)
	at com.carrotsearch.randomizedtesting.rules.StatementAdapter.evaluate(StatementAdapter.java:36)
	at com.carrotsearch.randomizedtesting.rules.StatementAdapter.evaluate(StatementAdapter.java:36)
	at org.apache.lucene.tests.util.AbstractBeforeAfterRule$1.evaluate(AbstractBeforeAfterRule.java:43)
	at com.carrotsearch.randomizedtesting.rules.SystemPropertiesRestoreRule$1.evaluate(SystemPropertiesRestoreRule.java:80)
	at org.junit.rules.RunRules.evaluate(RunRules.java:20)
	at org.apache.lucene.tests.util.AbstractBeforeAfterRule$1.evaluate(AbstractBeforeAfterRule.java:43)
	at com.carrotsearch.randomizedtesting.rules.StatementAdapter.evaluate(StatementAdapter.java:36)
	at org.apache.lucene.tests.util.TestRuleStoreClassName$1.evaluate(TestRuleStoreClassName.java:38)
	at com.carrotsearch.randomizedtesting.rules.NoShadowingOrOverridesOnMethodsRule$1.evaluate(NoShadowingOrOverridesOnMethodsRule.java:40)
	at com.carrotsearch.randomizedtesting.rules.NoShadowingOrOverridesOnMethodsRule$1.evaluate(NoShadowingOrOverridesOnMethodsRule.java:40)
	at com.carrotsearch.randomizedtesting.rules.StatementAdapter.evaluate(StatementAdapter.java:36)
	... 11 more

[JENKINS] Solr-main-MacOSX (64bit/hotspot/jdk-20) - Build # 3700 - Failure!

Posted by Policeman Jenkins Server <je...@thetaphi.de>.
Build: https://jenkins.thetaphi.de/job/Solr-main-MacOSX/3700/
Java: 64bit/hotspot/jdk-20 -XX:+UseCompressedOops -XX:+UseG1GC

No tests ran.

[JENKINS] Solr-main-MacOSX (64bit/hotspot/jdk-19) - Build # 3699 - Unstable!

Posted by Policeman Jenkins Server <je...@thetaphi.de>.
Build: https://jenkins.thetaphi.de/job/Solr-main-MacOSX/3699/
Java: 64bit/hotspot/jdk-19 -XX:+UseCompressedOops -XX:+UseG1GC

7 tests failed.
FAILED:  org.apache.solr.cloud.TestPrepRecovery.testLeaderUnloaded

Error Message:
org.apache.solr.client.solrj.impl.BaseHttpSolrClient$RemoteSolrException: Error from server at http://127.0.0.1:61506/solr: Underlying core creation failed while creating collection: testLeaderUnloaded

Stack Trace:
org.apache.solr.client.solrj.impl.BaseHttpSolrClient$RemoteSolrException: Error from server at http://127.0.0.1:61506/solr: Underlying core creation failed while creating collection: testLeaderUnloaded
	at __randomizedtesting.SeedInfo.seed([521979C7114E10FB:1BE6A31EC62FEF9]:0)
	at app//org.apache.solr.client.solrj.impl.HttpSolrClient.executeMethod(HttpSolrClient.java:734)
	at app//org.apache.solr.client.solrj.impl.HttpSolrClient.request(HttpSolrClient.java:253)
	at app//org.apache.solr.client.solrj.impl.HttpSolrClient.request(HttpSolrClient.java:234)
	at app//org.apache.solr.client.solrj.impl.LBSolrClient.doRequest(LBSolrClient.java:389)
	at app//org.apache.solr.client.solrj.impl.LBSolrClient.request(LBSolrClient.java:352)
	at app//org.apache.solr.client.solrj.impl.CloudSolrClient.sendRequest(CloudSolrClient.java:1136)
	at app//org.apache.solr.client.solrj.impl.CloudSolrClient.requestWithRetryOnStaleState(CloudSolrClient.java:835)
	at app//org.apache.solr.client.solrj.impl.CloudSolrClient.request(CloudSolrClient.java:766)
	at app//org.apache.solr.client.solrj.SolrRequest.process(SolrRequest.java:216)
	at app//org.apache.solr.client.solrj.SolrRequest.process(SolrRequest.java:231)
	at app//org.apache.solr.cloud.TestPrepRecovery.testLeaderUnloaded(TestPrepRecovery.java:59)
	at java.base@19/jdk.internal.reflect.DirectMethodHandleAccessor.invoke(DirectMethodHandleAccessor.java:104)
	at java.base@19/java.lang.reflect.Method.invoke(Method.java:578)
	at app//com.carrotsearch.randomizedtesting.RandomizedRunner.invoke(RandomizedRunner.java:1758)
	at app//com.carrotsearch.randomizedtesting.RandomizedRunner$8.evaluate(RandomizedRunner.java:946)
	at app//com.carrotsearch.randomizedtesting.RandomizedRunner$9.evaluate(RandomizedRunner.java:982)
	at app//com.carrotsearch.randomizedtesting.RandomizedRunner$10.evaluate(RandomizedRunner.java:996)
	at app//com.carrotsearch.randomizedtesting.rules.SystemPropertiesRestoreRule$1.evaluate(SystemPropertiesRestoreRule.java:80)
	at app//org.junit.rules.RunRules.evaluate(RunRules.java:20)
	at app//org.apache.lucene.tests.util.TestRuleSetupTeardownChained$1.evaluate(TestRuleSetupTeardownChained.java:48)
	at app//org.apache.lucene.tests.util.AbstractBeforeAfterRule$1.evaluate(AbstractBeforeAfterRule.java:43)
	at app//org.apache.lucene.tests.util.TestRuleThreadAndTestName$1.evaluate(TestRuleThreadAndTestName.java:45)
	at app//org.apache.lucene.tests.util.TestRuleIgnoreAfterMaxFailures$1.evaluate(TestRuleIgnoreAfterMaxFailures.java:60)
	at app//org.apache.lucene.tests.util.TestRuleMarkFailure$1.evaluate(TestRuleMarkFailure.java:44)
	at app//org.junit.rules.RunRules.evaluate(RunRules.java:20)
	at app//com.carrotsearch.randomizedtesting.rules.StatementAdapter.evaluate(StatementAdapter.java:36)
	at app//com.carrotsearch.randomizedtesting.ThreadLeakControl$StatementRunner.run(ThreadLeakControl.java:390)
	at app//com.carrotsearch.randomizedtesting.ThreadLeakControl.forkTimeoutingTask(ThreadLeakControl.java:843)
	at app//com.carrotsearch.randomizedtesting.ThreadLeakControl$3.evaluate(ThreadLeakControl.java:490)
	at app//com.carrotsearch.randomizedtesting.RandomizedRunner.runSingleTest(RandomizedRunner.java:955)
	at app//com.carrotsearch.randomizedtesting.RandomizedRunner$5.evaluate(RandomizedRunner.java:840)
	at app//com.carrotsearch.randomizedtesting.RandomizedRunner$6.evaluate(RandomizedRunner.java:891)
	at app//com.carrotsearch.randomizedtesting.RandomizedRunner$7.evaluate(RandomizedRunner.java:902)
	at app//com.carrotsearch.randomizedtesting.rules.StatementAdapter.evaluate(StatementAdapter.java:36)
	at app//com.carrotsearch.randomizedtesting.rules.StatementAdapter.evaluate(StatementAdapter.java:36)
	at app//org.apache.lucene.tests.util.AbstractBeforeAfterRule$1.evaluate(AbstractBeforeAfterRule.java:43)
	at app//com.carrotsearch.randomizedtesting.rules.SystemPropertiesRestoreRule$1.evaluate(SystemPropertiesRestoreRule.java:80)
	at app//org.junit.rules.RunRules.evaluate(RunRules.java:20)
	at app//org.apache.lucene.tests.util.AbstractBeforeAfterRule$1.evaluate(AbstractBeforeAfterRule.java:43)
	at app//com.carrotsearch.randomizedtesting.rules.StatementAdapter.evaluate(StatementAdapter.java:36)
	at app//org.apache.lucene.tests.util.TestRuleStoreClassName$1.evaluate(TestRuleStoreClassName.java:38)
	at app//com.carrotsearch.randomizedtesting.rules.NoShadowingOrOverridesOnMethodsRule$1.evaluate(NoShadowingOrOverridesOnMethodsRule.java:40)
	at app//com.carrotsearch.randomizedtesting.rules.NoShadowingOrOverridesOnMethodsRule$1.evaluate(NoShadowingOrOverridesOnMethodsRule.java:40)
	at app//com.carrotsearch.randomizedtesting.rules.StatementAdapter.evaluate(StatementAdapter.java:36)
	at app//com.carrotsearch.randomizedtesting.rules.StatementAdapter.evaluate(StatementAdapter.java:36)
	at app//org.apache.lucene.tests.util.TestRuleAssertionsRequired$1.evaluate(TestRuleAssertionsRequired.java:53)
	at app//org.apache.lucene.tests.util.AbstractBeforeAfterRule$1.evaluate(AbstractBeforeAfterRule.java:43)
	at app//org.apache.lucene.tests.util.TestRuleMarkFailure$1.evaluate(TestRuleMarkFailure.java:44)
	at app//org.apache.lucene.tests.util.TestRuleIgnoreAfterMaxFailures$1.evaluate(TestRuleIgnoreAfterMaxFailures.java:60)
	at app//org.apache.lucene.tests.util.TestRuleIgnoreTestSuites$1.evaluate(TestRuleIgnoreTestSuites.java:47)
	at app//org.junit.rules.RunRules.evaluate(RunRules.java:20)
	at app//com.carrotsearch.randomizedtesting.rules.StatementAdapter.evaluate(StatementAdapter.java:36)
	at app//com.carrotsearch.randomizedtesting.ThreadLeakControl$StatementRunner.run(ThreadLeakControl.java:390)
	at app//com.carrotsearch.randomizedtesting.ThreadLeakControl.lambda$forkTimeoutingTask$0(ThreadLeakControl.java:850)
	at java.base@19/java.lang.Thread.run(Thread.java:1589)


FAILED:  org.apache.solr.cluster.placement.impl.SimpleClusterAbstractionsTest.testBasic

Error Message:
org.junit.ComparisonFailure: expected:<[active]> but was:<[down]>

Stack Trace:
org.junit.ComparisonFailure: expected:<[active]> but was:<[down]>
	at __randomizedtesting.SeedInfo.seed([521979C7114E10FB:F9E364D2CE9296D5]:0)
	at org.junit.Assert.assertEquals(Assert.java:117)
	at org.junit.Assert.assertEquals(Assert.java:146)
	at org.apache.solr.cluster.placement.impl.SimpleClusterAbstractionsTest.lambda$testBasic$1(SimpleClusterAbstractionsTest.java:84)
	at java.base/java.util.LinkedHashMap$LinkedValues.forEach(LinkedHashMap.java:655)
	at org.apache.solr.cluster.placement.impl.SimpleClusterAbstractionsTest.testBasic(SimpleClusterAbstractionsTest.java:78)
	at java.base/jdk.internal.reflect.DirectMethodHandleAccessor.invoke(DirectMethodHandleAccessor.java:104)
	at java.base/java.lang.reflect.Method.invoke(Method.java:578)
	at com.carrotsearch.randomizedtesting.RandomizedRunner.invoke(RandomizedRunner.java:1758)
	at com.carrotsearch.randomizedtesting.RandomizedRunner$8.evaluate(RandomizedRunner.java:946)
	at com.carrotsearch.randomizedtesting.RandomizedRunner$9.evaluate(RandomizedRunner.java:982)
	at com.carrotsearch.randomizedtesting.RandomizedRunner$10.evaluate(RandomizedRunner.java:996)
	at com.carrotsearch.randomizedtesting.rules.SystemPropertiesRestoreRule$1.evaluate(SystemPropertiesRestoreRule.java:80)
	at org.junit.rules.RunRules.evaluate(RunRules.java:20)
	at org.apache.lucene.tests.util.TestRuleSetupTeardownChained$1.evaluate(TestRuleSetupTeardownChained.java:48)
	at org.apache.lucene.tests.util.AbstractBeforeAfterRule$1.evaluate(AbstractBeforeAfterRule.java:43)
	at org.apache.lucene.tests.util.TestRuleThreadAndTestName$1.evaluate(TestRuleThreadAndTestName.java:45)
	at org.apache.lucene.tests.util.TestRuleIgnoreAfterMaxFailures$1.evaluate(TestRuleIgnoreAfterMaxFailures.java:60)
	at org.apache.lucene.tests.util.TestRuleMarkFailure$1.evaluate(TestRuleMarkFailure.java:44)
	at org.junit.rules.RunRules.evaluate(RunRules.java:20)
	at com.carrotsearch.randomizedtesting.rules.StatementAdapter.evaluate(StatementAdapter.java:36)
	at com.carrotsearch.randomizedtesting.ThreadLeakControl$StatementRunner.run(ThreadLeakControl.java:390)
	at com.carrotsearch.randomizedtesting.ThreadLeakControl.forkTimeoutingTask(ThreadLeakControl.java:843)
	at com.carrotsearch.randomizedtesting.ThreadLeakControl$3.evaluate(ThreadLeakControl.java:490)
	at com.carrotsearch.randomizedtesting.RandomizedRunner.runSingleTest(RandomizedRunner.java:955)
	at com.carrotsearch.randomizedtesting.RandomizedRunner$5.evaluate(RandomizedRunner.java:840)
	at com.carrotsearch.randomizedtesting.RandomizedRunner$6.evaluate(RandomizedRunner.java:891)
	at com.carrotsearch.randomizedtesting.RandomizedRunner$7.evaluate(RandomizedRunner.java:902)
	at com.carrotsearch.randomizedtesting.rules.StatementAdapter.evaluate(StatementAdapter.java:36)
	at com.carrotsearch.randomizedtesting.rules.StatementAdapter.evaluate(StatementAdapter.java:36)
	at org.apache.lucene.tests.util.AbstractBeforeAfterRule$1.evaluate(AbstractBeforeAfterRule.java:43)
	at com.carrotsearch.randomizedtesting.rules.SystemPropertiesRestoreRule$1.evaluate(SystemPropertiesRestoreRule.java:80)
	at org.junit.rules.RunRules.evaluate(RunRules.java:20)
	at org.apache.lucene.tests.util.AbstractBeforeAfterRule$1.evaluate(AbstractBeforeAfterRule.java:43)
	at com.carrotsearch.randomizedtesting.rules.StatementAdapter.evaluate(StatementAdapter.java:36)
	at org.apache.lucene.tests.util.TestRuleStoreClassName$1.evaluate(TestRuleStoreClassName.java:38)
	at com.carrotsearch.randomizedtesting.rules.NoShadowingOrOverridesOnMethodsRule$1.evaluate(NoShadowingOrOverridesOnMethodsRule.java:40)
	at com.carrotsearch.randomizedtesting.rules.NoShadowingOrOverridesOnMethodsRule$1.evaluate(NoShadowingOrOverridesOnMethodsRule.java:40)
	at com.carrotsearch.randomizedtesting.rules.StatementAdapter.evaluate(StatementAdapter.java:36)
	at com.carrotsearch.randomizedtesting.rules.StatementAdapter.evaluate(StatementAdapter.java:36)
	at org.apache.lucene.tests.util.TestRuleAssertionsRequired$1.evaluate(TestRuleAssertionsRequired.java:53)
	at org.apache.lucene.tests.util.AbstractBeforeAfterRule$1.evaluate(AbstractBeforeAfterRule.java:43)
	at org.apache.lucene.tests.util.TestRuleMarkFailure$1.evaluate(TestRuleMarkFailure.java:44)
	at org.apache.lucene.tests.util.TestRuleIgnoreAfterMaxFailures$1.evaluate(TestRuleIgnoreAfterMaxFailures.java:60)
	at org.apache.lucene.tests.util.TestRuleIgnoreTestSuites$1.evaluate(TestRuleIgnoreTestSuites.java:47)
	at org.junit.rules.RunRules.evaluate(RunRules.java:20)
	at com.carrotsearch.randomizedtesting.rules.StatementAdapter.evaluate(StatementAdapter.java:36)
	at com.carrotsearch.randomizedtesting.ThreadLeakControl$StatementRunner.run(ThreadLeakControl.java:390)
	at com.carrotsearch.randomizedtesting.ThreadLeakControl.lambda$forkTimeoutingTask$0(ThreadLeakControl.java:850)
	at java.base/java.lang.Thread.run(Thread.java:1589)


FAILED:  org.apache.solr.core.TestConfigSetService.classMethod

Error Message:
java.lang.RuntimeException: file handle leaks: [InputStream(/Users/jenkins/workspace/Solr-main-MacOSX/solr/core/build/tmp/tests-tmp/solr.core.TestConfigSetService_521979C7114E10FB-001/configsets-001/testconfig/.metadata.json), InputStream(/Users/jenkins/workspace/Solr-main-MacOSX/solr/core/build/tmp/tests-tmp/solr.core.TestConfigSetService_521979C7114E10FB-001/configsets-001/testconfig/file2), InputStream(/Users/jenkins/workspace/Solr-main-MacOSX/solr/core/build/tmp/tests-tmp/solr.core.TestConfigSetService_521979C7114E10FB-001/configsets-001/testconfig/subdir/file3), InputStream(/Users/jenkins/workspace/Solr-main-MacOSX/solr/core/build/tmp/tests-tmp/solr.core.TestConfigSetService_521979C7114E10FB-001/testconfig-001/file2), InputStream(/Users/jenkins/workspace/Solr-main-MacOSX/solr/core/build/tmp/tests-tmp/solr.core.TestConfigSetService_521979C7114E10FB-001/testconfig-001/file1), InputStream(/Users/jenkins/workspace/Solr-main-MacOSX/solr/core/build/tmp/tests-tmp/solr.core.TestConfigSetService_521979C7114E10FB-001/testconfig-001/solrconfig.xml), InputStream(/Users/jenkins/workspace/Solr-main-MacOSX/solr/core/build/tmp/tests-tmp/solr.core.TestConfigSetService_521979C7114E10FB-001/testconfig-001/subdir/file3), InputStream(/Users/jenkins/workspace/Solr-main-MacOSX/solr/core/build/tmp/tests-tmp/solr.core.TestConfigSetService_521979C7114E10FB-001/configsets-001/testconfig/solrconfig.xml), InputStream(/Users/jenkins/workspace/Solr-main-MacOSX/solr/core/build/tmp/tests-tmp/solr.core.TestConfigSetService_521979C7114E10FB-001/configsets-001/testconfig/subdir/file4), InputStream(/Users/jenkins/workspace/Solr-main-MacOSX/solr/core/build/tmp/tests-tmp/solr.core.TestConfigSetService_521979C7114E10FB-001/configsets-001/testconfig/file1)]

Stack Trace:
java.lang.RuntimeException: file handle leaks: [InputStream(/Users/jenkins/workspace/Solr-main-MacOSX/solr/core/build/tmp/tests-tmp/solr.core.TestConfigSetService_521979C7114E10FB-001/configsets-001/testconfig/.metadata.json), InputStream(/Users/jenkins/workspace/Solr-main-MacOSX/solr/core/build/tmp/tests-tmp/solr.core.TestConfigSetService_521979C7114E10FB-001/configsets-001/testconfig/file2), InputStream(/Users/jenkins/workspace/Solr-main-MacOSX/solr/core/build/tmp/tests-tmp/solr.core.TestConfigSetService_521979C7114E10FB-001/configsets-001/testconfig/subdir/file3), InputStream(/Users/jenkins/workspace/Solr-main-MacOSX/solr/core/build/tmp/tests-tmp/solr.core.TestConfigSetService_521979C7114E10FB-001/testconfig-001/file2), InputStream(/Users/jenkins/workspace/Solr-main-MacOSX/solr/core/build/tmp/tests-tmp/solr.core.TestConfigSetService_521979C7114E10FB-001/testconfig-001/file1), InputStream(/Users/jenkins/workspace/Solr-main-MacOSX/solr/core/build/tmp/tests-tmp/solr.core.TestConfigSetService_521979C7114E10FB-001/testconfig-001/solrconfig.xml), InputStream(/Users/jenkins/workspace/Solr-main-MacOSX/solr/core/build/tmp/tests-tmp/solr.core.TestConfigSetService_521979C7114E10FB-001/testconfig-001/subdir/file3), InputStream(/Users/jenkins/workspace/Solr-main-MacOSX/solr/core/build/tmp/tests-tmp/solr.core.TestConfigSetService_521979C7114E10FB-001/configsets-001/testconfig/solrconfig.xml), InputStream(/Users/jenkins/workspace/Solr-main-MacOSX/solr/core/build/tmp/tests-tmp/solr.core.TestConfigSetService_521979C7114E10FB-001/configsets-001/testconfig/subdir/file4), InputStream(/Users/jenkins/workspace/Solr-main-MacOSX/solr/core/build/tmp/tests-tmp/solr.core.TestConfigSetService_521979C7114E10FB-001/configsets-001/testconfig/file1)]
	at __randomizedtesting.SeedInfo.seed([521979C7114E10FB]:0)
	at org.apache.lucene.tests.mockfile.LeakFS.onClose(LeakFS.java:63)
	at org.apache.lucene.tests.mockfile.FilterFileSystem.close(FilterFileSystem.java:69)
	at org.apache.lucene.tests.mockfile.FilterFileSystem.close(FilterFileSystem.java:70)
	at org.apache.lucene.tests.util.TestRuleTemporaryFilesCleanup.afterAlways(TestRuleTemporaryFilesCleanup.java:223)
	at com.carrotsearch.randomizedtesting.rules.TestRuleAdapter$1.afterAlways(TestRuleAdapter.java:31)
	at com.carrotsearch.randomizedtesting.rules.StatementAdapter.evaluate(StatementAdapter.java:43)
	at com.carrotsearch.randomizedtesting.rules.StatementAdapter.evaluate(StatementAdapter.java:36)
	at org.apache.lucene.tests.util.TestRuleAssertionsRequired$1.evaluate(TestRuleAssertionsRequired.java:53)
	at org.apache.lucene.tests.util.AbstractBeforeAfterRule$1.evaluate(AbstractBeforeAfterRule.java:43)
	at org.apache.lucene.tests.util.TestRuleMarkFailure$1.evaluate(TestRuleMarkFailure.java:44)
	at org.apache.lucene.tests.util.TestRuleIgnoreAfterMaxFailures$1.evaluate(TestRuleIgnoreAfterMaxFailures.java:60)
	at org.apache.lucene.tests.util.TestRuleIgnoreTestSuites$1.evaluate(TestRuleIgnoreTestSuites.java:47)
	at org.junit.rules.RunRules.evaluate(RunRules.java:20)
	at com.carrotsearch.randomizedtesting.rules.StatementAdapter.evaluate(StatementAdapter.java:36)
	at com.carrotsearch.randomizedtesting.ThreadLeakControl$StatementRunner.run(ThreadLeakControl.java:390)
	at com.carrotsearch.randomizedtesting.ThreadLeakControl.lambda$forkTimeoutingTask$0(ThreadLeakControl.java:850)
	at java.base/java.lang.Thread.run(Thread.java:1589)
Caused by: java.lang.Exception
	at org.apache.lucene.tests.mockfile.LeakFS.onOpen(LeakFS.java:46)
	at org.apache.lucene.tests.mockfile.HandleTrackingFS.callOpenHook(HandleTrackingFS.java:82)
	at org.apache.lucene.tests.mockfile.HandleTrackingFS.newInputStream(HandleTrackingFS.java:125)
	at org.apache.lucene.tests.mockfile.FilterFileSystemProvider.newInputStream(FilterFileSystemProvider.java:193)
	at org.apache.lucene.tests.mockfile.HandleTrackingFS.newInputStream(HandleTrackingFS.java:94)
	at java.base/java.nio.file.Files.newInputStream(Files.java:160)
	at org.apache.solr.core.FileSystemConfigSetService$2.visitFile(FileSystemConfigSetService.java:217)
	at org.apache.solr.core.FileSystemConfigSetService$2.visitFile(FileSystemConfigSetService.java:201)
	at java.base/java.nio.file.Files.walkFileTree(Files.java:2810)
	at java.base/java.nio.file.Files.walkFileTree(Files.java:2881)
	at org.apache.solr.core.FileSystemConfigSetService.copyRecursively(FileSystemConfigSetService.java:199)
	at org.apache.solr.core.FileSystemConfigSetService.copyConfig(FileSystemConfigSetService.java:114)
	at org.apache.solr.core.TestConfigSetService.testConfigSetServiceOperations(TestConfigSetService.java:113)
	at java.base/jdk.internal.reflect.DirectMethodHandleAccessor.invoke(DirectMethodHandleAccessor.java:104)
	at java.base/java.lang.reflect.Method.invoke(Method.java:578)
	at com.carrotsearch.randomizedtesting.RandomizedRunner.invoke(RandomizedRunner.java:1758)
	at com.carrotsearch.randomizedtesting.RandomizedRunner$8.evaluate(RandomizedRunner.java:946)
	at com.carrotsearch.randomizedtesting.RandomizedRunner$9.evaluate(RandomizedRunner.java:982)
	at com.carrotsearch.randomizedtesting.RandomizedRunner$10.evaluate(RandomizedRunner.java:996)
	at com.carrotsearch.randomizedtesting.rules.SystemPropertiesRestoreRule$1.evaluate(SystemPropertiesRestoreRule.java:80)
	at org.junit.rules.RunRules.evaluate(RunRules.java:20)
	at org.apache.lucene.tests.util.TestRuleSetupTeardownChained$1.evaluate(TestRuleSetupTeardownChained.java:48)
	at org.apache.lucene.tests.util.AbstractBeforeAfterRule$1.evaluate(AbstractBeforeAfterRule.java:43)
	at org.apache.lucene.tests.util.TestRuleThreadAndTestName$1.evaluate(TestRuleThreadAndTestName.java:45)
	at org.apache.lucene.tests.util.TestRuleIgnoreAfterMaxFailures$1.evaluate(TestRuleIgnoreAfterMaxFailures.java:60)
	at org.apache.lucene.tests.util.TestRuleMarkFailure$1.evaluate(TestRuleMarkFailure.java:44)
	at org.junit.rules.RunRules.evaluate(RunRules.java:20)
	at com.carrotsearch.randomizedtesting.rules.StatementAdapter.evaluate(StatementAdapter.java:36)
	at com.carrotsearch.randomizedtesting.ThreadLeakControl$StatementRunner.run(ThreadLeakControl.java:390)
	at com.carrotsearch.randomizedtesting.ThreadLeakControl.forkTimeoutingTask(ThreadLeakControl.java:843)
	at com.carrotsearch.randomizedtesting.ThreadLeakControl$3.evaluate(ThreadLeakControl.java:490)
	at com.carrotsearch.randomizedtesting.RandomizedRunner.runSingleTest(RandomizedRunner.java:955)
	at com.carrotsearch.randomizedtesting.RandomizedRunner$5.evaluate(RandomizedRunner.java:840)
	at com.carrotsearch.randomizedtesting.RandomizedRunner$6.evaluate(RandomizedRunner.java:891)
	at com.carrotsearch.randomizedtesting.RandomizedRunner$7.evaluate(RandomizedRunner.java:902)
	at com.carrotsearch.randomizedtesting.rules.StatementAdapter.evaluate(StatementAdapter.java:36)
	at com.carrotsearch.randomizedtesting.rules.StatementAdapter.evaluate(StatementAdapter.java:36)
	at org.apache.lucene.tests.util.AbstractBeforeAfterRule$1.evaluate(AbstractBeforeAfterRule.java:43)
	at com.carrotsearch.randomizedtesting.rules.SystemPropertiesRestoreRule$1.evaluate(SystemPropertiesRestoreRule.java:80)
	at org.junit.rules.RunRules.evaluate(RunRules.java:20)
	at org.apache.lucene.tests.util.AbstractBeforeAfterRule$1.evaluate(AbstractBeforeAfterRule.java:43)
	at com.carrotsearch.randomizedtesting.rules.StatementAdapter.evaluate(StatementAdapter.java:36)
	at org.apache.lucene.tests.util.TestRuleStoreClassName$1.evaluate(TestRuleStoreClassName.java:38)
	at com.carrotsearch.randomizedtesting.rules.NoShadowingOrOverridesOnMethodsRule$1.evaluate(NoShadowingOrOverridesOnMethodsRule.java:40)
	at com.carrotsearch.randomizedtesting.rules.NoShadowingOrOverridesOnMethodsRule$1.evaluate(NoShadowingOrOverridesOnMethodsRule.java:40)
	at com.carrotsearch.randomizedtesting.rules.StatementAdapter.evaluate(StatementAdapter.java:36)
	... 11 more


FAILED:  org.apache.solr.core.TestFileSystemConfigSetService.classMethod

Error Message:
java.lang.RuntimeException: file handle leaks: [InputStream(/Users/jenkins/workspace/Solr-main-MacOSX/solr/core/build/tmp/tests-tmp/solr.core.TestFileSystemConfigSetService_521979C7114E10FB-001/tempDir-001/testconfig/schema.xml), InputStream(/Users/jenkins/workspace/Solr-main-MacOSX/solr/core/build/tmp/tests-tmp/solr.core.TestFileSystemConfigSetService_521979C7114E10FB-001/tempDir-001/testconfig/solrconfig.xml), InputStream(/Users/jenkins/workspace/Solr-main-MacOSX/solr/core/build/tmp/tests-tmp/solr.core.TestFileSystemConfigSetService_521979C7114E10FB-001/tempDir-001/testconfig/schema.xml), InputStream(/Users/jenkins/workspace/Solr-main-MacOSX/solr/core/build/tmp/tests-tmp/solr.core.TestFileSystemConfigSetService_521979C7114E10FB-001/tempDir-001/testconfig/solrconfig.xml)]

Stack Trace:
java.lang.RuntimeException: file handle leaks: [InputStream(/Users/jenkins/workspace/Solr-main-MacOSX/solr/core/build/tmp/tests-tmp/solr.core.TestFileSystemConfigSetService_521979C7114E10FB-001/tempDir-001/testconfig/schema.xml), InputStream(/Users/jenkins/workspace/Solr-main-MacOSX/solr/core/build/tmp/tests-tmp/solr.core.TestFileSystemConfigSetService_521979C7114E10FB-001/tempDir-001/testconfig/solrconfig.xml), InputStream(/Users/jenkins/workspace/Solr-main-MacOSX/solr/core/build/tmp/tests-tmp/solr.core.TestFileSystemConfigSetService_521979C7114E10FB-001/tempDir-001/testconfig/schema.xml), InputStream(/Users/jenkins/workspace/Solr-main-MacOSX/solr/core/build/tmp/tests-tmp/solr.core.TestFileSystemConfigSetService_521979C7114E10FB-001/tempDir-001/testconfig/solrconfig.xml)]
	at __randomizedtesting.SeedInfo.seed([521979C7114E10FB]:0)
	at org.apache.lucene.tests.mockfile.LeakFS.onClose(LeakFS.java:63)
	at org.apache.lucene.tests.mockfile.FilterFileSystem.close(FilterFileSystem.java:69)
	at org.apache.lucene.tests.mockfile.FilterFileSystem.close(FilterFileSystem.java:70)
	at org.apache.lucene.tests.util.TestRuleTemporaryFilesCleanup.afterAlways(TestRuleTemporaryFilesCleanup.java:223)
	at com.carrotsearch.randomizedtesting.rules.TestRuleAdapter$1.afterAlways(TestRuleAdapter.java:31)
	at com.carrotsearch.randomizedtesting.rules.StatementAdapter.evaluate(StatementAdapter.java:43)
	at com.carrotsearch.randomizedtesting.rules.StatementAdapter.evaluate(StatementAdapter.java:36)
	at org.apache.lucene.tests.util.TestRuleAssertionsRequired$1.evaluate(TestRuleAssertionsRequired.java:53)
	at org.apache.lucene.tests.util.AbstractBeforeAfterRule$1.evaluate(AbstractBeforeAfterRule.java:43)
	at org.apache.lucene.tests.util.TestRuleMarkFailure$1.evaluate(TestRuleMarkFailure.java:44)
	at org.apache.lucene.tests.util.TestRuleIgnoreAfterMaxFailures$1.evaluate(TestRuleIgnoreAfterMaxFailures.java:60)
	at org.apache.lucene.tests.util.TestRuleIgnoreTestSuites$1.evaluate(TestRuleIgnoreTestSuites.java:47)
	at org.junit.rules.RunRules.evaluate(RunRules.java:20)
	at com.carrotsearch.randomizedtesting.rules.StatementAdapter.evaluate(StatementAdapter.java:36)
	at com.carrotsearch.randomizedtesting.ThreadLeakControl$StatementRunner.run(ThreadLeakControl.java:390)
	at com.carrotsearch.randomizedtesting.ThreadLeakControl.lambda$forkTimeoutingTask$0(ThreadLeakControl.java:850)
	at java.base/java.lang.Thread.run(Thread.java:1589)
Caused by: java.lang.Exception
	at org.apache.lucene.tests.mockfile.LeakFS.onOpen(LeakFS.java:46)
	at org.apache.lucene.tests.mockfile.HandleTrackingFS.callOpenHook(HandleTrackingFS.java:82)
	at org.apache.lucene.tests.mockfile.HandleTrackingFS.newInputStream(HandleTrackingFS.java:125)
	at org.apache.lucene.tests.mockfile.FilterFileSystemProvider.newInputStream(FilterFileSystemProvider.java:193)
	at org.apache.lucene.tests.mockfile.HandleTrackingFS.newInputStream(HandleTrackingFS.java:94)
	at java.base/java.nio.file.Files.newInputStream(Files.java:160)
	at org.apache.solr.core.FileSystemConfigSetService$2.visitFile(FileSystemConfigSetService.java:217)
	at org.apache.solr.core.FileSystemConfigSetService$2.visitFile(FileSystemConfigSetService.java:201)
	at java.base/java.nio.file.Files.walkFileTree(Files.java:2810)
	at java.base/java.nio.file.Files.walkFileTree(Files.java:2881)
	at org.apache.solr.core.FileSystemConfigSetService.copyRecursively(FileSystemConfigSetService.java:199)
	at org.apache.solr.core.FileSystemConfigSetService.copyConfig(FileSystemConfigSetService.java:114)
	at org.apache.solr.core.TestFileSystemConfigSetService.testUploadAndDeleteConfig(TestFileSystemConfigSetService.java:79)
	at java.base/jdk.internal.reflect.DirectMethodHandleAccessor.invoke(DirectMethodHandleAccessor.java:104)
	at java.base/java.lang.reflect.Method.invoke(Method.java:578)
	at com.carrotsearch.randomizedtesting.RandomizedRunner.invoke(RandomizedRunner.java:1758)
	at com.carrotsearch.randomizedtesting.RandomizedRunner$8.evaluate(RandomizedRunner.java:946)
	at com.carrotsearch.randomizedtesting.RandomizedRunner$9.evaluate(RandomizedRunner.java:982)
	at com.carrotsearch.randomizedtesting.RandomizedRunner$10.evaluate(RandomizedRunner.java:996)
	at com.carrotsearch.randomizedtesting.rules.SystemPropertiesRestoreRule$1.evaluate(SystemPropertiesRestoreRule.java:80)
	at org.junit.rules.RunRules.evaluate(RunRules.java:20)
	at org.apache.lucene.tests.util.TestRuleSetupTeardownChained$1.evaluate(TestRuleSetupTeardownChained.java:48)
	at org.apache.lucene.tests.util.AbstractBeforeAfterRule$1.evaluate(AbstractBeforeAfterRule.java:43)
	at org.apache.lucene.tests.util.TestRuleThreadAndTestName$1.evaluate(TestRuleThreadAndTestName.java:45)
	at org.apache.lucene.tests.util.TestRuleIgnoreAfterMaxFailures$1.evaluate(TestRuleIgnoreAfterMaxFailures.java:60)
	at org.apache.lucene.tests.util.TestRuleMarkFailure$1.evaluate(TestRuleMarkFailure.java:44)
	at org.junit.rules.RunRules.evaluate(RunRules.java:20)
	at com.carrotsearch.randomizedtesting.rules.StatementAdapter.evaluate(StatementAdapter.java:36)
	at com.carrotsearch.randomizedtesting.ThreadLeakControl$StatementRunner.run(ThreadLeakControl.java:390)
	at com.carrotsearch.randomizedtesting.ThreadLeakControl.forkTimeoutingTask(ThreadLeakControl.java:843)
	at com.carrotsearch.randomizedtesting.ThreadLeakControl$3.evaluate(ThreadLeakControl.java:490)
	at com.carrotsearch.randomizedtesting.RandomizedRunner.runSingleTest(RandomizedRunner.java:955)
	at com.carrotsearch.randomizedtesting.RandomizedRunner$5.evaluate(RandomizedRunner.java:840)
	at com.carrotsearch.randomizedtesting.RandomizedRunner$6.evaluate(RandomizedRunner.java:891)
	at com.carrotsearch.randomizedtesting.RandomizedRunner$7.evaluate(RandomizedRunner.java:902)
	at com.carrotsearch.randomizedtesting.rules.StatementAdapter.evaluate(StatementAdapter.java:36)
	at com.carrotsearch.randomizedtesting.rules.StatementAdapter.evaluate(StatementAdapter.java:36)
	at org.apache.lucene.tests.util.AbstractBeforeAfterRule$1.evaluate(AbstractBeforeAfterRule.java:43)
	at com.carrotsearch.randomizedtesting.rules.SystemPropertiesRestoreRule$1.evaluate(SystemPropertiesRestoreRule.java:80)
	at org.junit.rules.RunRules.evaluate(RunRules.java:20)
	at org.apache.lucene.tests.util.AbstractBeforeAfterRule$1.evaluate(AbstractBeforeAfterRule.java:43)
	at com.carrotsearch.randomizedtesting.rules.StatementAdapter.evaluate(StatementAdapter.java:36)
	at org.apache.lucene.tests.util.TestRuleStoreClassName$1.evaluate(TestRuleStoreClassName.java:38)
	at com.carrotsearch.randomizedtesting.rules.NoShadowingOrOverridesOnMethodsRule$1.evaluate(NoShadowingOrOverridesOnMethodsRule.java:40)
	at com.carrotsearch.randomizedtesting.rules.NoShadowingOrOverridesOnMethodsRule$1.evaluate(NoShadowingOrOverridesOnMethodsRule.java:40)
	at com.carrotsearch.randomizedtesting.rules.StatementAdapter.evaluate(StatementAdapter.java:36)
	... 11 more


FAILED:  org.apache.solr.hdfs.cloud.api.collections.HdfsCloudIncrementalBackupTest.testRestoreToOriginalCollection

Error Message:
java.lang.AssertionError: expected:<COMPLETED> but was:<RUNNING>

Stack Trace:
java.lang.AssertionError: expected:<COMPLETED> but was:<RUNNING>
	at __randomizedtesting.SeedInfo.seed([521979C7114E10FB:67ED929CFA9226A5]:0)
	at org.junit.Assert.fail(Assert.java:89)
	at org.junit.Assert.failNotEquals(Assert.java:835)
	at org.junit.Assert.assertEquals(Assert.java:120)
	at org.junit.Assert.assertEquals(Assert.java:146)
	at org.apache.solr.cloud.api.collections.AbstractIncrementalBackupTest.testRestoreToOriginalCollection(AbstractIncrementalBackupTest.java:227)
	at java.base/jdk.internal.reflect.DirectMethodHandleAccessor.invoke(DirectMethodHandleAccessor.java:104)
	at java.base/java.lang.reflect.Method.invoke(Method.java:578)
	at com.carrotsearch.randomizedtesting.RandomizedRunner.invoke(RandomizedRunner.java:1758)
	at com.carrotsearch.randomizedtesting.RandomizedRunner$8.evaluate(RandomizedRunner.java:946)
	at com.carrotsearch.randomizedtesting.RandomizedRunner$9.evaluate(RandomizedRunner.java:982)
	at com.carrotsearch.randomizedtesting.RandomizedRunner$10.evaluate(RandomizedRunner.java:996)
	at com.carrotsearch.randomizedtesting.rules.SystemPropertiesRestoreRule$1.evaluate(SystemPropertiesRestoreRule.java:80)
	at org.junit.rules.RunRules.evaluate(RunRules.java:20)
	at org.apache.lucene.tests.util.TestRuleSetupTeardownChained$1.evaluate(TestRuleSetupTeardownChained.java:48)
	at org.apache.lucene.tests.util.AbstractBeforeAfterRule$1.evaluate(AbstractBeforeAfterRule.java:43)
	at org.apache.lucene.tests.util.TestRuleThreadAndTestName$1.evaluate(TestRuleThreadAndTestName.java:45)
	at org.apache.lucene.tests.util.TestRuleIgnoreAfterMaxFailures$1.evaluate(TestRuleIgnoreAfterMaxFailures.java:60)
	at org.apache.lucene.tests.util.TestRuleMarkFailure$1.evaluate(TestRuleMarkFailure.java:44)
	at org.junit.rules.RunRules.evaluate(RunRules.java:20)
	at com.carrotsearch.randomizedtesting.rules.StatementAdapter.evaluate(StatementAdapter.java:36)
	at com.carrotsearch.randomizedtesting.ThreadLeakControl$StatementRunner.run(ThreadLeakControl.java:390)
	at com.carrotsearch.randomizedtesting.ThreadLeakControl.forkTimeoutingTask(ThreadLeakControl.java:843)
	at com.carrotsearch.randomizedtesting.ThreadLeakControl$3.evaluate(ThreadLeakControl.java:490)
	at com.carrotsearch.randomizedtesting.RandomizedRunner.runSingleTest(RandomizedRunner.java:955)
	at com.carrotsearch.randomizedtesting.RandomizedRunner$5.evaluate(RandomizedRunner.java:840)
	at com.carrotsearch.randomizedtesting.RandomizedRunner$6.evaluate(RandomizedRunner.java:891)
	at com.carrotsearch.randomizedtesting.RandomizedRunner$7.evaluate(RandomizedRunner.java:902)
	at com.carrotsearch.randomizedtesting.rules.StatementAdapter.evaluate(StatementAdapter.java:36)
	at com.carrotsearch.randomizedtesting.rules.StatementAdapter.evaluate(StatementAdapter.java:36)
	at org.apache.lucene.tests.util.AbstractBeforeAfterRule$1.evaluate(AbstractBeforeAfterRule.java:43)
	at com.carrotsearch.randomizedtesting.rules.SystemPropertiesRestoreRule$1.evaluate(SystemPropertiesRestoreRule.java:80)
	at org.junit.rules.RunRules.evaluate(RunRules.java:20)
	at org.apache.lucene.tests.util.AbstractBeforeAfterRule$1.evaluate(AbstractBeforeAfterRule.java:43)
	at com.carrotsearch.randomizedtesting.rules.StatementAdapter.evaluate(StatementAdapter.java:36)
	at org.apache.lucene.tests.util.TestRuleStoreClassName$1.evaluate(TestRuleStoreClassName.java:38)
	at com.carrotsearch.randomizedtesting.rules.NoShadowingOrOverridesOnMethodsRule$1.evaluate(NoShadowingOrOverridesOnMethodsRule.java:40)
	at com.carrotsearch.randomizedtesting.rules.NoShadowingOrOverridesOnMethodsRule$1.evaluate(NoShadowingOrOverridesOnMethodsRule.java:40)
	at com.carrotsearch.randomizedtesting.rules.StatementAdapter.evaluate(StatementAdapter.java:36)
	at com.carrotsearch.randomizedtesting.rules.StatementAdapter.evaluate(StatementAdapter.java:36)
	at org.apache.lucene.tests.util.TestRuleAssertionsRequired$1.evaluate(TestRuleAssertionsRequired.java:53)
	at org.apache.lucene.tests.util.AbstractBeforeAfterRule$1.evaluate(AbstractBeforeAfterRule.java:43)
	at org.apache.lucene.tests.util.TestRuleMarkFailure$1.evaluate(TestRuleMarkFailure.java:44)
	at org.apache.lucene.tests.util.TestRuleIgnoreAfterMaxFailures$1.evaluate(TestRuleIgnoreAfterMaxFailures.java:60)
	at org.apache.lucene.tests.util.TestRuleIgnoreTestSuites$1.evaluate(TestRuleIgnoreTestSuites.java:47)
	at org.junit.rules.RunRules.evaluate(RunRules.java:20)
	at com.carrotsearch.randomizedtesting.rules.StatementAdapter.evaluate(StatementAdapter.java:36)
	at com.carrotsearch.randomizedtesting.ThreadLeakControl$StatementRunner.run(ThreadLeakControl.java:390)
	at com.carrotsearch.randomizedtesting.ThreadLeakControl.lambda$forkTimeoutingTask$0(ThreadLeakControl.java:850)
	at java.base/java.lang.Thread.run(Thread.java:1589)


FAILED:  org.apache.solr.s3.S3IncrementalBackupTest.testRestoreToOriginalCollection

Error Message:
java.lang.AssertionError: expected:<COMPLETED> but was:<RUNNING>

Stack Trace:
java.lang.AssertionError: expected:<COMPLETED> but was:<RUNNING>
	at __randomizedtesting.SeedInfo.seed([521979C7114E10FB:67ED929CFA9226A5]:0)
	at org.junit.Assert.fail(Assert.java:89)
	at org.junit.Assert.failNotEquals(Assert.java:835)
	at org.junit.Assert.assertEquals(Assert.java:120)
	at org.junit.Assert.assertEquals(Assert.java:146)
	at org.apache.solr.cloud.api.collections.AbstractIncrementalBackupTest.testRestoreToOriginalCollection(AbstractIncrementalBackupTest.java:212)
	at java.base/jdk.internal.reflect.DirectMethodHandleAccessor.invoke(DirectMethodHandleAccessor.java:104)
	at java.base/java.lang.reflect.Method.invoke(Method.java:578)
	at com.carrotsearch.randomizedtesting.RandomizedRunner.invoke(RandomizedRunner.java:1758)
	at com.carrotsearch.randomizedtesting.RandomizedRunner$8.evaluate(RandomizedRunner.java:946)
	at com.carrotsearch.randomizedtesting.RandomizedRunner$9.evaluate(RandomizedRunner.java:982)
	at com.carrotsearch.randomizedtesting.RandomizedRunner$10.evaluate(RandomizedRunner.java:996)
	at com.carrotsearch.randomizedtesting.rules.SystemPropertiesRestoreRule$1.evaluate(SystemPropertiesRestoreRule.java:80)
	at org.junit.rules.RunRules.evaluate(RunRules.java:20)
	at org.apache.lucene.tests.util.TestRuleSetupTeardownChained$1.evaluate(TestRuleSetupTeardownChained.java:48)
	at org.apache.lucene.tests.util.AbstractBeforeAfterRule$1.evaluate(AbstractBeforeAfterRule.java:43)
	at org.apache.lucene.tests.util.TestRuleThreadAndTestName$1.evaluate(TestRuleThreadAndTestName.java:45)
	at org.apache.lucene.tests.util.TestRuleIgnoreAfterMaxFailures$1.evaluate(TestRuleIgnoreAfterMaxFailures.java:60)
	at org.apache.lucene.tests.util.TestRuleMarkFailure$1.evaluate(TestRuleMarkFailure.java:44)
	at org.junit.rules.RunRules.evaluate(RunRules.java:20)
	at com.carrotsearch.randomizedtesting.rules.StatementAdapter.evaluate(StatementAdapter.java:36)
	at com.carrotsearch.randomizedtesting.ThreadLeakControl$StatementRunner.run(ThreadLeakControl.java:390)
	at com.carrotsearch.randomizedtesting.ThreadLeakControl.forkTimeoutingTask(ThreadLeakControl.java:843)
	at com.carrotsearch.randomizedtesting.ThreadLeakControl$3.evaluate(ThreadLeakControl.java:490)
	at com.carrotsearch.randomizedtesting.RandomizedRunner.runSingleTest(RandomizedRunner.java:955)
	at com.carrotsearch.randomizedtesting.RandomizedRunner$5.evaluate(RandomizedRunner.java:840)
	at com.carrotsearch.randomizedtesting.RandomizedRunner$6.evaluate(RandomizedRunner.java:891)
	at com.carrotsearch.randomizedtesting.RandomizedRunner$7.evaluate(RandomizedRunner.java:902)
	at com.adobe.testing.s3mock.junit4.S3MockRule$1.evaluate(S3MockRule.java:66)
	at com.carrotsearch.randomizedtesting.rules.StatementAdapter.evaluate(StatementAdapter.java:36)
	at com.carrotsearch.randomizedtesting.rules.StatementAdapter.evaluate(StatementAdapter.java:36)
	at org.apache.lucene.tests.util.AbstractBeforeAfterRule$1.evaluate(AbstractBeforeAfterRule.java:43)
	at com.carrotsearch.randomizedtesting.rules.SystemPropertiesRestoreRule$1.evaluate(SystemPropertiesRestoreRule.java:80)
	at org.junit.rules.RunRules.evaluate(RunRules.java:20)
	at org.apache.lucene.tests.util.AbstractBeforeAfterRule$1.evaluate(AbstractBeforeAfterRule.java:43)
	at com.carrotsearch.randomizedtesting.rules.StatementAdapter.evaluate(StatementAdapter.java:36)
	at org.apache.lucene.tests.util.TestRuleStoreClassName$1.evaluate(TestRuleStoreClassName.java:38)
	at com.carrotsearch.randomizedtesting.rules.NoShadowingOrOverridesOnMethodsRule$1.evaluate(NoShadowingOrOverridesOnMethodsRule.java:40)
	at com.carrotsearch.randomizedtesting.rules.NoShadowingOrOverridesOnMethodsRule$1.evaluate(NoShadowingOrOverridesOnMethodsRule.java:40)
	at com.carrotsearch.randomizedtesting.rules.StatementAdapter.evaluate(StatementAdapter.java:36)
	at com.carrotsearch.randomizedtesting.rules.StatementAdapter.evaluate(StatementAdapter.java:36)
	at org.apache.lucene.tests.util.TestRuleAssertionsRequired$1.evaluate(TestRuleAssertionsRequired.java:53)
	at org.apache.lucene.tests.util.AbstractBeforeAfterRule$1.evaluate(AbstractBeforeAfterRule.java:43)
	at org.apache.lucene.tests.util.TestRuleMarkFailure$1.evaluate(TestRuleMarkFailure.java:44)
	at org.apache.lucene.tests.util.TestRuleIgnoreAfterMaxFailures$1.evaluate(TestRuleIgnoreAfterMaxFailures.java:60)
	at org.apache.lucene.tests.util.TestRuleIgnoreTestSuites$1.evaluate(TestRuleIgnoreTestSuites.java:47)
	at org.junit.rules.RunRules.evaluate(RunRules.java:20)
	at com.carrotsearch.randomizedtesting.rules.StatementAdapter.evaluate(StatementAdapter.java:36)
	at com.carrotsearch.randomizedtesting.ThreadLeakControl$StatementRunner.run(ThreadLeakControl.java:390)
	at com.carrotsearch.randomizedtesting.ThreadLeakControl.lambda$forkTimeoutingTask$0(ThreadLeakControl.java:850)
	at java.base/java.lang.Thread.run(Thread.java:1589)


FAILED:  org.apache.solr.s3.S3IncrementalBackupTest.testSkipConfigset

Error Message:
java.lang.AssertionError: Configset shouldn't be part of the backup but found:
s3:/mytestbackuptestbackuprestoretooriginal/backuprestore_testbackuprestoretooriginal/zk_backup_0/
s3:/mytestbackuptestbackuprestoretooriginal/backuprestore_testbackuprestoretooriginal/zk_backup_0/configs/
s3:/mytestbackuptestbackuprestoretooriginal/backuprestore_testbackuprestoretooriginal/zk_backup_0/configs/conf1/
s3:/mytestbackuptestskipconfigset/
s3:/mytestbackuptestskipconfigset/backuprestore_testskipconfigset/
s3:/mytestbackuptestskipconfigset/backuprestore_testskipconfigset/
s3:/mytestbackuptestskipconfigset/backuprestore_testskipconfigset/index/
s3:/mytestbackuptestskipconfigset/backuprestore_testskipconfigset/shard_backup_metadata/
s3:/mytestbackuptestskipconfigset/backuprestore_testskipconfigset/
s3:/mytestbackuptestskipconfigset/backuprestore_testskipconfigset/
s3:/mytestbackuptestskipconfigset/backuprestore_testskipconfigset/zk_backup_0/

Stack Trace:
java.lang.AssertionError: Configset shouldn't be part of the backup but found:
s3:/mytestbackuptestbackuprestoretooriginal/backuprestore_testbackuprestoretooriginal/zk_backup_0/
s3:/mytestbackuptestbackuprestoretooriginal/backuprestore_testbackuprestoretooriginal/zk_backup_0/configs/
s3:/mytestbackuptestbackuprestoretooriginal/backuprestore_testbackuprestoretooriginal/zk_backup_0/configs/conf1/
s3:/mytestbackuptestskipconfigset/
s3:/mytestbackuptestskipconfigset/backuprestore_testskipconfigset/
s3:/mytestbackuptestskipconfigset/backuprestore_testskipconfigset/
s3:/mytestbackuptestskipconfigset/backuprestore_testskipconfigset/index/
s3:/mytestbackuptestskipconfigset/backuprestore_testskipconfigset/shard_backup_metadata/
s3:/mytestbackuptestskipconfigset/backuprestore_testskipconfigset/
s3:/mytestbackuptestskipconfigset/backuprestore_testskipconfigset/
s3:/mytestbackuptestskipconfigset/backuprestore_testskipconfigset/zk_backup_0/
	at __randomizedtesting.SeedInfo.seed([521979C7114E10FB:59E0E6CE890C46EC]:0)
	at org.junit.Assert.fail(Assert.java:89)
	at org.junit.Assert.assertTrue(Assert.java:42)
	at org.junit.Assert.assertFalse(Assert.java:65)
	at org.apache.solr.cloud.api.collections.AbstractIncrementalBackupTest.testSkipConfigset(AbstractIncrementalBackupTest.java:375)
	at java.base/jdk.internal.reflect.DirectMethodHandleAccessor.invoke(DirectMethodHandleAccessor.java:104)
	at java.base/java.lang.reflect.Method.invoke(Method.java:578)
	at com.carrotsearch.randomizedtesting.RandomizedRunner.invoke(RandomizedRunner.java:1758)
	at com.carrotsearch.randomizedtesting.RandomizedRunner$8.evaluate(RandomizedRunner.java:946)
	at com.carrotsearch.randomizedtesting.RandomizedRunner$9.evaluate(RandomizedRunner.java:982)
	at com.carrotsearch.randomizedtesting.RandomizedRunner$10.evaluate(RandomizedRunner.java:996)
	at com.carrotsearch.randomizedtesting.rules.SystemPropertiesRestoreRule$1.evaluate(SystemPropertiesRestoreRule.java:80)
	at org.junit.rules.RunRules.evaluate(RunRules.java:20)
	at org.apache.lucene.tests.util.TestRuleSetupTeardownChained$1.evaluate(TestRuleSetupTeardownChained.java:48)
	at org.apache.lucene.tests.util.AbstractBeforeAfterRule$1.evaluate(AbstractBeforeAfterRule.java:43)
	at org.apache.lucene.tests.util.TestRuleThreadAndTestName$1.evaluate(TestRuleThreadAndTestName.java:45)
	at org.apache.lucene.tests.util.TestRuleIgnoreAfterMaxFailures$1.evaluate(TestRuleIgnoreAfterMaxFailures.java:60)
	at org.apache.lucene.tests.util.TestRuleMarkFailure$1.evaluate(TestRuleMarkFailure.java:44)
	at org.junit.rules.RunRules.evaluate(RunRules.java:20)
	at com.carrotsearch.randomizedtesting.rules.StatementAdapter.evaluate(StatementAdapter.java:36)
	at com.carrotsearch.randomizedtesting.ThreadLeakControl$StatementRunner.run(ThreadLeakControl.java:390)
	at com.carrotsearch.randomizedtesting.ThreadLeakControl.forkTimeoutingTask(ThreadLeakControl.java:843)
	at com.carrotsearch.randomizedtesting.ThreadLeakControl$3.evaluate(ThreadLeakControl.java:490)
	at com.carrotsearch.randomizedtesting.RandomizedRunner.runSingleTest(RandomizedRunner.java:955)
	at com.carrotsearch.randomizedtesting.RandomizedRunner$5.evaluate(RandomizedRunner.java:840)
	at com.carrotsearch.randomizedtesting.RandomizedRunner$6.evaluate(RandomizedRunner.java:891)
	at com.carrotsearch.randomizedtesting.RandomizedRunner$7.evaluate(RandomizedRunner.java:902)
	at com.adobe.testing.s3mock.junit4.S3MockRule$1.evaluate(S3MockRule.java:66)
	at com.carrotsearch.randomizedtesting.rules.StatementAdapter.evaluate(StatementAdapter.java:36)
	at com.carrotsearch.randomizedtesting.rules.StatementAdapter.evaluate(StatementAdapter.java:36)
	at org.apache.lucene.tests.util.AbstractBeforeAfterRule$1.evaluate(AbstractBeforeAfterRule.java:43)
	at com.carrotsearch.randomizedtesting.rules.SystemPropertiesRestoreRule$1.evaluate(SystemPropertiesRestoreRule.java:80)
	at org.junit.rules.RunRules.evaluate(RunRules.java:20)
	at org.apache.lucene.tests.util.AbstractBeforeAfterRule$1.evaluate(AbstractBeforeAfterRule.java:43)
	at com.carrotsearch.randomizedtesting.rules.StatementAdapter.evaluate(StatementAdapter.java:36)
	at org.apache.lucene.tests.util.TestRuleStoreClassName$1.evaluate(TestRuleStoreClassName.java:38)
	at com.carrotsearch.randomizedtesting.rules.NoShadowingOrOverridesOnMethodsRule$1.evaluate(NoShadowingOrOverridesOnMethodsRule.java:40)
	at com.carrotsearch.randomizedtesting.rules.NoShadowingOrOverridesOnMethodsRule$1.evaluate(NoShadowingOrOverridesOnMethodsRule.java:40)
	at com.carrotsearch.randomizedtesting.rules.StatementAdapter.evaluate(StatementAdapter.java:36)
	at com.carrotsearch.randomizedtesting.rules.StatementAdapter.evaluate(StatementAdapter.java:36)
	at org.apache.lucene.tests.util.TestRuleAssertionsRequired$1.evaluate(TestRuleAssertionsRequired.java:53)
	at org.apache.lucene.tests.util.AbstractBeforeAfterRule$1.evaluate(AbstractBeforeAfterRule.java:43)
	at org.apache.lucene.tests.util.TestRuleMarkFailure$1.evaluate(TestRuleMarkFailure.java:44)
	at org.apache.lucene.tests.util.TestRuleIgnoreAfterMaxFailures$1.evaluate(TestRuleIgnoreAfterMaxFailures.java:60)
	at org.apache.lucene.tests.util.TestRuleIgnoreTestSuites$1.evaluate(TestRuleIgnoreTestSuites.java:47)
	at org.junit.rules.RunRules.evaluate(RunRules.java:20)
	at com.carrotsearch.randomizedtesting.rules.StatementAdapter.evaluate(StatementAdapter.java:36)
	at com.carrotsearch.randomizedtesting.ThreadLeakControl$StatementRunner.run(ThreadLeakControl.java:390)
	at com.carrotsearch.randomizedtesting.ThreadLeakControl.lambda$forkTimeoutingTask$0(ThreadLeakControl.java:850)
	at java.base/java.lang.Thread.run(Thread.java:1589)