You are viewing a plain text version of this content. The canonical link for it is here.
Posted to builds@cassandra.apache.org by Apache Jenkins Server <je...@builds.apache.org> on 2022/08/22 22:58:45 UTC

Build complete: Cassandra-trunk #1286 [UNSTABLE] 6a6d2214e95d1b79d4d0068cd4b21a1a9eb8129a

-------------------------------------------------------------------------------
Build Cassandra-trunk #1286 Still Unstable
URL: https://ci-cassandra.apache.org/job/Cassandra-trunk/1286/
-------------------------------------------------------------------------------
Changes:
[Yifan Cai] ninja fix: NEWS.txt


-------------------------------------------------------------------------------
Failed Tests:
14 tests failed.
FAILED:  dtest-upgrade.upgrade_tests.upgrade_through_versions_test.TestProtoV3Upgrade_AllVersions_EndsAt_3_11_X.test_parallel_upgrade
FAILED:  org.apache.cassandra.distributed.test.CASTest.testSucccessfulWriteDuringRangeMovementFollowedByRead
FAILED:  org.apache.cassandra.tools.TopPartitionsTest.testStartAndStopScheduledSampling-compression
FAILED:  org.apache.cassandra.net.ConnectionTest.testMessageDeliveryOnReconnect-compression
FAILED:  org.apache.cassandra.distributed.test.CASTest.testConflictingWritesWithStaleRingInformation
FAILED:  org.apache.cassandra.tools.StandaloneUpgraderOnSStablesTest.testUpgradeSnapshot
FAILED:  org.apache.cassandra.tools.StandaloneUpgraderOnSStablesTest.testUpgradeSnapshot
FAILED:  org.apache.cassandra.tools.StandaloneUpgraderOnSStablesTest.testUpgradeSnapshot
FAILED:  org.apache.cassandra.tools.StandaloneUpgraderOnSStablesTest.testUpgradeSnapshot
FAILED:  org.apache.cassandra.tools.StandaloneUpgraderOnSStablesTest.testUpgradeSnapshot
FAILED:  org.apache.cassandra.tools.StandaloneUpgraderOnSStablesTest.testUpgradeSnapshot
FAILED:  org.apache.cassandra.tools.StandaloneUpgraderOnSStablesTest.testUpgradeSnapshot
FAILED:  dtest-large-novnode.replace_address_test.TestReplaceAddress.test_replace_active_node
FAILED:  dtest-large.replace_address_test.TestReplaceAddress.test_replace_active_node

-------------------------------------------------------------------------------
For complete test report and logs see https://nightlies.apache.org/cassandra/Cassandra-trunk/1286/