You are viewing a plain text version of this content. The canonical link for it is here.
Posted to dev@kafka.apache.org by Apache Jenkins Server <je...@builds.apache.org> on 2016/01/05 23:06:56 UTC
Build failed in Jenkins: kafka-trunk-jdk7 #937
See <https://builds.apache.org/job/kafka-trunk-jdk7/937/changes>
Changes:
[junrao] KAFKA-3010; Include error in log when ack 0
[junrao] KAFKA-3045; ZkNodeChangeNotificationListener shouldn't log
[junrao] KAFKA-3058; remove the usage of deprecated config properties
------------------------------------------
[...truncated 2789 lines...]
kafka.log.LogTest > testTruncateTo PASSED
kafka.log.LogTest > testCleanShutdownFile PASSED
kafka.log.OffsetIndexTest > lookupExtremeCases PASSED
kafka.log.OffsetIndexTest > appendTooMany PASSED
kafka.log.OffsetIndexTest > randomLookupTest PASSED
kafka.log.OffsetIndexTest > testReopen PASSED
kafka.log.OffsetIndexTest > appendOutOfOrder PASSED
kafka.log.OffsetIndexTest > truncate PASSED
kafka.log.LogSegmentTest > testRecoveryWithCorruptMessage PASSED
kafka.log.LogSegmentTest > testRecoveryFixesCorruptIndex PASSED
kafka.log.LogSegmentTest > testReadFromGap PASSED
kafka.log.LogSegmentTest > testTruncate PASSED
kafka.log.LogSegmentTest > testReadBeforeFirstOffset PASSED
kafka.log.LogSegmentTest > testCreateWithInitFileSizeAppendMessage PASSED
kafka.log.LogSegmentTest > testChangeFileSuffixes PASSED
kafka.log.LogSegmentTest > testMaxOffset PASSED
kafka.log.LogSegmentTest > testNextOffsetCalculation PASSED
kafka.log.LogSegmentTest > testReadOnEmptySegment PASSED
kafka.log.LogSegmentTest > testReadAfterLast PASSED
kafka.log.LogSegmentTest > testCreateWithInitFileSizeClearShutdown PASSED
kafka.log.LogSegmentTest > testTruncateFull PASSED
kafka.log.CleanerTest > testBuildOffsetMap PASSED
kafka.log.CleanerTest > testSegmentGrouping PASSED
kafka.log.CleanerTest > testCleanSegmentsWithAbort PASSED
kafka.log.CleanerTest > testSegmentGroupingWithSparseOffsets PASSED
kafka.log.CleanerTest > testRecoveryAfterCrash PASSED
kafka.log.CleanerTest > testLogToClean PASSED
kafka.log.CleanerTest > testCleaningWithDeletes PASSED
kafka.log.CleanerTest > testCleanSegments PASSED
kafka.log.CleanerTest > testCleaningWithUnkeyedMessages PASSED
kafka.log.OffsetMapTest > testClear PASSED
kafka.log.OffsetMapTest > testBasicValidation PASSED
kafka.coordinator.GroupCoordinatorResponseTest > testHeartbeatWrongCoordinator PASSED
kafka.coordinator.GroupCoordinatorResponseTest > testDescribeGroupStable PASSED
kafka.coordinator.GroupCoordinatorResponseTest > testHeartbeatIllegalGeneration PASSED
kafka.coordinator.GroupCoordinatorResponseTest > testDescribeGroupWrongCoordinator PASSED
kafka.coordinator.GroupCoordinatorResponseTest > testDescribeGroupRebalancing PASSED
kafka.coordinator.GroupCoordinatorResponseTest > testLeaderFailureInSyncGroup PASSED
kafka.coordinator.GroupCoordinatorResponseTest > testGenerationIdIncrementsOnRebalance PASSED
kafka.coordinator.GroupCoordinatorResponseTest > testSyncGroupFromIllegalGeneration PASSED
kafka.coordinator.GroupCoordinatorResponseTest > testInvalidGroupId PASSED
kafka.coordinator.GroupCoordinatorResponseTest > testHeartbeatUnknownGroup PASSED
kafka.coordinator.GroupCoordinatorResponseTest > testListGroupsIncludesStableGroups PASSED
kafka.coordinator.GroupCoordinatorResponseTest > testHeartbeatDuringRebalanceCausesRebalanceInProgress PASSED
kafka.coordinator.GroupCoordinatorResponseTest > testJoinGroupInconsistentGroupProtocol PASSED
kafka.coordinator.GroupCoordinatorResponseTest > testJoinGroupSessionTimeoutTooLarge PASSED
kafka.coordinator.GroupCoordinatorResponseTest > testJoinGroupSessionTimeoutTooSmall PASSED
kafka.coordinator.GroupCoordinatorResponseTest > testSyncGroupEmptyAssignment PASSED
kafka.coordinator.GroupCoordinatorResponseTest > testCommitOffsetWithDefaultGeneration PASSED
kafka.coordinator.GroupCoordinatorResponseTest > testJoinGroupFromUnchangedLeaderShouldRebalance PASSED
kafka.coordinator.GroupCoordinatorResponseTest > testHeartbeatRebalanceInProgress PASSED
kafka.coordinator.GroupCoordinatorResponseTest > testLeaveGroupUnknownGroup PASSED
kafka.coordinator.GroupCoordinatorResponseTest > testListGroupsIncludesRebalancingGroups PASSED
kafka.coordinator.GroupCoordinatorResponseTest > testSyncGroupFollowerAfterLeader PASSED
kafka.coordinator.GroupCoordinatorResponseTest > testCommitOffsetInAwaitingSync PASSED
kafka.coordinator.GroupCoordinatorResponseTest > testJoinGroupWrongCoordinator PASSED
kafka.coordinator.GroupCoordinatorResponseTest > testJoinGroupUnknownConsumerExistingGroup PASSED
kafka.coordinator.GroupCoordinatorResponseTest > testSyncGroupFromUnknownGroup PASSED
kafka.coordinator.GroupCoordinatorResponseTest > testJoinGroupInconsistentProtocolType PASSED
kafka.coordinator.GroupCoordinatorResponseTest > testCommitOffsetFromUnknownGroup PASSED
kafka.coordinator.GroupCoordinatorResponseTest > testLeaveGroupWrongCoordinator PASSED
kafka.coordinator.GroupCoordinatorResponseTest > testLeaveGroupUnknownConsumerExistingGroup PASSED
kafka.coordinator.GroupCoordinatorResponseTest > testJoinGroupUnknownConsumerNewGroup PASSED
kafka.coordinator.GroupCoordinatorResponseTest > testJoinGroupFromUnchangedFollowerDoesNotRebalance PASSED
kafka.coordinator.GroupCoordinatorResponseTest > testValidJoinGroup PASSED
kafka.coordinator.GroupCoordinatorResponseTest > testSyncGroupLeaderAfterFollower PASSED
kafka.coordinator.GroupCoordinatorResponseTest > testSyncGroupFromUnknownMember PASSED
kafka.coordinator.GroupCoordinatorResponseTest > testValidLeaveGroup PASSED
kafka.coordinator.GroupCoordinatorResponseTest > testDescribeGroupInactiveGroup PASSED
kafka.coordinator.GroupCoordinatorResponseTest > testSyncGroupNotCoordinator PASSED
kafka.coordinator.GroupCoordinatorResponseTest > testHeartbeatUnknownConsumerExistingGroup PASSED
kafka.coordinator.GroupCoordinatorResponseTest > testValidHeartbeat PASSED
kafka.coordinator.MemberMetadataTest > testMatchesSupportedProtocols PASSED
kafka.coordinator.MemberMetadataTest > testMetadata PASSED
kafka.coordinator.MemberMetadataTest > testMetadataRaisesOnUnsupportedProtocol PASSED
kafka.coordinator.MemberMetadataTest > testVoteForPreferredProtocol PASSED
kafka.coordinator.MemberMetadataTest > testVoteRaisesOnNoSupportedProtocols PASSED
kafka.coordinator.GroupMetadataTest > testDeadToAwaitingSyncIllegalTransition PASSED
kafka.coordinator.GroupMetadataTest > testPreparingRebalanceToStableIllegalTransition PASSED
kafka.coordinator.GroupMetadataTest > testCannotRebalanceWhenDead PASSED
kafka.coordinator.GroupMetadataTest > testSelectProtocol PASSED
kafka.coordinator.GroupMetadataTest > testCannotRebalanceWhenPreparingRebalance PASSED
kafka.coordinator.GroupMetadataTest > testDeadToPreparingRebalanceIllegalTransition PASSED
kafka.coordinator.GroupMetadataTest > testCanRebalanceWhenAwaitingSync PASSED
kafka.coordinator.GroupMetadataTest > testAwaitingSyncToPreparingRebalanceTransition PASSED
kafka.coordinator.GroupMetadataTest > testStableToAwaitingSyncIllegalTransition PASSED
kafka.coordinator.GroupMetadataTest > testDeadToDeadIllegalTransition PASSED
kafka.coordinator.GroupMetadataTest > testSelectProtocolRaisesIfNoMembers PASSED
kafka.coordinator.GroupMetadataTest > testStableToPreparingRebalanceTransition PASSED
kafka.coordinator.GroupMetadataTest > testPreparingRebalanceToDeadTransition PASSED
kafka.coordinator.GroupMetadataTest > testStableToStableIllegalTransition PASSED
kafka.coordinator.GroupMetadataTest > testAwaitingSyncToStableTransition PASSED
kafka.coordinator.GroupMetadataTest > testDeadToStableIllegalTransition PASSED
kafka.coordinator.GroupMetadataTest > testAwaitingSyncToAwaitingSyncIllegalTransition PASSED
kafka.coordinator.GroupMetadataTest > testSupportsProtocols PASSED
kafka.coordinator.GroupMetadataTest > testCanRebalanceWhenStable PASSED
kafka.coordinator.GroupMetadataTest > testPreparingRebalanceToPreparingRebalanceIllegalTransition PASSED
kafka.coordinator.GroupMetadataTest > testSelectProtocolChoosesCompatibleProtocol PASSED
kafka.javaapi.message.ByteBufferMessageSetTest > testSizeInBytesWithCompression PASSED
kafka.javaapi.message.ByteBufferMessageSetTest > testIteratorIsConsistentWithCompression PASSED
kafka.javaapi.message.ByteBufferMessageSetTest > testIteratorIsConsistent PASSED
kafka.javaapi.message.ByteBufferMessageSetTest > testEqualsWithCompression PASSED
kafka.javaapi.message.ByteBufferMessageSetTest > testWrittenEqualsRead PASSED
kafka.javaapi.message.ByteBufferMessageSetTest > testEquals PASSED
kafka.javaapi.message.ByteBufferMessageSetTest > testSizeInBytes PASSED
kafka.javaapi.consumer.ZookeeperConsumerConnectorTest > testBasic PASSED
kafka.KafkaTest > testGetKafkaConfigFromArgsWrongSetValue PASSED
kafka.KafkaTest > testKafkaSslPasswords PASSED
kafka.KafkaTest > testGetKafkaConfigFromArgs PASSED
kafka.KafkaTest > testGetKafkaConfigFromArgsNonArgsAtTheEnd PASSED
kafka.KafkaTest > testGetKafkaConfigFromArgsNonArgsOnly PASSED
kafka.KafkaTest > testGetKafkaConfigFromArgsNonArgsAtTheBegging PASSED
kafka.controller.ControllerFailoverTest > testMetadataUpdate PASSED
647 tests completed, 1 failed
:kafka-trunk-jdk7:core:test FAILED
:test_core_2_11 FAILED
FAILURE: Build failed with an exception.
* What went wrong:
Execution failed for task ':core:test'.
> There were failing tests. See the report at: file://<https://builds.apache.org/job/kafka-trunk-jdk7/ws/core/build/reports/tests/index.html>
* Try:
Run with --stacktrace option to get the stack trace. Run with --info or --debug option to get more log output.
BUILD FAILED
Total time: 1 hrs 28 mins 16.442 secs
Build step 'Execute shell' marked build as failure
Recording test results
Setting GRADLE_2_4_RC_2_HOME=/home/jenkins/jenkins-slave/tools/hudson.plugins.gradle.GradleInstallation/Gradle_2.4-rc-2
Setting JDK_1_7U51_HOME=/home/jenkins/jenkins-slave/tools/hudson.model.JDK/jdk-1.7u51
Setting GRADLE_2_4_RC_2_HOME=/home/jenkins/jenkins-slave/tools/hudson.plugins.gradle.GradleInstallation/Gradle_2.4-rc-2
Setting JDK_1_7U51_HOME=/home/jenkins/jenkins-slave/tools/hudson.model.JDK/jdk-1.7u51
Jenkins build is back to normal : kafka-trunk-jdk7 #939
Posted by Apache Jenkins Server <je...@builds.apache.org>.
See <https://builds.apache.org/job/kafka-trunk-jdk7/939/changes>
Build failed in Jenkins: kafka-trunk-jdk7 #938
Posted by Apache Jenkins Server <je...@builds.apache.org>.
See <https://builds.apache.org/job/kafka-trunk-jdk7/938/changes>
Changes:
[wangguoz] KAFKA-1901; Added error handling when no file exists in .git/refs/heads.
------------------------------------------
[...truncated 1782 lines...]
kafka.admin.AddPartitionsTest > testTopicDoesNotExist PASSED
kafka.admin.AddPartitionsTest > testIncrementPartitions PASSED
kafka.admin.AddPartitionsTest > testManualAssignmentOfReplicas PASSED
kafka.admin.AddPartitionsTest > testReplicaPlacement PASSED
kafka.admin.ConfigCommandTest > testArgumentParse PASSED
kafka.admin.DeleteConsumerGroupTest > testGroupWideDeleteInZKDoesNothingForActiveConsumerGroup PASSED
kafka.admin.DeleteConsumerGroupTest > testGroupTopicWideDeleteInZKDoesNothingForActiveGroupConsumingMultipleTopics PASSED
kafka.admin.DeleteConsumerGroupTest > testConsumptionOnRecreatedTopicAfterTopicWideDeleteInZK PASSED
kafka.admin.DeleteConsumerGroupTest > testTopicWideDeleteInZK PASSED
kafka.admin.DeleteConsumerGroupTest > testGroupTopicWideDeleteInZKForGroupConsumingOneTopic PASSED
kafka.admin.DeleteConsumerGroupTest > testGroupTopicWideDeleteInZKForGroupConsumingMultipleTopics PASSED
kafka.admin.DeleteConsumerGroupTest > testGroupWideDeleteInZK PASSED
kafka.producer.SyncProducerTest > testReachableServer PASSED
kafka.producer.SyncProducerTest > testMessageSizeTooLarge PASSED
kafka.producer.SyncProducerTest > testNotEnoughReplicas PASSED
kafka.producer.SyncProducerTest > testMessageSizeTooLargeWithAckZero PASSED
kafka.producer.SyncProducerTest > testProducerCanTimeout PASSED
kafka.producer.SyncProducerTest > testProduceRequestWithNoResponse PASSED
kafka.producer.SyncProducerTest > testEmptyProduceRequest PASSED
kafka.producer.SyncProducerTest > testProduceCorrectlyReceivesResponse PASSED
kafka.producer.ProducerTest > testSendToNewTopic PASSED
kafka.producer.ProducerTest > testAsyncSendCanCorrectlyFailWithTimeout PASSED
kafka.producer.ProducerTest > testSendNullMessage PASSED
kafka.producer.ProducerTest > testUpdateBrokerPartitionInfo PASSED
kafka.producer.ProducerTest > testSendWithDeadBroker PASSED
kafka.producer.AsyncProducerTest > testFailedSendRetryLogic PASSED
kafka.producer.AsyncProducerTest > testQueueTimeExpired PASSED
kafka.producer.AsyncProducerTest > testPartitionAndCollateEvents PASSED
kafka.producer.AsyncProducerTest > testBatchSize PASSED
kafka.producer.AsyncProducerTest > testSerializeEvents PASSED
kafka.producer.AsyncProducerTest > testProducerQueueSize PASSED
kafka.producer.AsyncProducerTest > testRandomPartitioner PASSED
kafka.producer.AsyncProducerTest > testInvalidConfiguration PASSED
kafka.producer.AsyncProducerTest > testInvalidPartition PASSED
kafka.producer.AsyncProducerTest > testNoBroker PASSED
kafka.producer.AsyncProducerTest > testProduceAfterClosed PASSED
kafka.producer.AsyncProducerTest > testJavaProducer PASSED
kafka.producer.AsyncProducerTest > testIncompatibleEncoder PASSED
kafka.common.ZkNodeChangeNotificationListenerTest > testProcessNotification PASSED
kafka.common.TopicTest > testInvalidTopicNames PASSED
kafka.common.TopicTest > testTopicHasCollision PASSED
kafka.common.TopicTest > testTopicHasCollisionChars PASSED
kafka.common.ConfigTest > testInvalidGroupIds PASSED
kafka.common.ConfigTest > testInvalidClientIds PASSED
kafka.server.DelayedOperationTest > testRequestPurge PASSED
kafka.server.DelayedOperationTest > testRequestExpiry PASSED
kafka.server.DelayedOperationTest > testRequestSatisfaction PASSED
kafka.server.PlaintextReplicaFetchTest > testReplicaFetcherThread PASSED
kafka.server.ServerGenerateBrokerIdTest > testAutoGenerateBrokerId PASSED
kafka.server.ServerGenerateBrokerIdTest > testMultipleLogDirsMetaProps PASSED
kafka.server.ServerGenerateBrokerIdTest > testUserConfigAndGeneratedBrokerId PASSED
kafka.server.ServerGenerateBrokerIdTest > testConsistentBrokerIdFromUserConfigAndMetaProps PASSED
kafka.server.SslReplicaFetchTest > testReplicaFetcherThread PASSED
kafka.server.HighwatermarkPersistenceTest > testHighWatermarkPersistenceMultiplePartitions PASSED
kafka.server.HighwatermarkPersistenceTest > testHighWatermarkPersistenceSinglePartition PASSED
kafka.server.ThrottledResponseExpirationTest > testThrottledRequest PASSED
kafka.server.ThrottledResponseExpirationTest > testExpire PASSED
kafka.server.ReplicaManagerTest > testHighWaterMarkDirectoryMapping PASSED
kafka.server.ReplicaManagerTest > testIllegalRequiredAcks PASSED
kafka.server.ReplicaManagerTest > testHighwaterMarkRelativeDirectoryMapping PASSED
kafka.server.ServerShutdownTest > testCleanShutdownAfterFailedStartup PASSED
kafka.server.ServerShutdownTest > testConsecutiveShutdown PASSED
kafka.server.ServerShutdownTest > testCleanShutdown PASSED
kafka.server.ServerShutdownTest > testCleanShutdownWithDeleteTopicEnabled PASSED
kafka.server.LeaderElectionTest > testLeaderElectionWithStaleControllerEpoch PASSED
kafka.server.LeaderElectionTest > testLeaderElectionAndEpoch PASSED
kafka.server.OffsetCommitTest > testUpdateOffsets PASSED
kafka.server.OffsetCommitTest > testLargeMetadataPayload PASSED
kafka.server.OffsetCommitTest > testCommitAndFetchOffsets PASSED
kafka.server.OffsetCommitTest > testOffsetExpiration PASSED
kafka.server.OffsetCommitTest > testNonExistingTopicOffsetCommit PASSED
kafka.server.SimpleFetchTest > testReadFromLog PASSED
kafka.server.DynamicConfigChangeTest > testProcessNotification PASSED
kafka.server.DynamicConfigChangeTest > testClientQuotaConfigChange PASSED
kafka.server.DynamicConfigChangeTest > testConfigChangeOnNonExistingTopic PASSED
kafka.server.DynamicConfigChangeTest > testConfigChange PASSED
kafka.server.LogOffsetTest > testGetOffsetsBeforeEarliestTime PASSED
kafka.server.LogOffsetTest > testGetOffsetsForUnknownTopic PASSED
kafka.server.LogOffsetTest > testEmptyLogsGetOffsets PASSED
kafka.server.LogOffsetTest > testGetOffsetsBeforeLatestTime PASSED
kafka.server.LogOffsetTest > testGetOffsetsBeforeNow PASSED
kafka.server.ClientQuotaManagerTest > testQuotaViolation PASSED
kafka.server.ClientQuotaManagerTest > testQuotaParsing PASSED
kafka.server.KafkaConfigTest > testAdvertiseConfigured PASSED
kafka.server.KafkaConfigTest > testLogRetentionTimeHoursProvided PASSED
kafka.server.KafkaConfigTest > testLogRollTimeBothMsAndHoursProvided PASSED
kafka.server.KafkaConfigTest > testLogRetentionValid PASSED
kafka.server.KafkaConfigTest > testSpecificProperties PASSED
kafka.server.KafkaConfigTest > testDefaultCompressionType PASSED
kafka.server.KafkaConfigTest > testDuplicateListeners PASSED
kafka.server.KafkaConfigTest > testLogRetentionUnlimited PASSED
kafka.server.KafkaConfigTest > testLogRetentionTimeMsProvided PASSED
kafka.server.KafkaConfigTest > testLogRollTimeNoConfigProvided PASSED
kafka.server.KafkaConfigTest > testAdvertiseDefaults PASSED
kafka.server.KafkaConfigTest > testBadListenerProtocol PASSED
kafka.server.KafkaConfigTest > testListenerDefaults PASSED
kafka.server.KafkaConfigTest > testLogRetentionTimeBothMinutesAndHoursProvided PASSED
kafka.server.KafkaConfigTest > testUncleanElectionDisabled PASSED
kafka.server.KafkaConfigTest > testLogRetentionTimeNoConfigProvided PASSED
kafka.server.KafkaConfigTest > testFromPropsInvalid PASSED
kafka.server.KafkaConfigTest > testInvalidCompressionType PASSED
kafka.server.KafkaConfigTest > testAdvertiseHostNameDefault PASSED
kafka.server.KafkaConfigTest > testLogRetentionTimeMinutesProvided PASSED
kafka.server.KafkaConfigTest > testValidCompressionType PASSED
kafka.server.KafkaConfigTest > testUncleanElectionInvalid PASSED
kafka.server.KafkaConfigTest > testLogRetentionTimeBothMinutesAndMsProvided PASSED
kafka.server.KafkaConfigTest > testLogRollTimeMsProvided PASSED
kafka.server.KafkaConfigTest > testUncleanLeaderElectionDefault PASSED
kafka.server.KafkaConfigTest > testUncleanElectionEnabled PASSED
kafka.server.KafkaConfigTest > testAdvertisePortDefault PASSED
kafka.server.KafkaConfigTest > testVersionConfiguration PASSED
kafka.server.LogRecoveryTest > testHWCheckpointNoFailuresMultipleLogSegments PASSED
kafka.server.LogRecoveryTest > testHWCheckpointWithFailuresMultipleLogSegments PASSED
kafka.server.LogRecoveryTest > testHWCheckpointNoFailuresSingleLogSegment PASSED
:kafka-trunk-jdk7:core:test FAILED
:test_core_2_11 FAILED
FAILURE: Build failed with an exception.
* What went wrong:
Execution failed for task ':core:test'.
> Process 'Gradle Test Executor 2' finished with non-zero exit value 1
* Try:
Run with --stacktrace option to get the stack trace. Run with --info or --debug option to get more log output.
BUILD FAILED
Total time: 55 mins 36.911 secs
Build step 'Execute shell' marked build as failure
Recording test results
Setting GRADLE_2_4_RC_2_HOME=/home/jenkins/jenkins-slave/tools/hudson.plugins.gradle.GradleInstallation/Gradle_2.4-rc-2
Setting JDK_1_7U51_HOME=/home/jenkins/jenkins-slave/tools/hudson.model.JDK/jdk-1.7u51
Setting GRADLE_2_4_RC_2_HOME=/home/jenkins/jenkins-slave/tools/hudson.plugins.gradle.GradleInstallation/Gradle_2.4-rc-2
Setting JDK_1_7U51_HOME=/home/jenkins/jenkins-slave/tools/hudson.model.JDK/jdk-1.7u51