You are viewing a plain text version of this content. The canonical link for it is here.
Posted to dev@lucene.apache.org by Policeman Jenkins Server <je...@thetaphi.de> on 2015/11/09 06:38:58 UTC
[JENKINS-EA] Lucene-Solr-trunk-Linux (64bit/jdk1.9.0-ea-b90) -
Build # 14841 - Failure!
Build: http://jenkins.thetaphi.de/job/Lucene-Solr-trunk-Linux/14841/
Java: 64bit/jdk1.9.0-ea-b90 -XX:-UseCompressedOops -XX:+UseSerialGC
1 tests failed.
FAILED: org.apache.solr.cloud.CollectionsAPIDistributedZkTest.test
Error Message:
Error from server at http://127.0.0.1:51555/vq_k/lm/awholynewcollection_0: Expected mime type application/octet-stream but got text/html. <html> <head> <meta http-equiv="Content-Type" content="text/html;charset=ISO-8859-1"/> <title>Error 500 </title> </head> <body> <h2>HTTP ERROR: 500</h2> <p>Problem accessing /vq_k/lm/awholynewcollection_0/select. Reason: <pre> {trace=java.lang.NullPointerException at org.apache.solr.servlet.HttpSolrCall.getCoreByCollection(HttpSolrCall.java:786) at org.apache.solr.servlet.HttpSolrCall.init(HttpSolrCall.java:270) at org.apache.solr.servlet.HttpSolrCall.call(HttpSolrCall.java:415) at org.apache.solr.servlet.SolrDispatchFilter.doFilter(SolrDispatchFilter.java:220) at org.apache.solr.servlet.SolrDispatchFilter.doFilter(SolrDispatchFilter.java:179) at org.eclipse.jetty.servlet.ServletHandler$CachedChain.doFilter(ServletHandler.java:1652) at org.apache.solr.client.solrj.embedded.JettySolrRunner$DebugFilter.doFilter(JettySolrRunner.java:109) at org.eclipse.jetty.servlet.ServletHandler$CachedChain.doFilter(ServletHandler.java:1652) at org.eclipse.jetty.servlets.UserAgentFilter.doFilter(UserAgentFilter.java:83) at org.eclipse.jetty.servlets.GzipFilter.doFilter(GzipFilter.java:364) at org.eclipse.jetty.servlet.ServletHandler$CachedChain.doFilter(ServletHandler.java:1652) at org.eclipse.jetty.servlet.ServletHandler.doHandle(ServletHandler.java:585) at org.eclipse.jetty.server.session.SessionHandler.doHandle(SessionHandler.java:221) at org.eclipse.jetty.server.handler.ContextHandler.doHandle(ContextHandler.java:1127) at org.eclipse.jetty.servlet.ServletHandler.doScope(ServletHandler.java:515) at org.eclipse.jetty.server.session.SessionHandler.doScope(SessionHandler.java:185) at org.eclipse.jetty.server.handler.ContextHandler.doScope(ContextHandler.java:1061) at org.eclipse.jetty.server.handler.ScopedHandler.handle(ScopedHandler.java:141) at org.eclipse.jetty.server.handler.HandlerWrapper.handle(HandlerWrapper.java:97) at org.eclipse.jetty.server.Server.handle(Server.java:499) at org.eclipse.jetty.server.HttpChannel.handle(HttpChannel.java:310) at org.eclipse.jetty.server.HttpConnection.onFillable(HttpConnection.java:257) at org.eclipse.jetty.io.AbstractConnection$2.run(AbstractConnection.java:540) at org.eclipse.jetty.util.thread.QueuedThreadPool.runJob(QueuedThreadPool.java:635) at org.eclipse.jetty.util.thread.QueuedThreadPool$3.run(QueuedThreadPool.java:555) at java.lang.Thread.run(Thread.java:747) ,code=500}</pre></p> <hr /><i><small>Powered by Jetty://</small></i> </body> </html>
Stack Trace:
org.apache.solr.client.solrj.impl.HttpSolrClient$RemoteSolrException: Error from server at http://127.0.0.1:51555/vq_k/lm/awholynewcollection_0: Expected mime type application/octet-stream but got text/html. <html>
<head>
<meta http-equiv="Content-Type" content="text/html;charset=ISO-8859-1"/>
<title>Error 500 </title>
</head>
<body>
<h2>HTTP ERROR: 500</h2>
<p>Problem accessing /vq_k/lm/awholynewcollection_0/select. Reason:
<pre> {trace=java.lang.NullPointerException
at org.apache.solr.servlet.HttpSolrCall.getCoreByCollection(HttpSolrCall.java:786)
at org.apache.solr.servlet.HttpSolrCall.init(HttpSolrCall.java:270)
at org.apache.solr.servlet.HttpSolrCall.call(HttpSolrCall.java:415)
at org.apache.solr.servlet.SolrDispatchFilter.doFilter(SolrDispatchFilter.java:220)
at org.apache.solr.servlet.SolrDispatchFilter.doFilter(SolrDispatchFilter.java:179)
at org.eclipse.jetty.servlet.ServletHandler$CachedChain.doFilter(ServletHandler.java:1652)
at org.apache.solr.client.solrj.embedded.JettySolrRunner$DebugFilter.doFilter(JettySolrRunner.java:109)
at org.eclipse.jetty.servlet.ServletHandler$CachedChain.doFilter(ServletHandler.java:1652)
at org.eclipse.jetty.servlets.UserAgentFilter.doFilter(UserAgentFilter.java:83)
at org.eclipse.jetty.servlets.GzipFilter.doFilter(GzipFilter.java:364)
at org.eclipse.jetty.servlet.ServletHandler$CachedChain.doFilter(ServletHandler.java:1652)
at org.eclipse.jetty.servlet.ServletHandler.doHandle(ServletHandler.java:585)
at org.eclipse.jetty.server.session.SessionHandler.doHandle(SessionHandler.java:221)
at org.eclipse.jetty.server.handler.ContextHandler.doHandle(ContextHandler.java:1127)
at org.eclipse.jetty.servlet.ServletHandler.doScope(ServletHandler.java:515)
at org.eclipse.jetty.server.session.SessionHandler.doScope(SessionHandler.java:185)
at org.eclipse.jetty.server.handler.ContextHandler.doScope(ContextHandler.java:1061)
at org.eclipse.jetty.server.handler.ScopedHandler.handle(ScopedHandler.java:141)
at org.eclipse.jetty.server.handler.HandlerWrapper.handle(HandlerWrapper.java:97)
at org.eclipse.jetty.server.Server.handle(Server.java:499)
at org.eclipse.jetty.server.HttpChannel.handle(HttpChannel.java:310)
at org.eclipse.jetty.server.HttpConnection.onFillable(HttpConnection.java:257)
at org.eclipse.jetty.io.AbstractConnection$2.run(AbstractConnection.java:540)
at org.eclipse.jetty.util.thread.QueuedThreadPool.runJob(QueuedThreadPool.java:635)
at org.eclipse.jetty.util.thread.QueuedThreadPool$3.run(QueuedThreadPool.java:555)
at java.lang.Thread.run(Thread.java:747)
,code=500}</pre></p>
<hr /><i><small>Powered by Jetty://</small></i>
</body>
</html>
at __randomizedtesting.SeedInfo.seed([48181FE2605C8A60:C04C2038CEA0E798]:0)
at org.apache.solr.client.solrj.impl.HttpSolrClient.executeMethod(HttpSolrClient.java:543)
at org.apache.solr.client.solrj.impl.HttpSolrClient.request(HttpSolrClient.java:241)
at org.apache.solr.client.solrj.impl.HttpSolrClient.request(HttpSolrClient.java:230)
at org.apache.solr.client.solrj.SolrRequest.process(SolrRequest.java:150)
at org.apache.solr.client.solrj.SolrClient.query(SolrClient.java:943)
at org.apache.solr.client.solrj.SolrClient.query(SolrClient.java:958)
at org.apache.solr.cloud.AbstractFullDistribZkTestBase.waitForNon403or404or503(AbstractFullDistribZkTestBase.java:1754)
at org.apache.solr.cloud.CollectionsAPIDistributedZkTest.testCollectionsAPI(CollectionsAPIDistributedZkTest.java:665)
at org.apache.solr.cloud.CollectionsAPIDistributedZkTest.test(CollectionsAPIDistributedZkTest.java:167)
at sun.reflect.NativeMethodAccessorImpl.invoke0(Native Method)
at sun.reflect.NativeMethodAccessorImpl.invoke(NativeMethodAccessorImpl.java:62)
at sun.reflect.DelegatingMethodAccessorImpl.invoke(DelegatingMethodAccessorImpl.java:43)
at java.lang.reflect.Method.invoke(Method.java:520)
at com.carrotsearch.randomizedtesting.RandomizedRunner.invoke(RandomizedRunner.java:1660)
at com.carrotsearch.randomizedtesting.RandomizedRunner$8.evaluate(RandomizedRunner.java:866)
at com.carrotsearch.randomizedtesting.RandomizedRunner$9.evaluate(RandomizedRunner.java:902)
at com.carrotsearch.randomizedtesting.RandomizedRunner$10.evaluate(RandomizedRunner.java:916)
at org.apache.solr.BaseDistributedSearchTestCase$ShardsRepeatRule$ShardsFixedStatement.callStatement(BaseDistributedSearchTestCase.java:963)
at org.apache.solr.BaseDistributedSearchTestCase$ShardsRepeatRule$ShardsStatement.evaluate(BaseDistributedSearchTestCase.java:938)
at com.carrotsearch.randomizedtesting.rules.SystemPropertiesRestoreRule$1.evaluate(SystemPropertiesRestoreRule.java:57)
at org.apache.lucene.util.TestRuleSetupTeardownChained$1.evaluate(TestRuleSetupTeardownChained.java:50)
at org.apache.lucene.util.AbstractBeforeAfterRule$1.evaluate(AbstractBeforeAfterRule.java:46)
at org.apache.lucene.util.TestRuleThreadAndTestName$1.evaluate(TestRuleThreadAndTestName.java:49)
at org.apache.lucene.util.TestRuleIgnoreAfterMaxFailures$1.evaluate(TestRuleIgnoreAfterMaxFailures.java:65)
at org.apache.lucene.util.TestRuleMarkFailure$1.evaluate(TestRuleMarkFailure.java:48)
at com.carrotsearch.randomizedtesting.rules.StatementAdapter.evaluate(StatementAdapter.java:36)
at com.carrotsearch.randomizedtesting.ThreadLeakControl$StatementRunner.run(ThreadLeakControl.java:367)
at com.carrotsearch.randomizedtesting.ThreadLeakControl.forkTimeoutingTask(ThreadLeakControl.java:809)
at com.carrotsearch.randomizedtesting.ThreadLeakControl$3.evaluate(ThreadLeakControl.java:460)
at com.carrotsearch.randomizedtesting.RandomizedRunner.runSingleTest(RandomizedRunner.java:875)
at com.carrotsearch.randomizedtesting.RandomizedRunner$5.evaluate(RandomizedRunner.java:777)
at com.carrotsearch.randomizedtesting.RandomizedRunner$6.evaluate(RandomizedRunner.java:811)
at com.carrotsearch.randomizedtesting.RandomizedRunner$7.evaluate(RandomizedRunner.java:822)
at com.carrotsearch.randomizedtesting.rules.StatementAdapter.evaluate(StatementAdapter.java:36)
at com.carrotsearch.randomizedtesting.rules.SystemPropertiesRestoreRule$1.evaluate(SystemPropertiesRestoreRule.java:57)
at org.apache.lucene.util.AbstractBeforeAfterRule$1.evaluate(AbstractBeforeAfterRule.java:46)
at com.carrotsearch.randomizedtesting.rules.StatementAdapter.evaluate(StatementAdapter.java:36)
at org.apache.lucene.util.TestRuleStoreClassName$1.evaluate(TestRuleStoreClassName.java:42)
at com.carrotsearch.randomizedtesting.rules.NoShadowingOrOverridesOnMethodsRule$1.evaluate(NoShadowingOrOverridesOnMethodsRule.java:40)
at com.carrotsearch.randomizedtesting.rules.NoShadowingOrOverridesOnMethodsRule$1.evaluate(NoShadowingOrOverridesOnMethodsRule.java:40)
at com.carrotsearch.randomizedtesting.rules.StatementAdapter.evaluate(StatementAdapter.java:36)
at com.carrotsearch.randomizedtesting.rules.StatementAdapter.evaluate(StatementAdapter.java:36)
at com.carrotsearch.randomizedtesting.rules.StatementAdapter.evaluate(StatementAdapter.java:36)
at org.apache.lucene.util.TestRuleAssertionsRequired$1.evaluate(TestRuleAssertionsRequired.java:54)
at org.apache.lucene.util.TestRuleMarkFailure$1.evaluate(TestRuleMarkFailure.java:48)
at org.apache.lucene.util.TestRuleIgnoreAfterMaxFailures$1.evaluate(TestRuleIgnoreAfterMaxFailures.java:65)
at org.apache.lucene.util.TestRuleIgnoreTestSuites$1.evaluate(TestRuleIgnoreTestSuites.java:55)
at com.carrotsearch.randomizedtesting.rules.StatementAdapter.evaluate(StatementAdapter.java:36)
at com.carrotsearch.randomizedtesting.ThreadLeakControl$StatementRunner.run(ThreadLeakControl.java:367)
at java.lang.Thread.run(Thread.java:747)
Build Log:
[...truncated 9872 lines...]
[junit4] Suite: org.apache.solr.cloud.CollectionsAPIDistributedZkTest
[junit4] 2> Creating dataDir: /home/jenkins/workspace/Lucene-Solr-trunk-Linux/solr/build/solr-core/test/J1/temp/solr.cloud.CollectionsAPIDistributedZkTest_48181FE2605C8A60-001/init-core-data-001
[junit4] 2> 297008 INFO (SUITE-CollectionsAPIDistributedZkTest-seed#[48181FE2605C8A60]-worker) [ ] o.a.s.SolrTestCaseJ4 Randomized ssl (false) and clientAuth (false)
[junit4] 2> 297008 INFO (SUITE-CollectionsAPIDistributedZkTest-seed#[48181FE2605C8A60]-worker) [ ] o.a.s.BaseDistributedSearchTestCase Setting hostContext system property: /vq_k/lm
[junit4] 2> 297010 INFO (TEST-CollectionsAPIDistributedZkTest.test-seed#[48181FE2605C8A60]) [ ] o.a.s.c.ZkTestServer STARTING ZK TEST SERVER
[junit4] 2> 297010 INFO (Thread-1111) [ ] o.a.s.c.ZkTestServer client port:0.0.0.0/0.0.0.0:0
[junit4] 2> 297010 INFO (Thread-1111) [ ] o.a.s.c.ZkTestServer Starting server
[junit4] 2> 297110 INFO (TEST-CollectionsAPIDistributedZkTest.test-seed#[48181FE2605C8A60]) [ ] o.a.s.c.ZkTestServer start zk server on port:59563
[junit4] 2> 297111 INFO (TEST-CollectionsAPIDistributedZkTest.test-seed#[48181FE2605C8A60]) [ ] o.a.s.c.c.SolrZkClient Using default ZkCredentialsProvider
[junit4] 2> 297114 INFO (TEST-CollectionsAPIDistributedZkTest.test-seed#[48181FE2605C8A60]) [ ] o.a.s.c.c.ConnectionManager Waiting for client to connect to ZooKeeper
[junit4] 2> 297116 INFO (zkCallback-350-thread-1) [ ] o.a.s.c.c.ConnectionManager Watcher org.apache.solr.common.cloud.ConnectionManager@6312940b name:ZooKeeperConnection Watcher:127.0.0.1:59563 got event WatchedEvent state:SyncConnected type:None path:null path:null type:None
[junit4] 2> 297116 INFO (TEST-CollectionsAPIDistributedZkTest.test-seed#[48181FE2605C8A60]) [ ] o.a.s.c.c.ConnectionManager Client is connected to ZooKeeper
[junit4] 2> 297117 INFO (TEST-CollectionsAPIDistributedZkTest.test-seed#[48181FE2605C8A60]) [ ] o.a.s.c.c.SolrZkClient Using default ZkACLProvider
[junit4] 2> 297117 INFO (TEST-CollectionsAPIDistributedZkTest.test-seed#[48181FE2605C8A60]) [ ] o.a.s.c.c.SolrZkClient makePath: /solr
[junit4] 2> 297118 INFO (TEST-CollectionsAPIDistributedZkTest.test-seed#[48181FE2605C8A60]) [ ] o.a.s.c.c.SolrZkClient Using default ZkCredentialsProvider
[junit4] 2> 297119 INFO (TEST-CollectionsAPIDistributedZkTest.test-seed#[48181FE2605C8A60]) [ ] o.a.s.c.c.ConnectionManager Waiting for client to connect to ZooKeeper
[junit4] 2> 297120 INFO (zkCallback-351-thread-1) [ ] o.a.s.c.c.ConnectionManager Watcher org.apache.solr.common.cloud.ConnectionManager@616fd629 name:ZooKeeperConnection Watcher:127.0.0.1:59563/solr got event WatchedEvent state:SyncConnected type:None path:null path:null type:None
[junit4] 2> 297120 INFO (TEST-CollectionsAPIDistributedZkTest.test-seed#[48181FE2605C8A60]) [ ] o.a.s.c.c.ConnectionManager Client is connected to ZooKeeper
[junit4] 2> 297120 INFO (TEST-CollectionsAPIDistributedZkTest.test-seed#[48181FE2605C8A60]) [ ] o.a.s.c.c.SolrZkClient Using default ZkACLProvider
[junit4] 2> 297120 INFO (TEST-CollectionsAPIDistributedZkTest.test-seed#[48181FE2605C8A60]) [ ] o.a.s.c.c.SolrZkClient makePath: /collections/collection1
[junit4] 2> 297122 INFO (TEST-CollectionsAPIDistributedZkTest.test-seed#[48181FE2605C8A60]) [ ] o.a.s.c.c.SolrZkClient makePath: /collections/collection1/shards
[junit4] 2> 297123 INFO (TEST-CollectionsAPIDistributedZkTest.test-seed#[48181FE2605C8A60]) [ ] o.a.s.c.c.SolrZkClient makePath: /collections/control_collection
[junit4] 2> 297124 INFO (TEST-CollectionsAPIDistributedZkTest.test-seed#[48181FE2605C8A60]) [ ] o.a.s.c.c.SolrZkClient makePath: /collections/control_collection/shards
[junit4] 2> 297124 INFO (TEST-CollectionsAPIDistributedZkTest.test-seed#[48181FE2605C8A60]) [ ] o.a.s.c.AbstractZkTestCase put /home/jenkins/workspace/Lucene-Solr-trunk-Linux/solr/core/src/test-files/solr/collection1/conf/solrconfig-tlog.xml to /configs/conf1/solrconfig.xml
[junit4] 2> 297124 INFO (TEST-CollectionsAPIDistributedZkTest.test-seed#[48181FE2605C8A60]) [ ] o.a.s.c.c.SolrZkClient makePath: /configs/conf1/solrconfig.xml
[junit4] 2> 297125 INFO (TEST-CollectionsAPIDistributedZkTest.test-seed#[48181FE2605C8A60]) [ ] o.a.s.c.AbstractZkTestCase put /home/jenkins/workspace/Lucene-Solr-trunk-Linux/solr/core/src/test-files/solr/collection1/conf/schema.xml to /configs/conf1/schema.xml
[junit4] 2> 297125 INFO (TEST-CollectionsAPIDistributedZkTest.test-seed#[48181FE2605C8A60]) [ ] o.a.s.c.c.SolrZkClient makePath: /configs/conf1/schema.xml
[junit4] 2> 297126 INFO (TEST-CollectionsAPIDistributedZkTest.test-seed#[48181FE2605C8A60]) [ ] o.a.s.c.AbstractZkTestCase put /home/jenkins/workspace/Lucene-Solr-trunk-Linux/solr/core/src/test-files/solr/collection1/conf/solrconfig.snippet.randomindexconfig.xml to /configs/conf1/solrconfig.snippet.randomindexconfig.xml
[junit4] 2> 297127 INFO (TEST-CollectionsAPIDistributedZkTest.test-seed#[48181FE2605C8A60]) [ ] o.a.s.c.c.SolrZkClient makePath: /configs/conf1/solrconfig.snippet.randomindexconfig.xml
[junit4] 2> 297127 INFO (TEST-CollectionsAPIDistributedZkTest.test-seed#[48181FE2605C8A60]) [ ] o.a.s.c.AbstractZkTestCase put /home/jenkins/workspace/Lucene-Solr-trunk-Linux/solr/core/src/test-files/solr/collection1/conf/stopwords.txt to /configs/conf1/stopwords.txt
[junit4] 2> 297127 INFO (TEST-CollectionsAPIDistributedZkTest.test-seed#[48181FE2605C8A60]) [ ] o.a.s.c.c.SolrZkClient makePath: /configs/conf1/stopwords.txt
[junit4] 2> 297128 INFO (TEST-CollectionsAPIDistributedZkTest.test-seed#[48181FE2605C8A60]) [ ] o.a.s.c.AbstractZkTestCase put /home/jenkins/workspace/Lucene-Solr-trunk-Linux/solr/core/src/test-files/solr/collection1/conf/protwords.txt to /configs/conf1/protwords.txt
[junit4] 2> 297128 INFO (TEST-CollectionsAPIDistributedZkTest.test-seed#[48181FE2605C8A60]) [ ] o.a.s.c.c.SolrZkClient makePath: /configs/conf1/protwords.txt
[junit4] 2> 297128 INFO (TEST-CollectionsAPIDistributedZkTest.test-seed#[48181FE2605C8A60]) [ ] o.a.s.c.AbstractZkTestCase put /home/jenkins/workspace/Lucene-Solr-trunk-Linux/solr/core/src/test-files/solr/collection1/conf/currency.xml to /configs/conf1/currency.xml
[junit4] 2> 297129 INFO (TEST-CollectionsAPIDistributedZkTest.test-seed#[48181FE2605C8A60]) [ ] o.a.s.c.c.SolrZkClient makePath: /configs/conf1/currency.xml
[junit4] 2> 297129 INFO (TEST-CollectionsAPIDistributedZkTest.test-seed#[48181FE2605C8A60]) [ ] o.a.s.c.AbstractZkTestCase put /home/jenkins/workspace/Lucene-Solr-trunk-Linux/solr/core/src/test-files/solr/collection1/conf/enumsConfig.xml to /configs/conf1/enumsConfig.xml
[junit4] 2> 297129 INFO (TEST-CollectionsAPIDistributedZkTest.test-seed#[48181FE2605C8A60]) [ ] o.a.s.c.c.SolrZkClient makePath: /configs/conf1/enumsConfig.xml
[junit4] 2> 297130 INFO (TEST-CollectionsAPIDistributedZkTest.test-seed#[48181FE2605C8A60]) [ ] o.a.s.c.AbstractZkTestCase put /home/jenkins/workspace/Lucene-Solr-trunk-Linux/solr/core/src/test-files/solr/collection1/conf/open-exchange-rates.json to /configs/conf1/open-exchange-rates.json
[junit4] 2> 297130 INFO (TEST-CollectionsAPIDistributedZkTest.test-seed#[48181FE2605C8A60]) [ ] o.a.s.c.c.SolrZkClient makePath: /configs/conf1/open-exchange-rates.json
[junit4] 2> 297130 INFO (TEST-CollectionsAPIDistributedZkTest.test-seed#[48181FE2605C8A60]) [ ] o.a.s.c.AbstractZkTestCase put /home/jenkins/workspace/Lucene-Solr-trunk-Linux/solr/core/src/test-files/solr/collection1/conf/mapping-ISOLatin1Accent.txt to /configs/conf1/mapping-ISOLatin1Accent.txt
[junit4] 2> 297131 INFO (TEST-CollectionsAPIDistributedZkTest.test-seed#[48181FE2605C8A60]) [ ] o.a.s.c.c.SolrZkClient makePath: /configs/conf1/mapping-ISOLatin1Accent.txt
[junit4] 2> 297131 INFO (TEST-CollectionsAPIDistributedZkTest.test-seed#[48181FE2605C8A60]) [ ] o.a.s.c.AbstractZkTestCase put /home/jenkins/workspace/Lucene-Solr-trunk-Linux/solr/core/src/test-files/solr/collection1/conf/old_synonyms.txt to /configs/conf1/old_synonyms.txt
[junit4] 2> 297131 INFO (TEST-CollectionsAPIDistributedZkTest.test-seed#[48181FE2605C8A60]) [ ] o.a.s.c.c.SolrZkClient makePath: /configs/conf1/old_synonyms.txt
[junit4] 2> 297132 INFO (TEST-CollectionsAPIDistributedZkTest.test-seed#[48181FE2605C8A60]) [ ] o.a.s.c.AbstractZkTestCase put /home/jenkins/workspace/Lucene-Solr-trunk-Linux/solr/core/src/test-files/solr/collection1/conf/synonyms.txt to /configs/conf1/synonyms.txt
[junit4] 2> 297132 INFO (TEST-CollectionsAPIDistributedZkTest.test-seed#[48181FE2605C8A60]) [ ] o.a.s.c.c.SolrZkClient makePath: /configs/conf1/synonyms.txt
[junit4] 2> 297180 INFO (TEST-CollectionsAPIDistributedZkTest.test-seed#[48181FE2605C8A60]) [ ] o.a.s.SolrTestCaseJ4 Writing core.properties file to /home/jenkins/workspace/Lucene-Solr-trunk-Linux/solr/build/solr-core/test/J1/temp/solr.cloud.CollectionsAPIDistributedZkTest_48181FE2605C8A60-001/control-001/cores/collection1
[junit4] 2> 297181 INFO (TEST-CollectionsAPIDistributedZkTest.test-seed#[48181FE2605C8A60]) [ ] o.e.j.s.Server jetty-9.2.13.v20150730
[junit4] 2> 297182 INFO (TEST-CollectionsAPIDistributedZkTest.test-seed#[48181FE2605C8A60]) [ ] o.e.j.s.h.ContextHandler Started o.e.j.s.ServletContextHandler@55100944{/vq_k/lm,null,AVAILABLE}
[junit4] 2> 297184 INFO (TEST-CollectionsAPIDistributedZkTest.test-seed#[48181FE2605C8A60]) [ ] o.e.j.s.ServerConnector Started ServerConnector@683a9e7d{HTTP/1.1}{127.0.0.1:33260}
[junit4] 2> 297184 INFO (TEST-CollectionsAPIDistributedZkTest.test-seed#[48181FE2605C8A60]) [ ] o.e.j.s.Server Started @298587ms
[junit4] 2> 297184 INFO (TEST-CollectionsAPIDistributedZkTest.test-seed#[48181FE2605C8A60]) [ ] o.a.s.c.s.e.JettySolrRunner Jetty properties: {solr.data.dir=/home/jenkins/workspace/Lucene-Solr-trunk-Linux/solr/build/solr-core/test/J1/temp/solr.cloud.CollectionsAPIDistributedZkTest_48181FE2605C8A60-001/tempDir-001/control/data, hostContext=/vq_k/lm, hostPort=33260, coreRootDirectory=/home/jenkins/workspace/Lucene-Solr-trunk-Linux/solr/build/solr-core/test/J1/../../../../../../../../../home/jenkins/workspace/Lucene-Solr-trunk-Linux/solr/build/solr-core/test/J1/temp/solr.cloud.CollectionsAPIDistributedZkTest_48181FE2605C8A60-001/control-001/cores}
[junit4] 2> 297184 INFO (TEST-CollectionsAPIDistributedZkTest.test-seed#[48181FE2605C8A60]) [ ] o.a.s.s.SolrDispatchFilter SolrDispatchFilter.init(): sun.misc.Launcher$AppClassLoader@deb6432
[junit4] 2> 297184 INFO (TEST-CollectionsAPIDistributedZkTest.test-seed#[48181FE2605C8A60]) [ ] o.a.s.c.SolrResourceLoader new SolrResourceLoader for directory: '/home/jenkins/workspace/Lucene-Solr-trunk-Linux/solr/build/solr-core/test/J1/../../../../../../../../../home/jenkins/workspace/Lucene-Solr-trunk-Linux/solr/build/solr-core/test/J1/temp/solr.cloud.CollectionsAPIDistributedZkTest_48181FE2605C8A60-001/control-001/'
[junit4] 2> 297184 INFO (TEST-CollectionsAPIDistributedZkTest.test-seed#[48181FE2605C8A60]) [ ] o.a.s.c.SolrResourceLoader JNDI not configured for solr (NoInitialContextEx)
[junit4] 2> 297184 INFO (TEST-CollectionsAPIDistributedZkTest.test-seed#[48181FE2605C8A60]) [ ] o.a.s.c.SolrResourceLoader solr home defaulted to 'solr/' (could not find system property or JNDI)
[junit4] 2> 297192 INFO (TEST-CollectionsAPIDistributedZkTest.test-seed#[48181FE2605C8A60]) [ ] o.a.s.c.c.SolrZkClient Using default ZkCredentialsProvider
[junit4] 2> 297192 INFO (TEST-CollectionsAPIDistributedZkTest.test-seed#[48181FE2605C8A60]) [ ] o.a.s.c.c.ConnectionManager Waiting for client to connect to ZooKeeper
[junit4] 2> 297194 INFO (zkCallback-352-thread-1) [ ] o.a.s.c.c.ConnectionManager Watcher org.apache.solr.common.cloud.ConnectionManager@4cb8bff2 name:ZooKeeperConnection Watcher:127.0.0.1:59563/solr got event WatchedEvent state:SyncConnected type:None path:null path:null type:None
[junit4] 2> 297194 INFO (TEST-CollectionsAPIDistributedZkTest.test-seed#[48181FE2605C8A60]) [ ] o.a.s.c.c.ConnectionManager Client is connected to ZooKeeper
[junit4] 2> 297194 INFO (TEST-CollectionsAPIDistributedZkTest.test-seed#[48181FE2605C8A60]) [ ] o.a.s.c.c.SolrZkClient Using default ZkACLProvider
[junit4] 2> 297196 INFO (TEST-CollectionsAPIDistributedZkTest.test-seed#[48181FE2605C8A60]) [ ] o.a.s.s.SolrDispatchFilter Loading solr.xml from SolrHome (not found in ZooKeeper)
[junit4] 2> 297196 INFO (TEST-CollectionsAPIDistributedZkTest.test-seed#[48181FE2605C8A60]) [ ] o.a.s.c.SolrXmlConfig Loading container configuration from /home/jenkins/workspace/Lucene-Solr-trunk-Linux/solr/build/solr-core/test/J1/../../../../../../../../../home/jenkins/workspace/Lucene-Solr-trunk-Linux/solr/build/solr-core/test/J1/temp/solr.cloud.CollectionsAPIDistributedZkTest_48181FE2605C8A60-001/control-001/solr.xml
[junit4] 2> 297199 INFO (TEST-CollectionsAPIDistributedZkTest.test-seed#[48181FE2605C8A60]) [ ] o.a.s.c.CoresLocator Config-defined core root directory: /home/jenkins/workspace/Lucene-Solr-trunk-Linux/solr/build/solr-core/test/J1/../../../../../../../../../home/jenkins/workspace/Lucene-Solr-trunk-Linux/solr/build/solr-core/test/J1/temp/solr.cloud.CollectionsAPIDistributedZkTest_48181FE2605C8A60-001/control-001/cores
[junit4] 2> 297199 INFO (TEST-CollectionsAPIDistributedZkTest.test-seed#[48181FE2605C8A60]) [ ] o.a.s.c.CoreContainer New CoreContainer 1111444599
[junit4] 2> 297199 INFO (TEST-CollectionsAPIDistributedZkTest.test-seed#[48181FE2605C8A60]) [ ] o.a.s.c.CoreContainer Loading cores into CoreContainer [instanceDir=/home/jenkins/workspace/Lucene-Solr-trunk-Linux/solr/build/solr-core/test/J1/../../../../../../../../../home/jenkins/workspace/Lucene-Solr-trunk-Linux/solr/build/solr-core/test/J1/temp/solr.cloud.CollectionsAPIDistributedZkTest_48181FE2605C8A60-001/control-001/]
[junit4] 2> 297199 INFO (TEST-CollectionsAPIDistributedZkTest.test-seed#[48181FE2605C8A60]) [ ] o.a.s.c.CoreContainer loading shared library: /home/jenkins/workspace/Lucene-Solr-trunk-Linux/solr/build/solr-core/test/J1/../../../../../../../../../home/jenkins/workspace/Lucene-Solr-trunk-Linux/solr/build/solr-core/test/J1/temp/solr.cloud.CollectionsAPIDistributedZkTest_48181FE2605C8A60-001/control-001/lib
[junit4] 2> 297200 WARN (TEST-CollectionsAPIDistributedZkTest.test-seed#[48181FE2605C8A60]) [ ] o.a.s.c.SolrResourceLoader Can't find (or read) directory to add to classloader: lib (resolved as: /home/jenkins/workspace/Lucene-Solr-trunk-Linux/solr/build/solr-core/test/J1/../../../../../../../../../home/jenkins/workspace/Lucene-Solr-trunk-Linux/solr/build/solr-core/test/J1/temp/solr.cloud.CollectionsAPIDistributedZkTest_48181FE2605C8A60-001/control-001/lib).
[junit4] 2> 297204 INFO (TEST-CollectionsAPIDistributedZkTest.test-seed#[48181FE2605C8A60]) [ ] o.a.s.h.c.HttpShardHandlerFactory created with socketTimeout : 90000,urlScheme : ,connTimeout : 15000,maxConnectionsPerHost : 20,maxConnections : 10000,corePoolSize : 0,maximumPoolSize : 2147483647,maxThreadIdleTime : 5,sizeOfQueue : -1,fairnessPolicy : false,useRetries : false,
[junit4] 2> 297205 INFO (TEST-CollectionsAPIDistributedZkTest.test-seed#[48181FE2605C8A60]) [ ] o.a.s.u.UpdateShardHandler Creating UpdateShardHandler HTTP client with params: socketTimeout=340000&connTimeout=45000&retry=true
[junit4] 2> 297205 INFO (TEST-CollectionsAPIDistributedZkTest.test-seed#[48181FE2605C8A60]) [ ] o.a.s.l.LogWatcher SLF4J impl is org.slf4j.impl.Log4jLoggerFactory
[junit4] 2> 297205 INFO (TEST-CollectionsAPIDistributedZkTest.test-seed#[48181FE2605C8A60]) [ ] o.a.s.l.LogWatcher Registering Log Listener [Log4j (org.slf4j.impl.Log4jLoggerFactory)]
[junit4] 2> 297205 INFO (TEST-CollectionsAPIDistributedZkTest.test-seed#[48181FE2605C8A60]) [ ] o.a.s.c.ZkContainer Zookeeper client=127.0.0.1:59563/solr
[junit4] 2> 297205 INFO (TEST-CollectionsAPIDistributedZkTest.test-seed#[48181FE2605C8A60]) [ ] o.a.s.c.ZkController zkHost includes chroot
[junit4] 2> 297205 INFO (TEST-CollectionsAPIDistributedZkTest.test-seed#[48181FE2605C8A60]) [ ] o.a.s.c.c.SolrZkClient Using default ZkCredentialsProvider
[junit4] 2> 297206 INFO (TEST-CollectionsAPIDistributedZkTest.test-seed#[48181FE2605C8A60]) [ ] o.a.s.c.c.ConnectionManager Waiting for client to connect to ZooKeeper
[junit4] 2> 297207 INFO (zkCallback-354-thread-1) [ ] o.a.s.c.c.ConnectionManager Watcher org.apache.solr.common.cloud.ConnectionManager@573c612d name:ZooKeeperConnection Watcher:127.0.0.1:59563 got event WatchedEvent state:SyncConnected type:None path:null path:null type:None
[junit4] 2> 297207 INFO (TEST-CollectionsAPIDistributedZkTest.test-seed#[48181FE2605C8A60]) [ ] o.a.s.c.c.ConnectionManager Client is connected to ZooKeeper
[junit4] 2> 297208 INFO (TEST-CollectionsAPIDistributedZkTest.test-seed#[48181FE2605C8A60]) [ ] o.a.s.c.c.SolrZkClient Using default ZkACLProvider
[junit4] 2> 297209 INFO (TEST-CollectionsAPIDistributedZkTest.test-seed#[48181FE2605C8A60]) [n:127.0.0.1:33260_vq_k%2Flm ] o.a.s.c.c.ConnectionManager Waiting for client to connect to ZooKeeper
[junit4] 2> 297210 INFO (zkCallback-355-thread-1-processing-n:127.0.0.1:33260_vq_k%2Flm) [n:127.0.0.1:33260_vq_k%2Flm ] o.a.s.c.c.ConnectionManager Watcher org.apache.solr.common.cloud.ConnectionManager@34211e38 name:ZooKeeperConnection Watcher:127.0.0.1:59563/solr got event WatchedEvent state:SyncConnected type:None path:null path:null type:None
[junit4] 2> 297210 INFO (TEST-CollectionsAPIDistributedZkTest.test-seed#[48181FE2605C8A60]) [n:127.0.0.1:33260_vq_k%2Flm ] o.a.s.c.c.ConnectionManager Client is connected to ZooKeeper
[junit4] 2> 297211 INFO (TEST-CollectionsAPIDistributedZkTest.test-seed#[48181FE2605C8A60]) [n:127.0.0.1:33260_vq_k%2Flm ] o.a.s.c.c.SolrZkClient makePath: /overseer/queue
[junit4] 2> 297212 INFO (TEST-CollectionsAPIDistributedZkTest.test-seed#[48181FE2605C8A60]) [n:127.0.0.1:33260_vq_k%2Flm ] o.a.s.c.c.SolrZkClient makePath: /overseer/collection-queue-work
[junit4] 2> 297213 INFO (TEST-CollectionsAPIDistributedZkTest.test-seed#[48181FE2605C8A60]) [n:127.0.0.1:33260_vq_k%2Flm ] o.a.s.c.c.SolrZkClient makePath: /overseer/collection-map-running
[junit4] 2> 297214 INFO (TEST-CollectionsAPIDistributedZkTest.test-seed#[48181FE2605C8A60]) [n:127.0.0.1:33260_vq_k%2Flm ] o.a.s.c.c.SolrZkClient makePath: /overseer/collection-map-completed
[junit4] 2> 297215 INFO (TEST-CollectionsAPIDistributedZkTest.test-seed#[48181FE2605C8A60]) [n:127.0.0.1:33260_vq_k%2Flm ] o.a.s.c.c.SolrZkClient makePath: /overseer/collection-map-failure
[junit4] 2> 297216 INFO (TEST-CollectionsAPIDistributedZkTest.test-seed#[48181FE2605C8A60]) [n:127.0.0.1:33260_vq_k%2Flm ] o.a.s.c.c.SolrZkClient makePath: /live_nodes
[junit4] 2> 297216 INFO (TEST-CollectionsAPIDistributedZkTest.test-seed#[48181FE2605C8A60]) [n:127.0.0.1:33260_vq_k%2Flm ] o.a.s.c.c.SolrZkClient makePath: /aliases.json
[junit4] 2> 297217 INFO (TEST-CollectionsAPIDistributedZkTest.test-seed#[48181FE2605C8A60]) [n:127.0.0.1:33260_vq_k%2Flm ] o.a.s.c.c.SolrZkClient makePath: /clusterstate.json
[junit4] 2> 297217 INFO (TEST-CollectionsAPIDistributedZkTest.test-seed#[48181FE2605C8A60]) [n:127.0.0.1:33260_vq_k%2Flm ] o.a.s.c.c.SolrZkClient makePath: /security.json
[junit4] 2> 297217 INFO (TEST-CollectionsAPIDistributedZkTest.test-seed#[48181FE2605C8A60]) [n:127.0.0.1:33260_vq_k%2Flm ] o.a.s.c.ZkController Register node as live in ZooKeeper:/live_nodes/127.0.0.1:33260_vq_k%2Flm
[junit4] 2> 297217 INFO (TEST-CollectionsAPIDistributedZkTest.test-seed#[48181FE2605C8A60]) [n:127.0.0.1:33260_vq_k%2Flm ] o.a.s.c.c.SolrZkClient makePath: /live_nodes/127.0.0.1:33260_vq_k%2Flm
[junit4] 2> 297218 INFO (TEST-CollectionsAPIDistributedZkTest.test-seed#[48181FE2605C8A60]) [n:127.0.0.1:33260_vq_k%2Flm ] o.a.s.c.c.SolrZkClient makePath: /overseer_elect
[junit4] 2> 297219 INFO (TEST-CollectionsAPIDistributedZkTest.test-seed#[48181FE2605C8A60]) [n:127.0.0.1:33260_vq_k%2Flm ] o.a.s.c.c.SolrZkClient makePath: /overseer_elect/election
[junit4] 2> 297219 INFO (TEST-CollectionsAPIDistributedZkTest.test-seed#[48181FE2605C8A60]) [n:127.0.0.1:33260_vq_k%2Flm ] o.a.s.c.Overseer Overseer (id=null) closing
[junit4] 2> 297219 INFO (TEST-CollectionsAPIDistributedZkTest.test-seed#[48181FE2605C8A60]) [n:127.0.0.1:33260_vq_k%2Flm ] o.a.s.c.LeaderElector Joined leadership election with path: /overseer_elect/election/94833617172234244-127.0.0.1:33260_vq_k%2Flm-n_0000000000
[junit4] 2> 297219 INFO (TEST-CollectionsAPIDistributedZkTest.test-seed#[48181FE2605C8A60]) [n:127.0.0.1:33260_vq_k%2Flm ] o.a.s.c.OverseerElectionContext I am going to be the leader 127.0.0.1:33260_vq_k%2Flm
[junit4] 2> 297220 INFO (TEST-CollectionsAPIDistributedZkTest.test-seed#[48181FE2605C8A60]) [n:127.0.0.1:33260_vq_k%2Flm ] o.a.s.c.c.SolrZkClient makePath: /overseer_elect/leader
[junit4] 2> 297220 INFO (TEST-CollectionsAPIDistributedZkTest.test-seed#[48181FE2605C8A60]) [n:127.0.0.1:33260_vq_k%2Flm ] o.a.s.c.Overseer Overseer (id=94833617172234244-127.0.0.1:33260_vq_k%2Flm-n_0000000000) starting
[junit4] 2> 297221 INFO (TEST-CollectionsAPIDistributedZkTest.test-seed#[48181FE2605C8A60]) [n:127.0.0.1:33260_vq_k%2Flm ] o.a.s.c.c.SolrZkClient makePath: /overseer/queue-work
[junit4] 2> 297223 INFO (TEST-CollectionsAPIDistributedZkTest.test-seed#[48181FE2605C8A60]) [n:127.0.0.1:33260_vq_k%2Flm ] o.a.s.c.OverseerAutoReplicaFailoverThread Starting OverseerAutoReplicaFailoverThread autoReplicaFailoverWorkLoopDelay=10000 autoReplicaFailoverWaitAfterExpiration=10000 autoReplicaFailoverBadNodeExpiration=60000
[junit4] 2> 297223 INFO (OverseerCollectionConfigSetProcessor-94833617172234244-127.0.0.1:33260_vq_k%2Flm-n_0000000000) [n:127.0.0.1:33260_vq_k%2Flm ] o.a.s.c.OverseerTaskProcessor Process current queue of overseer operations
[junit4] 2> 297223 INFO (TEST-CollectionsAPIDistributedZkTest.test-seed#[48181FE2605C8A60]) [n:127.0.0.1:33260_vq_k%2Flm ] o.a.s.c.c.ZkStateReader Updating cluster state from ZooKeeper...
[junit4] 2> 297224 INFO (OverseerStateUpdate-94833617172234244-127.0.0.1:33260_vq_k%2Flm-n_0000000000) [n:127.0.0.1:33260_vq_k%2Flm ] o.a.s.c.Overseer Starting to work on the main queue
[junit4] 2> 297230 INFO (TEST-CollectionsAPIDistributedZkTest.test-seed#[48181FE2605C8A60]) [n:127.0.0.1:33260_vq_k%2Flm ] o.a.s.c.CoreContainer Security conf doesn't exist. Skipping setup for authorization module.
[junit4] 2> 297230 INFO (TEST-CollectionsAPIDistributedZkTest.test-seed#[48181FE2605C8A60]) [n:127.0.0.1:33260_vq_k%2Flm ] o.a.s.c.CoreContainer No authentication plugin used.
[junit4] 2> 297231 INFO (TEST-CollectionsAPIDistributedZkTest.test-seed#[48181FE2605C8A60]) [n:127.0.0.1:33260_vq_k%2Flm ] o.a.s.c.CoresLocator Looking for core definitions underneath /home/jenkins/workspace/Lucene-Solr-trunk-Linux/solr/build/solr-core/test/J1/../../../../../../../../../home/jenkins/workspace/Lucene-Solr-trunk-Linux/solr/build/solr-core/test/J1/temp/solr.cloud.CollectionsAPIDistributedZkTest_48181FE2605C8A60-001/control-001/cores
[junit4] 2> 297231 INFO (TEST-CollectionsAPIDistributedZkTest.test-seed#[48181FE2605C8A60]) [n:127.0.0.1:33260_vq_k%2Flm ] o.a.s.c.SolrCore Created CoreDescriptor: {name=collection1, config=solrconfig.xml, transient=false, schema=schema.xml, loadOnStartup=true, configSetProperties=configsetprops.json, instanceDir=/home/jenkins/workspace/Lucene-Solr-trunk-Linux/solr/build/solr-core/test/J1/../../../../../../../../../home/jenkins/workspace/Lucene-Solr-trunk-Linux/solr/build/solr-core/test/J1/temp/solr.cloud.CollectionsAPIDistributedZkTest_48181FE2605C8A60-001/control-001/cores/collection1, collection=control_collection, absoluteInstDir=/home/jenkins/workspace/Lucene-Solr-trunk-Linux/solr/build/solr-core/test/J1/../../../../../../../../../home/jenkins/workspace/Lucene-Solr-trunk-Linux/solr/build/solr-core/test/J1/temp/solr.cloud.CollectionsAPIDistributedZkTest_48181FE2605C8A60-001/control-001/cores/collection1/, coreNodeName=, dataDir=data/, shard=}
[junit4] 2> 297231 INFO (TEST-CollectionsAPIDistributedZkTest.test-seed#[48181FE2605C8A60]) [n:127.0.0.1:33260_vq_k%2Flm ] o.a.s.c.CoresLocator Found core collection1 in /home/jenkins/workspace/Lucene-Solr-trunk-Linux/solr/build/solr-core/test/J1/../../../../../../../../../home/jenkins/workspace/Lucene-Solr-trunk-Linux/solr/build/solr-core/test/J1/temp/solr.cloud.CollectionsAPIDistributedZkTest_48181FE2605C8A60-001/control-001/cores/collection1/
[junit4] 2> 297231 INFO (TEST-CollectionsAPIDistributedZkTest.test-seed#[48181FE2605C8A60]) [n:127.0.0.1:33260_vq_k%2Flm ] o.a.s.c.CoresLocator Found 1 core definitions
[junit4] 2> 297232 INFO (TEST-CollectionsAPIDistributedZkTest.test-seed#[48181FE2605C8A60]) [n:127.0.0.1:33260_vq_k%2Flm ] o.a.s.s.SolrDispatchFilter user.dir=/home/jenkins/workspace/Lucene-Solr-trunk-Linux/solr/build/solr-core/test/J1
[junit4] 2> 297232 INFO (TEST-CollectionsAPIDistributedZkTest.test-seed#[48181FE2605C8A60]) [n:127.0.0.1:33260_vq_k%2Flm ] o.a.s.s.SolrDispatchFilter SolrDispatchFilter.init() done
[junit4] 2> 297232 INFO (coreLoadExecutor-1327-thread-1-processing-n:127.0.0.1:33260_vq_k%2Flm) [n:127.0.0.1:33260_vq_k%2Flm c:control_collection x:collection1] o.a.s.c.ZkController publishing state=down
[junit4] 2> 297232 INFO (coreLoadExecutor-1327-thread-1-processing-n:127.0.0.1:33260_vq_k%2Flm) [n:127.0.0.1:33260_vq_k%2Flm c:control_collection x:collection1] o.a.s.c.ZkController numShards not found on descriptor - reading it from system property
[junit4] 2> 297233 INFO (OverseerStateUpdate-94833617172234244-127.0.0.1:33260_vq_k%2Flm-n_0000000000) [n:127.0.0.1:33260_vq_k%2Flm ] o.a.s.c.Overseer processMessage: queueSize: 1, message = {
[junit4] 2> "core":"collection1",
[junit4] 2> "roles":null,
[junit4] 2> "base_url":"http://127.0.0.1:33260/vq_k/lm",
[junit4] 2> "node_name":"127.0.0.1:33260_vq_k%2Flm",
[junit4] 2> "numShards":"1",
[junit4] 2> "state":"down",
[junit4] 2> "shard":null,
[junit4] 2> "collection":"control_collection",
[junit4] 2> "operation":"state"} current state version: 0
[junit4] 2> 297233 INFO (coreLoadExecutor-1327-thread-1-processing-n:127.0.0.1:33260_vq_k%2Flm) [n:127.0.0.1:33260_vq_k%2Flm c:control_collection x:collection1] o.a.s.c.ZkController look for our core node name
[junit4] 2> 297233 INFO (OverseerStateUpdate-94833617172234244-127.0.0.1:33260_vq_k%2Flm-n_0000000000) [n:127.0.0.1:33260_vq_k%2Flm ] o.a.s.c.o.ReplicaMutator Update state numShards=1 message={
[junit4] 2> "core":"collection1",
[junit4] 2> "roles":null,
[junit4] 2> "base_url":"http://127.0.0.1:33260/vq_k/lm",
[junit4] 2> "node_name":"127.0.0.1:33260_vq_k%2Flm",
[junit4] 2> "numShards":"1",
[junit4] 2> "state":"down",
[junit4] 2> "shard":null,
[junit4] 2> "collection":"control_collection",
[junit4] 2> "operation":"state"}
[junit4] 2> 297233 INFO (OverseerStateUpdate-94833617172234244-127.0.0.1:33260_vq_k%2Flm-n_0000000000) [n:127.0.0.1:33260_vq_k%2Flm ] o.a.s.c.o.ClusterStateMutator building a new cName: control_collection
[junit4] 2> 297234 INFO (OverseerStateUpdate-94833617172234244-127.0.0.1:33260_vq_k%2Flm-n_0000000000) [n:127.0.0.1:33260_vq_k%2Flm ] o.a.s.c.o.ReplicaMutator Assigning new node to shard shard=shard1
[junit4] 2> 297234 INFO (zkCallback-355-thread-1-processing-n:127.0.0.1:33260_vq_k%2Flm) [n:127.0.0.1:33260_vq_k%2Flm ] o.a.s.c.c.ZkStateReader A cluster state change: WatchedEvent state:SyncConnected type:NodeDataChanged path:/clusterstate.json, has occurred - updating... (live nodes size: 1)
[junit4] 2> 298233 INFO (coreLoadExecutor-1327-thread-1-processing-n:127.0.0.1:33260_vq_k%2Flm) [n:127.0.0.1:33260_vq_k%2Flm c:control_collection x:collection1] o.a.s.c.ZkController waiting to find shard id in clusterstate for collection1
[junit4] 2> 298233 INFO (coreLoadExecutor-1327-thread-1-processing-n:127.0.0.1:33260_vq_k%2Flm) [n:127.0.0.1:33260_vq_k%2Flm c:control_collection x:collection1] o.a.s.c.ZkController Check for collection zkNode:control_collection
[junit4] 2> 298234 INFO (coreLoadExecutor-1327-thread-1-processing-n:127.0.0.1:33260_vq_k%2Flm) [n:127.0.0.1:33260_vq_k%2Flm c:control_collection x:collection1] o.a.s.c.ZkController Collection zkNode exists
[junit4] 2> 298234 INFO (coreLoadExecutor-1327-thread-1-processing-n:127.0.0.1:33260_vq_k%2Flm) [n:127.0.0.1:33260_vq_k%2Flm c:control_collection x:collection1] o.a.s.c.c.ZkStateReader Load collection config from:/collections/control_collection
[junit4] 2> 298234 INFO (coreLoadExecutor-1327-thread-1-processing-n:127.0.0.1:33260_vq_k%2Flm) [n:127.0.0.1:33260_vq_k%2Flm c:control_collection x:collection1] o.a.s.c.c.ZkStateReader path=/collections/control_collection configName=conf1 specified config exists in ZooKeeper
[junit4] 2> 298234 INFO (coreLoadExecutor-1327-thread-1-processing-n:127.0.0.1:33260_vq_k%2Flm) [n:127.0.0.1:33260_vq_k%2Flm c:control_collection x:collection1] o.a.s.c.SolrResourceLoader new SolrResourceLoader for directory: '/home/jenkins/workspace/Lucene-Solr-trunk-Linux/solr/build/solr-core/test/J1/../../../../../../../../../home/jenkins/workspace/Lucene-Solr-trunk-Linux/solr/build/solr-core/test/J1/temp/solr.cloud.CollectionsAPIDistributedZkTest_48181FE2605C8A60-001/control-001/cores/collection1/'
[junit4] 2> 298234 INFO (coreLoadExecutor-1327-thread-1-processing-n:127.0.0.1:33260_vq_k%2Flm) [n:127.0.0.1:33260_vq_k%2Flm c:control_collection x:collection1] o.a.s.c.SolrResourceLoader JNDI not configured for solr (NoInitialContextEx)
[junit4] 2> 298234 INFO (coreLoadExecutor-1327-thread-1-processing-n:127.0.0.1:33260_vq_k%2Flm) [n:127.0.0.1:33260_vq_k%2Flm c:control_collection x:collection1] o.a.s.c.SolrResourceLoader solr home defaulted to 'solr/' (could not find system property or JNDI)
[junit4] 2> 298252 INFO (coreLoadExecutor-1327-thread-1-processing-n:127.0.0.1:33260_vq_k%2Flm) [n:127.0.0.1:33260_vq_k%2Flm c:control_collection x:collection1] o.a.s.c.Config loaded config solrconfig.xml with version 0
[junit4] 2> 298255 INFO (coreLoadExecutor-1327-thread-1-processing-n:127.0.0.1:33260_vq_k%2Flm) [n:127.0.0.1:33260_vq_k%2Flm c:control_collection x:collection1] o.a.s.c.SolrConfig current version of requestparams : -1
[junit4] 2> 298257 INFO (coreLoadExecutor-1327-thread-1-processing-n:127.0.0.1:33260_vq_k%2Flm) [n:127.0.0.1:33260_vq_k%2Flm c:control_collection x:collection1] o.a.s.c.SolrConfig Using Lucene MatchVersion: 6.0.0
[junit4] 2> 298265 INFO (coreLoadExecutor-1327-thread-1-processing-n:127.0.0.1:33260_vq_k%2Flm) [n:127.0.0.1:33260_vq_k%2Flm c:control_collection x:collection1] o.a.s.c.Config Loaded SolrConfig: solrconfig.xml
[junit4] 2> 298265 INFO (coreLoadExecutor-1327-thread-1-processing-n:127.0.0.1:33260_vq_k%2Flm) [n:127.0.0.1:33260_vq_k%2Flm c:control_collection x:collection1] o.a.s.s.IndexSchema Reading Solr Schema from /configs/conf1/schema.xml
[junit4] 2> 298268 INFO (coreLoadExecutor-1327-thread-1-processing-n:127.0.0.1:33260_vq_k%2Flm) [n:127.0.0.1:33260_vq_k%2Flm c:control_collection x:collection1] o.a.s.s.IndexSchema [collection1] Schema name=test
[junit4] 2> 298335 INFO (coreLoadExecutor-1327-thread-1-processing-n:127.0.0.1:33260_vq_k%2Flm) [n:127.0.0.1:33260_vq_k%2Flm c:control_collection x:collection1] o.a.s.s.OpenExchangeRatesOrgProvider Initialized with rates=open-exchange-rates.json, refreshInterval=1440.
[junit4] 2> 298338 INFO (coreLoadExecutor-1327-thread-1-processing-n:127.0.0.1:33260_vq_k%2Flm) [n:127.0.0.1:33260_vq_k%2Flm c:control_collection x:collection1] o.a.s.s.IndexSchema default search field in schema is text
[junit4] 2> 298339 INFO (coreLoadExecutor-1327-thread-1-processing-n:127.0.0.1:33260_vq_k%2Flm) [n:127.0.0.1:33260_vq_k%2Flm c:control_collection x:collection1] o.a.s.s.IndexSchema unique key field: id
[junit4] 2> 298343 INFO (coreLoadExecutor-1327-thread-1-processing-n:127.0.0.1:33260_vq_k%2Flm) [n:127.0.0.1:33260_vq_k%2Flm c:control_collection x:collection1] o.a.s.s.FileExchangeRateProvider Reloading exchange rates from file currency.xml
[junit4] 2> 298345 INFO (coreLoadExecutor-1327-thread-1-processing-n:127.0.0.1:33260_vq_k%2Flm) [n:127.0.0.1:33260_vq_k%2Flm c:control_collection x:collection1] o.a.s.s.FileExchangeRateProvider Reloading exchange rates from file currency.xml
[junit4] 2> 298346 INFO (coreLoadExecutor-1327-thread-1-processing-n:127.0.0.1:33260_vq_k%2Flm) [n:127.0.0.1:33260_vq_k%2Flm c:control_collection x:collection1] o.a.s.s.OpenExchangeRatesOrgProvider Reloading exchange rates from open-exchange-rates.json
[junit4] 2> 298347 WARN (coreLoadExecutor-1327-thread-1-processing-n:127.0.0.1:33260_vq_k%2Flm) [n:127.0.0.1:33260_vq_k%2Flm c:control_collection x:collection1] o.a.s.s.OpenExchangeRatesOrgProvider Unknown key IMPORTANT NOTE
[junit4] 2> 298347 WARN (coreLoadExecutor-1327-thread-1-processing-n:127.0.0.1:33260_vq_k%2Flm) [n:127.0.0.1:33260_vq_k%2Flm c:control_collection x:collection1] o.a.s.s.OpenExchangeRatesOrgProvider Expected key, got STRING
[junit4] 2> 298347 INFO (coreLoadExecutor-1327-thread-1-processing-n:127.0.0.1:33260_vq_k%2Flm) [n:127.0.0.1:33260_vq_k%2Flm c:control_collection x:collection1] o.a.s.s.OpenExchangeRatesOrgProvider Reloading exchange rates from open-exchange-rates.json
[junit4] 2> 298347 WARN (coreLoadExecutor-1327-thread-1-processing-n:127.0.0.1:33260_vq_k%2Flm) [n:127.0.0.1:33260_vq_k%2Flm c:control_collection x:collection1] o.a.s.s.OpenExchangeRatesOrgProvider Unknown key IMPORTANT NOTE
[junit4] 2> 298347 WARN (coreLoadExecutor-1327-thread-1-processing-n:127.0.0.1:33260_vq_k%2Flm) [n:127.0.0.1:33260_vq_k%2Flm c:control_collection x:collection1] o.a.s.s.OpenExchangeRatesOrgProvider Expected key, got STRING
[junit4] 2> 298348 INFO (coreLoadExecutor-1327-thread-1-processing-n:127.0.0.1:33260_vq_k%2Flm) [n:127.0.0.1:33260_vq_k%2Flm c:control_collection x:collection1] o.a.s.c.ConfigSetProperties Did not find ConfigSet properties, assuming default properties: Can't find resource 'configsetprops.json' in classpath or '/configs/conf1', cwd=/home/jenkins/workspace/Lucene-Solr-trunk-Linux/solr/build/solr-core/test/J1
[junit4] 2> 298348 INFO (coreLoadExecutor-1327-thread-1-processing-n:127.0.0.1:33260_vq_k%2Flm) [n:127.0.0.1:33260_vq_k%2Flm c:control_collection x:collection1] o.a.s.c.CoreContainer Creating SolrCore 'collection1' using configuration from collection control_collection
[junit4] 2> 298348 INFO (coreLoadExecutor-1327-thread-1-processing-n:127.0.0.1:33260_vq_k%2Flm) [n:127.0.0.1:33260_vq_k%2Flm c:control_collection s:shard1 r:core_node1 x:collection1] o.a.s.c.SolrCore org.apache.solr.core.MockDirectoryFactory
[junit4] 2> 298348 INFO (coreLoadExecutor-1327-thread-1-processing-n:127.0.0.1:33260_vq_k%2Flm) [n:127.0.0.1:33260_vq_k%2Flm c:control_collection s:shard1 r:core_node1 x:collection1] o.a.s.c.SolrCore [[collection1] ] Opening new SolrCore at [/home/jenkins/workspace/Lucene-Solr-trunk-Linux/solr/build/solr-core/test/J1/../../../../../../../../../home/jenkins/workspace/Lucene-Solr-trunk-Linux/solr/build/solr-core/test/J1/temp/solr.cloud.CollectionsAPIDistributedZkTest_48181FE2605C8A60-001/control-001/cores/collection1/], dataDir=[null]
[junit4] 2> 298348 INFO (coreLoadExecutor-1327-thread-1-processing-n:127.0.0.1:33260_vq_k%2Flm) [n:127.0.0.1:33260_vq_k%2Flm c:control_collection s:shard1 r:core_node1 x:collection1] o.a.s.c.JmxMonitoredMap JMX monitoring is enabled. Adding Solr mbeans to JMX Server: com.sun.jmx.mbeanserver.JmxMBeanServer@2d8b1fcc
[junit4] 2> 298349 INFO (coreLoadExecutor-1327-thread-1-processing-n:127.0.0.1:33260_vq_k%2Flm) [n:127.0.0.1:33260_vq_k%2Flm c:control_collection s:shard1 r:core_node1 x:collection1] o.a.s.c.CachingDirectoryFactory return new directory for /home/jenkins/workspace/Lucene-Solr-trunk-Linux/solr/build/solr-core/test/J1/../../../../../../../../../home/jenkins/workspace/Lucene-Solr-trunk-Linux/solr/build/solr-core/test/J1/temp/solr.cloud.CollectionsAPIDistributedZkTest_48181FE2605C8A60-001/control-001/cores/collection1/data
[junit4] 2> 298349 INFO (coreLoadExecutor-1327-thread-1-processing-n:127.0.0.1:33260_vq_k%2Flm) [n:127.0.0.1:33260_vq_k%2Flm c:control_collection s:shard1 r:core_node1 x:collection1] o.a.s.c.SolrCore New index directory detected: old=null new=/home/jenkins/workspace/Lucene-Solr-trunk-Linux/solr/build/solr-core/test/J1/../../../../../../../../../home/jenkins/workspace/Lucene-Solr-trunk-Linux/solr/build/solr-core/test/J1/temp/solr.cloud.CollectionsAPIDistributedZkTest_48181FE2605C8A60-001/control-001/cores/collection1/data/index/
[junit4] 2> 298363 WARN (coreLoadExecutor-1327-thread-1-processing-n:127.0.0.1:33260_vq_k%2Flm) [n:127.0.0.1:33260_vq_k%2Flm c:control_collection s:shard1 r:core_node1 x:collection1] o.a.s.c.SolrCore [collection1] Solr index directory '/home/jenkins/workspace/Lucene-Solr-trunk-Linux/solr/build/solr-core/test/J1/../../../../../../../../../home/jenkins/workspace/Lucene-Solr-trunk-Linux/solr/build/solr-core/test/J1/temp/solr.cloud.CollectionsAPIDistributedZkTest_48181FE2605C8A60-001/control-001/cores/collection1/data/index' doesn't exist. Creating new index...
[junit4] 2> 298363 INFO (coreLoadExecutor-1327-thread-1-processing-n:127.0.0.1:33260_vq_k%2Flm) [n:127.0.0.1:33260_vq_k%2Flm c:control_collection s:shard1 r:core_node1 x:collection1] o.a.s.c.CachingDirectoryFactory return new directory for /home/jenkins/workspace/Lucene-Solr-trunk-Linux/solr/build/solr-core/test/J1/../../../../../../../../../home/jenkins/workspace/Lucene-Solr-trunk-Linux/solr/build/solr-core/test/J1/temp/solr.cloud.CollectionsAPIDistributedZkTest_48181FE2605C8A60-001/control-001/cores/collection1/data/index
[junit4] 2> 298363 INFO (coreLoadExecutor-1327-thread-1-processing-n:127.0.0.1:33260_vq_k%2Flm) [n:127.0.0.1:33260_vq_k%2Flm c:control_collection s:shard1 r:core_node1 x:collection1] o.a.s.u.RandomMergePolicy RandomMergePolicy wrapping class org.apache.lucene.index.MockRandomMergePolicy: org.apache.lucene.index.MockRandomMergePolicy@2e053651
[junit4] 2> 298364 INFO (coreLoadExecutor-1327-thread-1-processing-n:127.0.0.1:33260_vq_k%2Flm) [n:127.0.0.1:33260_vq_k%2Flm c:control_collection s:shard1 r:core_node1 x:collection1] o.a.s.c.SolrCore SolrDeletionPolicy.onCommit: commits: num=1
[junit4] 2> commit{dir=MockDirectoryWrapper(RAMDirectory@5c066d13 lockFactory=org.apache.lucene.store.SingleInstanceLockFactory@5873eca2),segFN=segments_1,generation=1}
[junit4] 2> 298364 INFO (coreLoadExecutor-1327-thread-1-processing-n:127.0.0.1:33260_vq_k%2Flm) [n:127.0.0.1:33260_vq_k%2Flm c:control_collection s:shard1 r:core_node1 x:collection1] o.a.s.c.SolrCore newest commit generation = 1
[junit4] 2> 298364 INFO (OldIndexDirectoryCleanupThreadForCore-collection1) [n:127.0.0.1:33260_vq_k%2Flm c:control_collection s:shard1 r:core_node1 x:collection1] o.a.s.c.SolrCore Looking for old index directories to cleanup for core collection1 in /home/jenkins/workspace/Lucene-Solr-trunk-Linux/solr/build/solr-core/test/J1/../../../../../../../../../home/jenkins/workspace/Lucene-Solr-trunk-Linux/solr/build/solr-core/test/J1/temp/solr.cloud.CollectionsAPIDistributedZkTest_48181FE2605C8A60-001/control-001/cores/collection1/data/
[junit4] 2> 298364 WARN (OldIndexDirectoryCleanupThreadForCore-collection1) [n:127.0.0.1:33260_vq_k%2Flm c:control_collection s:shard1 r:core_node1 x:collection1] o.a.s.c.DirectoryFactory /home/jenkins/workspace/Lucene-Solr-trunk-Linux/solr/build/solr-core/test/J1/../../../../../../../../../home/jenkins/workspace/Lucene-Solr-trunk-Linux/solr/build/solr-core/test/J1/temp/solr.cloud.CollectionsAPIDistributedZkTest_48181FE2605C8A60-001/control-001/cores/collection1/data/ does not point to a valid data directory; skipping clean-up of old index directories.
[junit4] 2> 298367 INFO (coreLoadExecutor-1327-thread-1-processing-n:127.0.0.1:33260_vq_k%2Flm) [n:127.0.0.1:33260_vq_k%2Flm c:control_collection s:shard1 r:core_node1 x:collection1] o.a.s.u.p.UpdateRequestProcessorChain creating updateRequestProcessorChain "nodistrib"
[junit4] 2> 298367 INFO (coreLoadExecutor-1327-thread-1-processing-n:127.0.0.1:33260_vq_k%2Flm) [n:127.0.0.1:33260_vq_k%2Flm c:control_collection s:shard1 r:core_node1 x:collection1] o.a.s.u.p.UpdateRequestProcessorChain creating updateRequestProcessorChain "dedupe"
[junit4] 2> 298367 INFO (coreLoadExecutor-1327-thread-1-processing-n:127.0.0.1:33260_vq_k%2Flm) [n:127.0.0.1:33260_vq_k%2Flm c:control_collection s:shard1 r:core_node1 x:collection1] o.a.s.u.p.UpdateRequestProcessorChain inserting DistributedUpdateProcessorFactory into updateRequestProcessorChain "dedupe"
[junit4] 2> 298368 INFO (coreLoadExecutor-1327-thread-1-processing-n:127.0.0.1:33260_vq_k%2Flm) [n:127.0.0.1:33260_vq_k%2Flm c:control_collection s:shard1 r:core_node1 x:collection1] o.a.s.u.p.UpdateRequestProcessorChain creating updateRequestProcessorChain "stored_sig"
[junit4] 2> 298368 INFO (coreLoadExecutor-1327-thread-1-processing-n:127.0.0.1:33260_vq_k%2Flm) [n:127.0.0.1:33260_vq_k%2Flm c:control_collection s:shard1 r:core_node1 x:collection1] o.a.s.u.p.UpdateRequestProcessorChain inserting DistributedUpdateProcessorFactory into updateRequestProcessorChain "stored_sig"
[junit4] 2> 298368 INFO (coreLoadExecutor-1327-thread-1-processing-n:127.0.0.1:33260_vq_k%2Flm) [n:127.0.0.1:33260_vq_k%2Flm c:control_collection s:shard1 r:core_node1 x:collection1] o.a.s.u.p.UpdateRequestProcessorChain creating updateRequestProcessorChain "distrib-dup-test-chain-explicit"
[junit4] 2> 298368 INFO (coreLoadExecutor-1327-thread-1-processing-n:127.0.0.1:33260_vq_k%2Flm) [n:127.0.0.1:33260_vq_k%2Flm c:control_collection s:shard1 r:core_node1 x:collection1] o.a.s.u.p.UpdateRequestProcessorChain creating updateRequestProcessorChain "distrib-dup-test-chain-implicit"
[junit4] 2> 298368 INFO (coreLoadExecutor-1327-thread-1-processing-n:127.0.0.1:33260_vq_k%2Flm) [n:127.0.0.1:33260_vq_k%2Flm c:control_collection s:shard1 r:core_node1 x:collection1] o.a.s.u.p.UpdateRequestProcessorChain inserting DistributedUpdateProcessorFactory into updateRequestProcessorChain "distrib-dup-test-chain-implicit"
[junit4] 2> 298368 INFO (coreLoadExecutor-1327-thread-1-processing-n:127.0.0.1:33260_vq_k%2Flm) [n:127.0.0.1:33260_vq_k%2Flm c:control_collection s:shard1 r:core_node1 x:collection1] o.a.s.c.SolrCore no updateRequestProcessorChain defined as default, creating implicit default
[junit4] 2> 298368 WARN (coreLoadExecutor-1327-thread-1-processing-n:127.0.0.1:33260_vq_k%2Flm) [n:127.0.0.1:33260_vq_k%2Flm c:control_collection s:shard1 r:core_node1 x:collection1] o.a.s.c.RequestHandlers INVALID paramSet a in requestHandler {type = requestHandler,name = /dump,class = DumpRequestHandler,args = {defaults={a=A,b=B}}}
[junit4] 2> 298370 INFO (coreLoadExecutor-1327-thread-1-processing-n:127.0.0.1:33260_vq_k%2Flm) [n:127.0.0.1:33260_vq_k%2Flm c:control_collection s:shard1 r:core_node1 x:collection1] o.a.s.h.l.XMLLoader xsltCacheLifetimeSeconds=60
[junit4] 2> 298371 INFO (coreLoadExecutor-1327-thread-1-processing-n:127.0.0.1:33260_vq_k%2Flm) [n:127.0.0.1:33260_vq_k%2Flm c:control_collection s:shard1 r:core_node1 x:collection1] o.a.s.h.l.XMLLoader xsltCacheLifetimeSeconds=60
[junit4] 2> 298372 INFO (coreLoadExecutor-1327-thread-1-processing-n:127.0.0.1:33260_vq_k%2Flm) [n:127.0.0.1:33260_vq_k%2Flm c:control_collection s:shard1 r:core_node1 x:collection1] o.a.s.h.l.XMLLoader xsltCacheLifetimeSeconds=60
[junit4] 2> 298373 INFO (coreLoadExecutor-1327-thread-1-processing-n:127.0.0.1:33260_vq_k%2Flm) [n:127.0.0.1:33260_vq_k%2Flm c:control_collection s:shard1 r:core_node1 x:collection1] o.a.s.h.l.XMLLoader xsltCacheLifetimeSeconds=60
[junit4] 2> 298375 INFO (coreLoadExecutor-1327-thread-1-processing-n:127.0.0.1:33260_vq_k%2Flm) [n:127.0.0.1:33260_vq_k%2Flm c:control_collection s:shard1 r:core_node1 x:collection1] o.a.s.c.RequestHandlers Registered paths: /admin/mbeans,standard,/dump,/update/csv,/update/json/docs,/admin/luke,/admin/segments,/get,/admin/system,/replication,/admin/properties,/config,/schema,/admin/plugins,/admin/logging,/update/json,/admin/threads,/admin/ping,/update,/admin/file
[junit4] 2> 298375 INFO (coreLoadExecutor-1327-thread-1-processing-n:127.0.0.1:33260_vq_k%2Flm) [n:127.0.0.1:33260_vq_k%2Flm c:control_collection s:shard1 r:core_node1 x:collection1] o.a.s.c.SolrCore Using default statsCache cache: org.apache.solr.search.stats.LocalStatsCache
[junit4] 2> 298376 INFO (coreLoadExecutor-1327-thread-1-processing-n:127.0.0.1:33260_vq_k%2Flm) [n:127.0.0.1:33260_vq_k%2Flm c:control_collection s:shard1 r:core_node1 x:collection1] o.a.s.u.UpdateHandler Using UpdateLog implementation: org.apache.solr.update.UpdateLog
[junit4] 2> 298376 INFO (coreLoadExecutor-1327-thread-1-processing-n:127.0.0.1:33260_vq_k%2Flm) [n:127.0.0.1:33260_vq_k%2Flm c:control_collection s:shard1 r:core_node1 x:collection1] o.a.s.u.UpdateLog Initializing UpdateLog: dataDir= defaultSyncLevel=FLUSH numRecordsToKeep=100 maxNumLogsToKeep=10 numVersionBuckets=65536
[junit4] 2> 298377 INFO (coreLoadExecutor-1327-thread-1-processing-n:127.0.0.1:33260_vq_k%2Flm) [n:127.0.0.1:33260_vq_k%2Flm c:control_collection s:shard1 r:core_node1 x:collection1] o.a.s.c.SolrCore Hard AutoCommit: disabled
[junit4] 2> 298377 INFO (coreLoadExecutor-1327-thread-1-processing-n:127.0.0.1:33260_vq_k%2Flm) [n:127.0.0.1:33260_vq_k%2Flm c:control_collection s:shard1 r:core_node1 x:collection1] o.a.s.c.SolrCore Soft AutoCommit: disabled
[junit4] 2> 298377 INFO (coreLoadExecutor-1327-thread-1-processing-n:127.0.0.1:33260_vq_k%2Flm) [n:127.0.0.1:33260_vq_k%2Flm c:control_collection s:shard1 r:core_node1 x:collection1] o.a.s.u.RandomMergePolicy RandomMergePolicy wrapping class org.apache.lucene.index.LogDocMergePolicy: [LogDocMergePolicy: minMergeSize=1000, mergeFactor=50, maxMergeSize=9223372036854775807, maxMergeSizeForForcedMerge=9223372036854775807, calibrateSizeByDeletes=true, maxMergeDocs=2147483647, maxCFSSegmentSizeMB=8.796093022207999E12, noCFSRatio=0.47404780705590566]
[junit4] 2> 298377 INFO (coreLoadExecutor-1327-thread-1-processing-n:127.0.0.1:33260_vq_k%2Flm) [n:127.0.0.1:33260_vq_k%2Flm c:control_collection s:shard1 r:core_node1 x:collection1] o.a.s.c.SolrCore SolrDeletionPolicy.onInit: commits: num=1
[junit4] 2> commit{dir=MockDirectoryWrapper(RAMDirectory@5c066d13 lockFactory=org.apache.lucene.store.SingleInstanceLockFactory@5873eca2),segFN=segments_1,generation=1}
[junit4] 2> 298377 INFO (coreLoadExecutor-1327-thread-1-processing-n:127.0.0.1:33260_vq_k%2Flm) [n:127.0.0.1:33260_vq_k%2Flm c:control_collection s:shard1 r:core_node1 x:collection1] o.a.s.c.SolrCore newest commit generation = 1
[junit4] 2> 298378 INFO (coreLoadExecutor-1327-thread-1-processing-n:127.0.0.1:33260_vq_k%2Flm) [n:127.0.0.1:33260_vq_k%2Flm c:control_collection s:shard1 r:core_node1 x:collection1] o.a.s.s.SolrIndexSearcher Opening Searcher@43fccbb4[collection1] main
[junit4] 2> 298378 INFO (coreLoadExecutor-1327-thread-1-processing-n:127.0.0.1:33260_vq_k%2Flm) [n:127.0.0.1:33260_vq_k%2Flm c:control_collection s:shard1 r:core_node1 x:collection1] o.a.s.c.c.ZkStateReader Load collection config from:/collections/control_collection
[junit4] 2> 298378 INFO (coreLoadExecutor-1327-thread-1-processing-n:127.0.0.1:33260_vq_k%2Flm) [n:127.0.0.1:33260_vq_k%2Flm c:control_collection s:shard1 r:core_node1 x:collection1] o.a.s.c.c.ZkStateReader path=/collections/control_collection configName=conf1 specified config exists in ZooKeeper
[junit4] 2> 298378 INFO (coreLoadExecutor-1327-thread-1-processing-n:127.0.0.1:33260_vq_k%2Flm) [n:127.0.0.1:33260_vq_k%2Flm c:control_collection s:shard1 r:core_node1 x:collection1] o.a.s.r.ManagedResourceStorage Setting up ZooKeeper-based storage for the RestManager with znodeBase: /configs/conf1
[junit4] 2> 298379 INFO (coreLoadExecutor-1327-thread-1-processing-n:127.0.0.1:33260_vq_k%2Flm) [n:127.0.0.1:33260_vq_k%2Flm c:control_collection s:shard1 r:core_node1 x:collection1] o.a.s.r.ManagedResourceStorage Configured ZooKeeperStorageIO with znodeBase: /configs/conf1
[junit4] 2> 298379 INFO (coreLoadExecutor-1327-thread-1-processing-n:127.0.0.1:33260_vq_k%2Flm) [n:127.0.0.1:33260_vq_k%2Flm c:control_collection s:shard1 r:core_node1 x:collection1] o.a.s.r.RestManager Initializing RestManager with initArgs: {}
[junit4] 2> 298379 INFO (coreLoadExecutor-1327-thread-1-processing-n:127.0.0.1:33260_vq_k%2Flm) [n:127.0.0.1:33260_vq_k%2Flm c:control_collection s:shard1 r:core_node1 x:collection1] o.a.s.r.ManagedResourceStorage Reading _rest_managed.json using ZooKeeperStorageIO:path=/configs/conf1
[junit4] 2> 298379 INFO (coreLoadExecutor-1327-thread-1-processing-n:127.0.0.1:33260_vq_k%2Flm) [n:127.0.0.1:33260_vq_k%2Flm c:control_collection s:shard1 r:core_node1 x:collection1] o.a.s.r.ManagedResourceStorage No data found for znode /configs/conf1/_rest_managed.json
[junit4] 2> 298379 INFO (coreLoadExecutor-1327-thread-1-processing-n:127.0.0.1:33260_vq_k%2Flm) [n:127.0.0.1:33260_vq_k%2Flm c:control_collection s:shard1 r:core_node1 x:collection1] o.a.s.r.ManagedResourceStorage Loaded null at path _rest_managed.json using ZooKeeperStorageIO:path=/configs/conf1
[junit4] 2> 298379 INFO (coreLoadExecutor-1327-thread-1-processing-n:127.0.0.1:33260_vq_k%2Flm) [n:127.0.0.1:33260_vq_k%2Flm c:control_collection s:shard1 r:core_node1 x:collection1] o.a.s.r.RestManager Initializing 0 registered ManagedResources
[junit4] 2> 298380 INFO (coreLoadExecutor-1327-thread-1-processing-n:127.0.0.1:33260_vq_k%2Flm) [n:127.0.0.1:33260_vq_k%2Flm c:control_collection s:shard1 r:core_node1 x:collection1] o.a.s.h.ReplicationHandler Commits will be reserved for 10000
[junit4] 2> 298380 INFO (searcherExecutor-1328-thread-1-processing-n:127.0.0.1:33260_vq_k%2Flm x:collection1 s:shard1 c:control_collection r:core_node1) [n:127.0.0.1:33260_vq_k%2Flm c:control_collection s:shard1 r:core_node1 x:collection1] o.a.s.c.SolrCore [collection1] Registered new searcher Searcher@43fccbb4[collection1] main{ExitableDirectoryReader(UninvertingDirectoryReader())}
[junit4] 2> 298380 INFO (coreLoadExecutor-1327-thread-1-processing-n:127.0.0.1:33260_vq_k%2Flm) [n:127.0.0.1:33260_vq_k%2Flm c:control_collection s:shard1 r:core_node1 x:collection1] o.a.s.u.UpdateLog Looking up max value of version field to seed version buckets
[junit4] 2> 298380 INFO (coreLoadExecutor-1327-thread-1-processing-n:127.0.0.1:33260_vq_k%2Flm) [n:127.0.0.1:33260_vq_k%2Flm c:control_collection s:shard1 r:core_node1 x:collection1] o.a.s.u.VersionInfo Refreshing highest value of _version_ for 65536 version buckets from index
[junit4] 2> 298380 INFO (coreLoadExecutor-1327-thread-1-processing-n:127.0.0.1:33260_vq_k%2Flm) [n:127.0.0.1:33260_vq_k%2Flm c:control_collection s:shard1 r:core_node1 x:collection1] o.a.s.u.VersionInfo No terms found for _version_, cannot seed version bucket highest value from index
[junit4] 2> 298380 INFO (coreLoadExecutor-1327-thread-1-processing-n:127.0.0.1:33260_vq_k%2Flm) [n:127.0.0.1:33260_vq_k%2Flm c:control_collection s:shard1 r:core_node1 x:collection1] o.a.s.u.UpdateLog Could not find max version in index or recent updates, using new clock 1517337876190199808
[junit4] 2> 298383 INFO (coreLoadExecutor-1327-thread-1-processing-n:127.0.0.1:33260_vq_k%2Flm) [n:127.0.0.1:33260_vq_k%2Flm c:control_collection s:shard1 r:core_node1 x:collection1] o.a.s.u.UpdateLog Took 2.0ms to seed version buckets with highest version 1517337876190199808
[junit4] 2> 298383 INFO (coreLoadExecutor-1327-thread-1-processing-n:127.0.0.1:33260_vq_k%2Flm) [n:127.0.0.1:33260_vq_k%2Flm c:control_collection s:shard1 r:core_node1 x:collection1] o.a.s.c.ZkController watch zkdir /configs/conf1
[junit4] 2> 298386 INFO (coreLoadExecutor-1327-thread-1-processing-n:127.0.0.1:33260_vq_k%2Flm) [n:127.0.0.1:33260_vq_k%2Flm c:control_collection s:shard1 r:core_node1 x:collection1] o.a.s.c.CoreContainer registering core: collection1
[junit4] 2> 298386 INFO (coreZkRegister-1321-thread-1-processing-n:127.0.0.1:33260_vq_k%2Flm x:collection1 s:shard1 c:control_collection r:core_node1) [n:127.0.0.1:33260_vq_k%2Flm c:control_collection s:shard1 r:core_node1 x:collection1] o.a.s.c.ZkController Register replica - core:collection1 address:http://127.0.0.1:33260/vq_k/lm collection:control_collection shard:shard1
[junit4] 2> 298387 INFO (coreZkRegister-1321-thread-1-processing-n:127.0.0.1:33260_vq_k%2Flm x:collection1 s:shard1 c:control_collection r:core_node1) [n:127.0.0.1:33260_vq_k%2Flm c:control_collection s:shard1 r:core_node1 x:collection1] o.a.s.c.c.SolrZkClient makePath: /collections/control_collection/leader_elect/shard1/election
[junit4] 2> 298389 INFO (coreZkRegister-1321-thread-1-processing-n:127.0.0.1:33260_vq_k%2Flm x:collection1 s:shard1 c:control_collection r:core_node1) [n:127.0.0.1:33260_vq_k%2Flm c:control_collection s:shard1 r:core_node1 x:collection1] o.a.s.c.LeaderElector Joined leadership election with path: /collections/control_collection/leader_elect/shard1/election/94833617172234244-core_node1-n_0000000000
[junit4] 2> 298389 INFO (coreZkRegister-1321-thread-1-processing-n:127.0.0.1:33260_vq_k%2Flm x:collection1 s:shard1 c:control_collection r:core_node1) [n:127.0.0.1:33260_vq_k%2Flm c:control_collection s:shard1 r:core_node1 x:collection1] o.a.s.c.ShardLeaderElectionContext Running the leader process for shard shard1
[junit4] 2> 298390 INFO (coreZkRegister-1321-thread-1-processing-n:127.0.0.1:33260_vq_k%2Flm x:collection1 s:shard1 c:control_collection r:core_node1) [n:127.0.0.1:33260_vq_k%2Flm c:control_collection s:shard1 r:core_node1 x:collection1] o.a.s.c.ShardLeaderElectionContext Enough replicas found to continue.
[junit4] 2> 298390 INFO (coreZkRegister-1321-thread-1-processing-n:127.0.0.1:33260_vq_k%2Flm x:collection1 s:shard1 c:control_collection r:core_node1) [n:127.0.0.1:33260_vq_k%2Flm c:control_collection s:shard1 r:core_node1 x:collection1] o.a.s.c.ShardLeaderElectionContext I may be the new leader - try and sync
[junit4] 2> 298390 INFO (coreZkRegister-1321-thread-1-processing-n:127.0.0.1:33260_vq_k%2Flm x:collection1 s:shard1 c:control_collection r:core_node1) [n:127.0.0.1:33260_vq_k%2Flm c:control_collection s:shard1 r:core_node1 x:collection1] o.a.s.c.SyncStrategy Sync replicas to http://127.0.0.1:33260/vq_k/lm/collection1/
[junit4] 2> 298390 INFO (coreZkRegister-1321-thread-1-processing-n:127.0.0.1:33260_vq_k%2Flm x:collection1 s:shard1 c:control_collection r:core_node1) [n:127.0.0.1:33260_vq_k%2Flm c:control_collection s:shard1 r:core_node1 x:collection1] o.a.s.c.SyncStrategy Sync Success - now sync replicas to me
[junit4] 2> 298390 INFO (OverseerStateUpdate-94833617172234244-127.0.0.1:33260_vq_k%2Flm-n_0000000000) [n:127.0.0.1:33260_vq_k%2Flm ] o.a.s.c.Overseer processMessage: queueSize: 1, message = {
[junit4] 2> "operation":"leader",
[junit4] 2> "shard":"shard1",
[junit4] 2> "collection":"control_collection"} current state version: 1
[junit4] 2> 298390 INFO (coreZkRegister-1321-thread-1-processing-n:127.0.0.1:33260_vq_k%2Flm x:collection1 s:shard1 c:control_collection r:core_node1) [n:127.0.0.1:33260_vq_k%2Flm c:control_collection s:shard1 r:core_node1 x:collection1] o.a.s.c.SyncStrategy http://127.0.0.1:33260/vq_k/lm/collection1/ has no replicas
[junit4] 2> 298390 INFO (coreZkRegister-1321-thread-1-processing-n:127.0.0.1:33260_vq_k%2Flm x:collection1 s:shard1 c:control_collection r:core_node1) [n:127.0.0.1:33260_vq_k%2Flm c:control_collection s:shard1 r:core_node1 x:collection1] o.a.s.c.ShardLeaderElectionContext I am the new leader: http://127.0.0.1:33260/vq_k/lm/collection1/ shard1
[junit4] 2> 298390 INFO (coreZkRegister-1321-thread-1-processing-n:127.0.0.1:33260_vq_k%2Flm x:collection1 s:shard1 c:control_collection r:core_node1) [n:127.0.0.1:33260_vq_k%2Flm c:control_collection s:shard1 r:core_node1 x:collection1] o.a.s.c.c.SolrZkClient makePath: /collections/control_collection/leaders/shard1
[junit4] 2> 298391 INFO (coreZkRegister-1321-thread-1-processing-n:127.0.0.1:33260_vq_k%2Flm x:collection1 s:shard1 c:control_collection r:core_node1) [n:127.0.0.1:33260_vq_k%2Flm c:control_collection s:shard1 r:core_node1 x:collection1] o.a.s.c.ShardLeaderElectionContextBase Creating leader registration node
[junit4] 2> 298393 INFO (OverseerStateUpdate-94833617172234244-127.0.0.1:33260_vq_k%2Flm-n_0000000000) [n:127.0.0.1:33260_vq_k%2Flm ] o.a.s.c.Overseer processMessage: queueSize: 1, message = {
[junit4] 2> "operation":"state",
[junit4] 2> "state":"active",
[junit4] 2> "shard":"shard1",
[junit4] 2> "collection":"control_collection",
[junit4] 2> "base_url":"http://127.0.0.1:33260/vq_k/lm",
[junit4] 2> "node_name":"127.0.0.1:33260_vq_k%2Flm",
[junit4] 2> "core_node_name":"core_node1",
[junit4] 2> "core":"collection1"} current state version: 1
[junit4] 2> 298394 INFO (OverseerStateUpdate-94833617172234244-127.0.0.1:33260_vq_k%2Flm-n_0000000000) [n:127.0.0.1:33260_vq_k%2Flm ] o.a.s.c.o.ReplicaMutator Update state numShards=null message={
[junit4] 2> "operation":"state",
[junit4] 2> "state":"active",
[junit4] 2> "shard":"shard1",
[junit4] 2> "collection":"control_collection",
[junit4] 2> "base_url":"http://127.0.0.1:33260/vq_k/lm",
[junit4] 2> "node_name":"127.0.0.1:33260_vq_k%2Flm",
[junit4] 2> "core_node_name":"core_node1",
[junit4] 2> "core":"collection1"}
[junit4] 2> 298395 INFO (OverseerStateUpdate-94833617172234244-127.0.0.1:33260_vq_k%2Flm-n_0000000000) [n:127.0.0.1:33260_vq_k%2Flm ] o.a.s.c.Overseer processMessage: queueSize: 1, message = {
[junit4] 2> "operation":"leader",
[junit4] 2> "shard":"shard1",
[junit4] 2> "collection":"control_collection",
[junit4] 2> "base_url":"http://127.0.0.1:33260/vq_k/lm",
[junit4] 2> "core":"collection1"} current state version: 1
[junit4] 2> 298497 INFO (zkCallback-355-thread-1-processing-n:127.0.0.1:33260_vq_k%2Flm) [n:127.0.0.1:33260_vq_k%2Flm ] o.a.s.c.c.ZkStateReader A cluster state change: WatchedEvent state:SyncConnected type:NodeDataChanged path:/clusterstate.json, has occurred - updating... (live nodes size: 1)
[junit4] 2> 298546 INFO (coreZkRegister-1321-thread-1-processing-n:127.0.0.1:33260_vq_k%2Flm x:collection1 s:shard1 c:control_collection r:core_node1) [n:127.0.0.1:33260_vq_k%2Flm c:control_collection s:shard1 r:core_node1 x:collection1] o.a.s.c.ZkController We are http://127.0.0.1:33260/vq_k/lm/collection1/ and leader is http://127.0.0.1:33260/vq_k/lm/collection1/
[junit4] 2> 298546 INFO (coreZkRegister-1321-thread-1-processing-n:127.0.0.1:33260_vq_k%2Flm x:collection1 s:shard1 c:control_collection r:core_node1) [n:127.0.0.1:33260_vq_k%2Flm c:control_collection s:shard1 r:core_node1 x:collection1] o.a.s.c.ZkController No LogReplay needed for core=collection1 baseURL=http://127.0.0.1:33260/vq_k/lm
[junit4] 2> 298546 INFO (coreZkRegister-1321-thread-1-processing-n:127.0.0.1:33260_vq_k%2Flm x:collection1 s:shard1 c:control_collection r:core_node1) [n:127.0.0.1:33260_vq_k%2Flm c:control_collection s:shard1 r:core_node1 x:collection1] o.a.s.c.ZkController I am the leader, no recovery necessary
[junit4] 2> 298546 INFO (coreZkRegister-1321-thread-1-processing-n:127.0.0.1:33260_vq_k%2Flm x:collection1 s:shard1 c:control_collection r:core_node1) [n:127.0.0.1:33260_vq_k%2Flm c:control_collection s:shard1 r:core_node1 x:collection1] o.a.s.c.ZkController publishing state=active
[junit4] 2> 298546 INFO (coreZkRegister-1321-thread-1-processing-n:127.0.0.1:33260_vq_k%2Flm x:collection1 s:shard1 c:control_collection r:core_node1) [n:127.0.0.1:33260_vq_k%2Flm c:control_collection s:shard1 r:core_node1 x:collection1] o.a.s.c.ZkController numShards not found on descriptor - reading it from system property
[junit4] 2> 298547 INFO (OverseerStateUpdate-94833617172234244-127.0.0.1:33260_vq_k%2Flm-n_0000000000) [n:127.0.0.1:33260_vq_k%2Flm ] o.a.s.c.Overseer processMessage: queueSize: 1, message = {
[junit4] 2> "core":"collection1",
[junit4] 2> "core_node_name":"core_node1",
[junit4] 2> "roles":null,
[junit4] 2> "base_url":"http://127.0.0.1:33260/vq_k/lm",
[junit4] 2> "node_name":"127.0.0.1:33260_vq_k%2Flm",
[junit4] 2> "numShards":"1",
[junit4] 2> "state":"active",
[junit4] 2> "shard":"shard1",
[junit4] 2> "collection":"control_collection",
[junit4] 2> "operation":"state"} current state version: 2
[junit4] 2> 298547 INFO (OverseerStateUpdate-94833617172234244-127.0.0.1:33260_vq_k%2Flm-n_0000000000) [n:127.0.0.1:33260_vq_k%2Flm ] o.a.s.c.o.ReplicaMutator Update state numShards=1 message={
[junit4] 2> "core":"collection1",
[junit4] 2> "core_node_name":"core_node1",
[junit4] 2> "roles":null,
[junit4] 2> "base_url":"http://127.0.0.1:33260/vq_k/lm",
[junit4] 2> "node_name":"127.0.0.1:33260_vq_k%2Flm",
[junit4] 2> "numShards":"1",
[junit4] 2> "state":"active",
[junit4] 2> "shard":"shard1",
[junit4] 2> "collection":"control_collection",
[junit4] 2> "operation":"state"}
[junit4] 2> 298648 INFO (zkCallback-355-thread-1-processing-n:127.0.0.1:33260_vq_k%2Flm) [n:127.0.0.1:33260_vq_k%2Flm ] o.a.s.c.c.ZkStateReader A cluster state change: WatchedEvent state:SyncConnected type:NodeDataChanged path:/clusterstate.json, has occurred - updating... (live nodes size: 1)
[junit4] 2> 298733 INFO (TEST-CollectionsAPIDistributedZkTest.test-seed#[48181FE2605C8A60]) [ ] o.a.s.c.c.SolrZkClient Using default ZkCredentialsProvider
[junit4] 2> 298734 INFO (TEST-CollectionsAPIDistributedZkTest.test-seed#[48181FE2605C8A60]) [ ] o.a.s.c.c.ConnectionManager Waiting for client to connect to ZooKeeper
[junit4] 2> 298736 INFO (zkCallback-357-thread-1) [ ] o.a.s.c.c.ConnectionManager Watcher org.apache.solr.common.cloud.ConnectionManager@556498ba name:ZooKeeperConnection Watcher:127.0.0.1:59563/solr got event WatchedEvent state:SyncConnected type:None path:null path:null type:None
[junit4] 2> 298736 INFO (TEST-CollectionsAPIDistributedZkTest.test-seed#[48181FE2605C8A60]) [ ] o.a.s.c.c.ConnectionManager Client is connected to ZooKeeper
[junit4] 2> 298737 INFO (TEST-CollectionsAPIDistributedZkTest.test-seed#[48181FE2605C8A60]) [ ] o.a.s.c.c.SolrZkClient Using default ZkACLProvider
[junit4] 2> 298737 INFO (TEST-CollectionsAPIDistributedZkTest.test-seed#[48181FE2605C8A60]) [ ] o.a.s.c.c.ZkStateReader Updating cluster state from ZooKeeper...
[junit4] 2> 298739 INFO (TEST-CollectionsAPIDistributedZkTest.test-seed#[48181FE2605C8A60]) [ ] o.a.s.c.ChaosMonkey monkey: init - expire sessions:false cause connection loss:false
[junit4] 2> 298739 INFO (TEST-CollectionsAPIDistributedZkTest.test-seed#[48181FE2605C8A60]) [ ] o.a.s.c.AbstractFullDistribZkTestBase Creating collection1 with stateFormat=2
[junit4] 2> 298739 INFO (TEST-CollectionsAPIDistributedZkTest.test-seed#[48181FE2605C8A60]) [ ] o.a.s.c.c.SolrZkClient Using default ZkCredentialsProvider
[junit4] 2> 298739 INFO (TEST-CollectionsAPIDistributedZkTest.test-seed#[48181FE2605C8A60]) [ ] o.a.s.c.c.ConnectionManager Waiting for client to connect to ZooKeeper
[junit4] 2> 298741 INFO (zkCallback-358-thread-1) [ ] o.a.s.c.c.ConnectionManager Watcher org.apache.solr.common.cloud.ConnectionManager@57afa5ce name:ZooKeeperConnection Watcher:127.0.0.1:59563/solr got event WatchedEvent state:SyncConnected type:None path:null path:null type:None
[junit4] 2> 298741 INFO (TEST-CollectionsAPIDistributedZkTest.test-seed#[48181FE2605C8A60]) [ ] o.a.s.c.c.ConnectionManager Client is connected to ZooKeeper
[junit4] 2> 298741 INFO (TEST-CollectionsAPIDistributedZkTest.test-seed#[48181FE2605C8A60]) [ ] o.a.s.c.c.SolrZkClient Using default ZkACLProvider
[junit4] 2> 298743 INFO (OverseerStateUpdate-94833617172234244-127.0.0.1:33260_vq_k%2Flm-n_0000000000) [n:127.0.0.1:33260_vq_k%2Flm ] o.a.s.c.Overseer processMessage: queueSize: 1, message = {
[junit4] 2> "operation":"create",
[junit4] 2> "name":"collection1",
[junit4] 2> "numShards":"2",
[junit4] 2> "stateFormat":"2"} current state version: 3
[junit4] 2> 298743 INFO (OverseerStateUpdate-94833617172234244-127.0.0.1:33260_vq_k%2Flm-n_0000000000) [n:127.0.0.1:33260_vq_k%2Flm ] o.a.s.c.o.ClusterStateMutator building a new cName: collection1
[junit4] 2> 298844 INFO (OverseerStateUpdate-94833617172234244-127.0.0.1:33260_vq_k%2Flm-n_0000000000) [n:127.0.0.1:33260_vq_k%2Flm ] o.a.s.c.o.ZkStateWriter going to create_collection /collections/collection1/state.json
[junit4] 2> 298886 INFO (TEST-CollectionsAPIDistributedZkTest.test-seed#[48181FE2605C8A60]) [ ] o.a.s.SolrTestCaseJ4 Writing core.properties file to /home/jenkins/workspace/Lucene-Solr-trunk-Linux/solr/build/solr-core/test/J1/temp/solr.cloud.CollectionsAPIDistributedZkTest_48181FE2605C8A60-001/shard-1-001/cores/collection1
[junit4] 2> 298887 INFO (TEST-CollectionsAPIDistributedZkTest.test-seed#[48181FE2605C8A60]) [ ] o.a.s.c.AbstractFullDistribZkTestBase create jetty 1 in directory /home/jenkins/workspace/Lucene-Solr-trunk-Linux/solr/build/solr-core/test/J1/temp/solr.cloud.CollectionsAPIDistributedZkTest_48181FE2605C8A60-001/shard-1-001
[junit4] 2> 298887 INFO (TEST-CollectionsAPIDistributedZkTest.test-seed#[48181FE2605C8A60]) [ ] o.e.j.s.Server jetty-9.2.13.v20150730
[junit4] 2> 298888 INFO (TEST-CollectionsAPIDistributedZkTest.test-seed#[48181FE2605C8A60]) [ ] o.e.j.s.h.ContextHandler Started o.e.j.s.ServletContextHandler@76f27be5{/vq_k/lm,null,AVAILABLE}
[junit4] 2> 298889 INFO (TEST-CollectionsAPIDistributedZkTest.test-seed#[48181FE2605C8A60]) [ ] o.e.j.s.ServerConnector Started ServerConnector@4f929b1e{HTTP/1.1}{127.0.0.1:58865}
[junit4] 2> 298889 INFO (TEST-CollectionsAPIDistributedZkTest.test-seed#[48181FE2605C8A60]) [ ] o.e.j.s.Server Started @300292ms
[junit4] 2> 298889 INFO (TEST-CollectionsAPIDistributedZkTest.test-seed#[48181FE2605C8A60]) [ ] o.a.s.c.s.e.JettySolrRunner Jetty properties: {solr.data.dir=/home/jenkins/workspace/Lucene-Solr-trunk-Linux/solr/build/solr-core/test/J1/temp/solr.cloud.CollectionsAPIDistributedZkTest_48181FE2605C8A60-001/tempDir-001/jetty1, solrconfig=solrconfig.xml, hostContext=/vq_k/lm, hostPort=58865, coreRootDirectory=/home/jenkins/workspace/Lucene-Solr-trunk-Linux/solr/build/solr-core/test/J1/../../../../../../../../../home/jenkins/workspace/Lucene-Solr-trunk-Linux/solr/build/solr-core/test/J1/temp/solr.cloud.CollectionsAPIDistributedZkTest_48181FE2605C8A60-001/shard-1-001/cores}
[junit4] 2> 298889 INFO (TEST-CollectionsAPIDistributedZkTest.test-seed#[48181FE2605C8A60]) [ ] o.a.s.s.SolrDispatchFilter SolrDispatchFilter.init(): sun.misc.Launcher$AppClassLoader@deb6432
[junit4] 2> 298889 INFO (TEST-CollectionsAPIDistributedZkTest.test-seed#[48181FE2605C8A60]) [ ] o.a.s.c.SolrResourceLoader new SolrResourceLoader for directory: '/home/jenkins/workspace/Lucene-Solr-trunk-Linux/solr/build/solr-core/test/J1/../../../../../../../../../home/jenkins/workspace/Lucene-Solr-trunk-Linux/solr/build/solr-core/test/J1/temp/solr.cloud.CollectionsAPIDistributedZkTest_48181FE2605C8A60-001/shard-1-001/'
[junit4] 2> 298889 INFO (TEST-CollectionsAPIDistributedZkTest.test-seed#[48181FE2605C8A60]) [ ] o.a.s.c.SolrResourceLoader JNDI not configured for solr (NoInitialContextEx)
[junit4] 2> 298889 INFO (TEST-CollectionsAPIDistributedZkTest.test-seed#[48181FE2605C8A60]) [ ] o.a.s.c.SolrResourceLoader solr home defaulted to 'solr/' (could not find system property or JNDI)
[junit4] 2> 298897 INFO (TEST-CollectionsAPIDistributedZkTest.test-seed#[48181FE2605C8A60]) [ ] o.a.s.c.c.SolrZkClient Using default ZkCredentialsProvider
[junit4] 2> 298897 INFO (TEST-CollectionsAPIDistributedZkTest.test-seed#[48181FE2605C8A60]) [ ] o.a.s.c.c.ConnectionManager Waiting for client to connect to ZooKeeper
[junit4] 2> 298899 INFO (zkCallback-359-thread-1) [ ] o.a.s.c.c.ConnectionManager Watcher org.apache.solr.common.cloud.ConnectionManager@2dc7769b name:ZooKeeperConnection Watcher:127.0.0.1:59563/solr got event WatchedEvent state:SyncConnected type:None path:null path:null type:None
[junit4] 2> 298899 INFO (TEST-CollectionsAPIDistributedZkTest.test-seed#[48181FE2605C8A60]) [ ] o.a.s.c.c.ConnectionManager Client is connected to ZooKeeper
[junit4] 2> 298899 INFO (TEST-CollectionsAPIDistributedZkTest.test-seed#[48181FE2605C8A60]) [ ] o.a.s.c.c.SolrZkClient Using default ZkACLProvider
[junit4] 2> 298901 INFO (TEST-CollectionsAPIDistributedZkTest.test-seed#[48181FE2605C8A60]) [ ] o.a.s.s.SolrDispatchFilter Loading solr.xml from SolrHome (not found in ZooKeeper)
[junit4] 2> 298901 INFO (TEST-CollectionsAPIDistributedZkTest.test-seed#[48181FE2605C8A60]) [ ] o.a.s.c.SolrXmlConfig Loading container configuration from /home/jenkins/workspace/Lucene-Solr-trunk-Linux/solr/build/solr-core/test/J1/../../../../../../../../../home/jenkins/workspace/Lucene-Solr-trunk-Linux/solr/build/solr-core/test/J1/temp/solr.cloud.CollectionsAPIDistributedZkTest_48181FE2605C8A60-001/shard-1-001/solr.xml
[junit4] 2> 298915 INFO (TEST-CollectionsAPIDistributedZkTest.test-seed#[48181FE2605C8A60]) [ ] o.a.s.c.CoresLocator Config-defined core root directory: /home/jenkins/workspace/Lucene-Solr-trunk-Linux/solr/build/solr-core/test/J1/../../../../../../../../../home/jenkins/workspace/Lucene-Solr-trunk-Linux/solr/build/solr-core/test/J1/temp/solr.cloud.CollectionsAPIDistributedZkTest_48181FE2605C8A60-001/shard-1-001/cores
[junit4] 2> 298915 INFO (TEST-CollectionsAPIDistributedZkTest.test-seed#[48181FE2605C8A60]) [ ] o.a.s.c.CoreContainer New CoreContainer 1153118344
[junit4] 2> 298915 INFO (TEST-CollectionsAPIDistributedZkTest.test-seed#[48181FE2605C8A60]) [ ] o.a.s.c.CoreContainer Loading cores into CoreContainer [instanceDir=/home/jenkins/workspace/Lucene-Solr-trunk-Linux/solr/build/solr-core/test/J1/../../../../../../../../../home/jenkins/workspace/Lucene-Solr-trunk-Linux/solr/build/solr-core/test/J1/temp/solr.cloud.CollectionsAPIDistributedZkTest_48181FE2605C8A60-001/shard-1-001/]
[junit4] 2> 298915 INFO (TEST-CollectionsAPIDistributedZkTest.test-seed#[48181FE2605C8A60]) [ ] o.a.s.c.CoreContainer loading shared library: /home/jenkins/workspace/Lucene-Solr-trunk-Linux/solr/build/solr-core/test/J1/../../../../../../../../../home/jenkins/workspace/Lucene-Solr-trunk-Linux/solr/build/solr-core/test/J1/temp/solr.cloud.CollectionsAPIDistributedZkTest_48181FE2605C8A60-001/shard-1-001/lib
[junit4] 2> 298915 WARN (TEST-CollectionsAPIDistributedZkTest.test-seed#[48181FE2605C8A60]) [ ] o.a.s.c.SolrResourceLoader Can't find (or read) directory to add to classloader: lib (resolved as: /home/jenkins/workspace/Lucene-Solr-trunk-Linux/solr/build/solr-core/test/J1/../../../../../../../../../home/jenkins/workspace/Lucene-Solr-trunk-Linux/solr/build/solr-core/test/J1/temp/solr.cloud.CollectionsAPIDistributedZkTest_48181FE2605C8A60-001/shard-1-001/lib).
[junit4] 2> 298919 INFO (TEST-CollectionsAPIDistributedZkTest.test-seed#[48181FE2605C8A60]) [ ] o.a.s.h.c.HttpShardHandlerFactory created with socketTimeout : 90000,urlScheme : ,connTimeout : 15000,maxConnectionsPerHost : 20,maxConnections : 10000,corePoolSize : 0,maximumPoolSize : 2147483647,maxThreadIdleTime : 5,sizeOfQueue : -1,fairnessPolicy : false,useRetries : false,
[junit4] 2> 298921 INFO (TEST-CollectionsAPIDistributedZkTest.test-seed#[48181FE2605C8A60]) [ ] o.a.s.u.UpdateShardHandler Creating UpdateShardHandler HTTP client with params: socketTimeout=340000&connTimeout=45000&retry=true
[junit4] 2> 298921 INFO (TEST-CollectionsAPIDistributedZkTest.test-seed#[48181FE2605C8A60]) [ ] o.a.s.l.LogWatcher SLF4J impl is org.slf4j.impl.Log4jLoggerFactory
[junit4] 2> 298921 INFO (TEST-CollectionsAPIDistributedZkTest.test-seed#[48181FE2605C8A60]) [ ] o.a.s.l.LogWatcher Registering Log Listener [Log4j (org.slf4j.impl.Log4jLoggerFactory)]
[junit4] 2> 298921 INFO (TEST-CollectionsAPIDistributedZkTest.test-seed#[48181FE2605C8A60]) [ ] o.a.s.c.ZkContainer Zookeeper client=127.0.0.1:59563/solr
[junit4] 2> 298921 INFO (TEST-CollectionsAPIDistributedZkTest.test-seed#[48181FE2605C8A60]) [ ] o.a.s.c.ZkController zkHost includes chroot
[junit4] 2> 298921 INFO (TEST-CollectionsAPIDistributedZkTest.test-seed#[48181FE2605C8A60]) [ ] o.a.s.c.c.SolrZkClient Using default ZkCredentialsProvider
[junit4] 2> 298921 INFO (TEST-CollectionsAPIDistributedZkTest.test-seed#[48181FE2605C8A60]) [ ] o.a.s.c.c.ConnectionManager Waiting for client to connect to ZooKeeper
[junit4] 2> 298923 INFO (zkCallback-361-thread-1) [ ] o.a.s.c.c.ConnectionManager Watcher org.apache.solr.common.cloud.ConnectionManager@4c7e79b3 name:ZooKeeperConnection Watcher:127.0.0.1:59563 got event WatchedEvent state:SyncConnected type:None path:null path:null type:None
[junit4] 2> 298924 INFO (TEST-CollectionsAPIDistributedZkTest.test-seed#[48181FE2605C8A60]) [ ] o.a.s.c.c.ConnectionManager Client is connected to ZooKeeper
[junit4] 2> 298924 INFO (TEST-CollectionsAPIDistributedZkTest.test-seed#[48181FE2605C8A60]) [ ] o.a.s.c.c.SolrZkClient Using default ZkACLProvider
[junit4] 2> 298926 INFO (TEST-CollectionsAPIDistributedZkTest.test-seed#[48181FE2605C8A60]) [n:127.0.0.1:58865_vq_k%2Flm ] o.a.s.c.c.ConnectionManager Waiting for client to connect to ZooKeeper
[junit4] 2> 298928 INFO (zkCallback-362-thread-1-processing-n:127.0.0.1:58865_vq_k%2Flm) [n:127.0.0.1:58865_vq_k%2Flm ] o.a.s.c.c.ConnectionManager Watcher org.apache.solr.common.cloud.ConnectionManager@5629f70b name:ZooKeeperConnection Watcher:127.0.0.1:59563/solr got event WatchedEvent state:SyncConnected type:None path:null path:null type:None
[junit4] 2> 298928 INFO (TEST-CollectionsAPIDistributedZkTest.test-seed#[48181FE2605C8A60]) [n:127.0.0.1:58865_vq_k%2Flm ] o.a.s.c.c.ConnectionManager Client is connected to ZooKeeper
[junit4] 2> 298930 INFO (TEST-CollectionsAPIDistributedZkTest.test-seed#[48181FE2605C8A60]) [n:127.0.0.1:58865_vq_k%2Flm ] o.a.s.c.c.ZkStateReader Updating cluster state from ZooKeeper...
[junit4] 2> 299933 INFO (TEST-CollectionsAPIDistributedZkTest.test-seed#[48181FE2605C8A60]) [n:127.0.0.1:58865_vq_k%2Flm ] o.a.s.c.ZkController Register node as live in ZooKeeper:/live_nodes/127.0.0.1:58865_vq_k%2Flm
[junit4] 2> 299933 INFO (TEST-CollectionsAPIDistributedZkTest.test-seed#[48181FE2605C8A60]) [n:127.0.0.1:58865_vq_k%2Flm ] o.a.s.c.c.SolrZkClient makePath: /live_nodes/127.0.0.1:58865_vq_k%2Flm
[junit4] 2> 299934 INFO (zkCallback-362-thread-1-processing-n:127.0.0.1:58865_vq_k%2Flm) [n:127.0.0.1:58865_vq_k%2Flm ] o.a.s.c.c.ZkStateReader A live node change: WatchedEvent state:SyncConnected type:NodeChildrenChanged path:/live_nodes, has occurred - updating... (live nodes size: 1)
[junit4] 2> 299934 INFO (zkCallback-355-thread-2-processing-n:127.0.0.1:33260_vq_k%2Flm) [n:127.0.0.1:33260_vq_k%2Flm ] o.a.s.c.c.ZkStateReader A live node change: WatchedEvent state:SyncConnected type:NodeChildrenChanged path:/live_nodes, has occurred - updating... (live nodes size: 1)
[junit4] 2> 299934 INFO (zkCallback-357-thread-1) [ ] o.a.s.c.c.ZkStateReader A live node change: WatchedEvent state:SyncConnected type:NodeChildrenChanged path:/live_nodes, has occurred - updating... (live nodes size: 1)
[junit4] 2> 299937 INFO (TEST-CollectionsAPIDistributedZkTest.test-seed#[48181FE2605C8A60]) [n:127.0.0.1:58865_vq_k%2Flm ] o.a.s.c.Overseer Overseer (id=null) closing
[junit4] 2> 299937 INFO (TEST-CollectionsAPIDistributedZkTest.test-seed#[48181FE2605C8A60]) [n:127.0.0.1:58865_vq_k%2Flm ] o.a.s.c.LeaderElector Joined leadership election with path: /overseer_elect/election/94833617172234249-127.0.0.1:58865_vq_k%2Flm-n_0000000001
[junit4] 2> 299938 INFO (TEST-CollectionsAPIDistributedZkTest.test-seed#[48181FE2605C8A60]) [n:127.0.0.1:58865_vq_k%2Flm ] o.a.s.c.LeaderElector Watching path /overseer_elect/election/94833617172234244-127.0.0.1:33260_vq_k%2Flm-n_0000000000 to know if I could be the leader
[junit4] 2> 299951 INFO (TEST-CollectionsAPIDistributedZkTest.test-seed#[48181FE2605C8A60]) [n:127.0.0.1:58865_vq_k%2Flm ] o.a.s.c.CoreContainer Security conf doesn't exist. Skipping setup for authorization module.
[junit4] 2> 299951 INFO (TEST-CollectionsAPIDistributedZkTest.test-seed#[48181FE2605C8A60]) [n:127.0.0.1:58865_vq_k%2Flm ] o.a.s.c.CoreContainer No authentication plugin used.
[junit4] 2> 299952 INFO (TEST-CollectionsAPIDistributedZkTest.test-seed#[48181FE2605C8A60]) [n:127.0.0.1:58865_vq_k%2Flm ] o.a.s.c.CoresLocator Looking for core definitions underneath /home/jenkins/workspace/Lucene-Solr-trunk-Linux/solr/build/solr-core/test/J1/../../../../../../../../../home/jenkins/workspace/Lucene-Solr-trunk-Linux/solr/build/solr-core/test/J1/temp/solr.cloud.CollectionsAPIDistributedZkTest_48181FE2605C8A60-001/shard-1-001/cores
[junit4] 2> 299952 INFO (TEST-CollectionsAPIDistributedZkTest.test-seed#[48181FE2605C8A60]) [n:127.0.0.1:58865_vq_k%2Flm ] o.a.s.c.SolrCore Created CoreDescriptor: {name=collection1, config=solrconfig.xml, transient=false, schema=schema.xml, loadOnStartup=true, configSetProperties=configsetprops.json, instanceDir=/home/jenkins/workspace/Lucene-Solr-trunk-Linux/solr/build/solr-core/test/J1/../../../../../../../../../home/jenkins/workspace/Lucene-Solr-trunk-Linux/solr/build/solr-core/test/J1/temp/solr.cloud.CollectionsAPIDistributedZkTest_48181FE2605C8A60-001/shard-1-001/cores/collection1, collection=collection1, absoluteInstDir=/home/jenkins/workspace/Lucene-Solr-trunk-Linux/solr/build/solr-core/test/J1/../../../../../../../../../home/jenkins/workspace/Lucene-Solr-trunk-Linux/solr/build/solr-core/test/J1/temp/solr.cloud.CollectionsAPIDistributedZkTest_48181FE2605C8A60-001/shard-1-001/cores/collection1/, co
[...truncated too long message...]
6432 INFO (TEST-CollectionsAPIDistributedZkTest.test-seed#[48181FE2605C8A60]) [n:127.0.0.1:53377_vq_k%2Flm c:awholynewcollection_0 s:shard1 r:core_node5 x:awholynewcollection_0_shard1_replica2] o.a.s.c.ZkTestServer connecting to 127.0.0.1:59563 59563
[junit4] 2> 336573 INFO (Thread-1111) [ ] o.a.s.c.ZkTestServer connecting to 127.0.0.1:59563 59563
[junit4] 2> 336573 WARN (Thread-1111) [ ] o.a.s.c.ZkTestServer Watch limit violations:
[junit4] 2> Maximum concurrent create/delete watches above limit:
[junit4] 2>
[junit4] 2> 9 /solr/aliases.json
[junit4] 2> 6 /solr/security.json
[junit4] 2> 6 /solr/configs/conf1
[junit4] 2>
[junit4] 2> Maximum concurrent data watches above limit:
[junit4] 2>
[junit4] 2> 13 /solr/collections/collection1/state.json
[junit4] 2> 9 /solr/clusterstate.json
[junit4] 2> 6 /solr/collections/awholynewcollection_0/state.json
[junit4] 2> 5 /solr/collections/nodes_used_collection/state.json
[junit4] 2> 2 /solr/overseer_elect/election/94833617172234249-127.0.0.1:58865_vq_k%2Flm-n_0000000001
[junit4] 2> 2 /solr/collections/nodes_used_collection/leader_elect/shard1/election/94833617172234244-core_node1-n_0000000000
[junit4] 2>
[junit4] 2> Maximum concurrent children watches above limit:
[junit4] 2>
[junit4] 2> 9 /solr/collections
[junit4] 2> 8 /solr/live_nodes
[junit4] 2> 4 /solr/overseer/queue
[junit4] 2> 4 /solr/overseer/collection-queue-work
[junit4] 2>
[junit4] 2> NOTE: reproduce with: ant test -Dtestcase=CollectionsAPIDistributedZkTest -Dtests.method=test -Dtests.seed=48181FE2605C8A60 -Dtests.multiplier=3 -Dtests.slow=true -Dtests.locale=sr -Dtests.timezone=Indian/Cocos -Dtests.asserts=true -Dtests.file.encoding=ISO-8859-1
[junit4] ERROR 39.6s J1 | CollectionsAPIDistributedZkTest.test <<<
[junit4] > Throwable #1: org.apache.solr.client.solrj.impl.HttpSolrClient$RemoteSolrException: Error from server at http://127.0.0.1:51555/vq_k/lm/awholynewcollection_0: Expected mime type application/octet-stream but got text/html. <html>
[junit4] > <head>
[junit4] > <meta http-equiv="Content-Type" content="text/html;charset=ISO-8859-1"/>
[junit4] > <title>Error 500 </title>
[junit4] > </head>
[junit4] > <body>
[junit4] > <h2>HTTP ERROR: 500</h2>
[junit4] > <p>Problem accessing /vq_k/lm/awholynewcollection_0/select. Reason:
[junit4] > <pre> {trace=java.lang.NullPointerException
[junit4] > at org.apache.solr.servlet.HttpSolrCall.getCoreByCollection(HttpSolrCall.java:786)
[junit4] > at org.apache.solr.servlet.HttpSolrCall.init(HttpSolrCall.java:270)
[junit4] > at org.apache.solr.servlet.HttpSolrCall.call(HttpSolrCall.java:415)
[junit4] > at org.apache.solr.servlet.SolrDispatchFilter.doFilter(SolrDispatchFilter.java:220)
[junit4] > at org.apache.solr.servlet.SolrDispatchFilter.doFilter(SolrDispatchFilter.java:179)
[junit4] > at org.eclipse.jetty.servlet.ServletHandler$CachedChain.doFilter(ServletHandler.java:1652)
[junit4] > at org.apache.solr.client.solrj.embedded.JettySolrRunner$DebugFilter.doFilter(JettySolrRunner.java:109)
[junit4] > at org.eclipse.jetty.servlet.ServletHandler$CachedChain.doFilter(ServletHandler.java:1652)
[junit4] > at org.eclipse.jetty.servlets.UserAgentFilter.doFilter(UserAgentFilter.java:83)
[junit4] > at org.eclipse.jetty.servlets.GzipFilter.doFilter(GzipFilter.java:364)
[junit4] > at org.eclipse.jetty.servlet.ServletHandler$CachedChain.doFilter(ServletHandler.java:1652)
[junit4] > at org.eclipse.jetty.servlet.ServletHandler.doHandle(ServletHandler.java:585)
[junit4] > at org.eclipse.jetty.server.session.SessionHandler.doHandle(SessionHandler.java:221)
[junit4] > at org.eclipse.jetty.server.handler.ContextHandler.doHandle(ContextHandler.java:1127)
[junit4] > at org.eclipse.jetty.servlet.ServletHandler.doScope(ServletHandler.java:515)
[junit4] > at org.eclipse.jetty.server.session.SessionHandler.doScope(SessionHandler.java:185)
[junit4] > at org.eclipse.jetty.server.handler.ContextHandler.doScope(ContextHandler.java:1061)
[junit4] > at org.eclipse.jetty.server.handler.ScopedHandler.handle(ScopedHandler.java:141)
[junit4] > at org.eclipse.jetty.server.handler.HandlerWrapper.handle(HandlerWrapper.java:97)
[junit4] > at org.eclipse.jetty.server.Server.handle(Server.java:499)
[junit4] > at org.eclipse.jetty.server.HttpChannel.handle(HttpChannel.java:310)
[junit4] > at org.eclipse.jetty.server.HttpConnection.onFillable(HttpConnection.java:257)
[junit4] > at org.eclipse.jetty.io.AbstractConnection$2.run(AbstractConnection.java:540)
[junit4] > at org.eclipse.jetty.util.thread.QueuedThreadPool.runJob(QueuedThreadPool.java:635)
[junit4] > at org.eclipse.jetty.util.thread.QueuedThreadPool$3.run(QueuedThreadPool.java:555)
[junit4] > at java.lang.Thread.run(Thread.java:747)
[junit4] > ,code=500}</pre></p>
[junit4] > <hr /><i><small>Powered by Jetty://</small></i>
[junit4] > </body>
[junit4] > </html>
[junit4] > at __randomizedtesting.SeedInfo.seed([48181FE2605C8A60:C04C2038CEA0E798]:0)
[junit4] > at org.apache.solr.client.solrj.impl.HttpSolrClient.executeMethod(HttpSolrClient.java:543)
[junit4] > at org.apache.solr.client.solrj.impl.HttpSolrClient.request(HttpSolrClient.java:241)
[junit4] > at org.apache.solr.client.solrj.impl.HttpSolrClient.request(HttpSolrClient.java:230)
[junit4] > at org.apache.solr.client.solrj.SolrRequest.process(SolrRequest.java:150)
[junit4] > at org.apache.solr.client.solrj.SolrClient.query(SolrClient.java:943)
[junit4] > at org.apache.solr.client.solrj.SolrClient.query(SolrClient.java:958)
[junit4] > at org.apache.solr.cloud.AbstractFullDistribZkTestBase.waitForNon403or404or503(AbstractFullDistribZkTestBase.java:1754)
[junit4] > at org.apache.solr.cloud.CollectionsAPIDistributedZkTest.testCollectionsAPI(CollectionsAPIDistributedZkTest.java:665)
[junit4] > at org.apache.solr.cloud.CollectionsAPIDistributedZkTest.test(CollectionsAPIDistributedZkTest.java:167)
[junit4] > at org.apache.solr.BaseDistributedSearchTestCase$ShardsRepeatRule$ShardsFixedStatement.callStatement(BaseDistributedSearchTestCase.java:963)
[junit4] > at org.apache.solr.BaseDistributedSearchTestCase$ShardsRepeatRule$ShardsStatement.evaluate(BaseDistributedSearchTestCase.java:938)
[junit4] > at java.lang.Thread.run(Thread.java:747)
[junit4] 2> 336576 INFO (SUITE-CollectionsAPIDistributedZkTest-seed#[48181FE2605C8A60]-worker) [n:127.0.0.1:53377_vq_k%2Flm c:awholynewcollection_0 s:shard1 r:core_node5 x:awholynewcollection_0_shard1_replica2] o.a.s.SolrTestCaseJ4 ###deleteCore
[junit4] 2> NOTE: leaving temporary files on disk at: /home/jenkins/workspace/Lucene-Solr-trunk-Linux/solr/build/solr-core/test/J1/temp/solr.cloud.CollectionsAPIDistributedZkTest_48181FE2605C8A60-001
[junit4] 2> NOTE: test params are: codec=Asserting(Lucene60): {}, docValues:{}, sim=ClassicSimilarity, locale=sr, timezone=Indian/Cocos
[junit4] 2> NOTE: Linux 3.19.0-31-generic amd64/Oracle Corporation 1.9.0-ea (64-bit)/cpus=12,threads=1,free=68015872,total=518979584
[junit4] 2> NOTE: All tests run in this JVM: [BasicAuthIntegrationTest, TestWordDelimiterFilterFactory, TestLFUCache, TestNamedUpdateProcessors, TestSha256AuthenticationProvider, TestBlendedInfixSuggestions, CloudExitableDirectoryReaderTest, TestCopyFieldCollectionResource, NumericFieldsTest, MoreLikeThisHandlerTest, SuggesterFSTTest, TestCollapseQParserPlugin, TestBinaryResponseWriter, TestPartialUpdateDeduplication, AtomicUpdatesTest, DistributedMLTComponentTest, SpellCheckComponentTest, NotRequiredUniqueKeyTest, HdfsBasicDistributedZkTest, DistributedDebugComponentTest, TestQueryTypes, TestLRUStatsCache, UniqFieldsUpdateProcessorFactoryTest, TestReRankQParserPlugin, SchemaVersionSpecificBehaviorTest, TestManagedResourceStorage, TestNoOpRegenerator, DocValuesMissingTest, MigrateRouteKeyTest, TestSchemaManager, TestTrieFacet, TestDFRSimilarityFactory, CustomCollectionTest, SimplePostToolTest, ConvertedLegacyTest, CSVRequestHandlerTest, SolrIndexSplitterTest, FileUtilsTest, ZkStateReaderTest, TestClassicSimilarityFactory, HLLSerializationTest, DistributedFacetPivotSmallTest, DistributedQueryComponentCustomSortTest, TestQuerySenderNoQuery, TestOrdValues, TestDocBasedVersionConstraints, HdfsDirectoryTest, CollectionsAPIDistributedZkTest]
[junit4] Completed [148/555] on J1 in 39.59s, 1 test, 1 error <<< FAILURES!
[...truncated 1343 lines...]
BUILD FAILED
/home/jenkins/workspace/Lucene-Solr-trunk-Linux/build.xml:775: The following error occurred while executing this line:
/home/jenkins/workspace/Lucene-Solr-trunk-Linux/build.xml:719: The following error occurred while executing this line:
/home/jenkins/workspace/Lucene-Solr-trunk-Linux/build.xml:59: The following error occurred while executing this line:
/home/jenkins/workspace/Lucene-Solr-trunk-Linux/solr/build.xml:233: The following error occurred while executing this line:
/home/jenkins/workspace/Lucene-Solr-trunk-Linux/solr/common-build.xml:516: The following error occurred while executing this line:
/home/jenkins/workspace/Lucene-Solr-trunk-Linux/lucene/common-build.xml:1432: The following error occurred while executing this line:
/home/jenkins/workspace/Lucene-Solr-trunk-Linux/lucene/common-build.xml:987: There were test failures: 555 suites (8 ignored), 2200 tests, 1 error, 106 ignored (67 assumptions) [seed: 48181FE2605C8A60]
Total time: 48 minutes 38 seconds
Build step 'Invoke Ant' marked build as failure
Archiving artifacts
[WARNINGS] Skipping publisher since build result is FAILURE
Recording test results
Email was triggered for: Failure - Any
Sending email for trigger: Failure - Any