You are viewing a plain text version of this content. The canonical link for it is here.
Posted to issues@ozone.apache.org by "Attila Doroszlai (Jira)" <ji...@apache.org> on 2026/06/18 09:19:00 UTC
[jira] [Commented] (HDDS-15519) TestStorageDistributionEndpoint is flaky
[ https://issues.apache.org/jira/browse/HDDS-15519?page=com.atlassian.jira.plugin.system.issuetabpanels:comment-tabpanel&focusedCommentId=18089878#comment-18089878 ]
Attila Doroszlai commented on HDDS-15519:
-----------------------------------------
- https://github.com/adoroszlai/ozone-build-results/blob/master/2026/06/10/49686/integration-recon/hadoop-ozone/integration-test-recon/org.apache.hadoop.ozone.recon.TestStorageDistributionEndpointEC.txt
- https://github.com/adoroszlai/ozone-build-results/blob/master/2026/06/10/49686/integration-recon/hadoop-ozone/integration-test-recon/org.apache.hadoop.ozone.recon.TestStorageDistributionEndpointRatis.txt
- https://github.com/adoroszlai/ozone-build-results/blob/master/2026/06/12/49757/integration-recon/hadoop-ozone/integration-test-recon/org.apache.hadoop.ozone.recon.TestStorageDistributionEndpointEC.txt
- https://github.com/adoroszlai/ozone-build-results/blob/master/2026/06/12/49773/integration-recon/hadoop-ozone/integration-test-recon/org.apache.hadoop.ozone.recon.TestStorageDistributionEndpointEC.txt
- https://github.com/adoroszlai/ozone-build-results/blob/master/2026/06/12/49794/integration-recon/hadoop-ozone/integration-test-recon/org.apache.hadoop.ozone.recon.TestStorageDistributionEndpointRatis.txt
- https://github.com/adoroszlai/ozone-build-results/blob/master/2026/06/13/49820/integration-recon/hadoop-ozone/integration-test-recon/org.apache.hadoop.ozone.recon.TestStorageDistributionEndpointEC.txt
- https://github.com/adoroszlai/ozone-build-results/blob/master/2026/06/13/49820/integration-recon/hadoop-ozone/integration-test-recon/org.apache.hadoop.ozone.recon.TestStorageDistributionEndpointRatis.txt
- https://github.com/adoroszlai/ozone-build-results/blob/master/2026/06/15/49853/integration-recon/hadoop-ozone/integration-test-recon/org.apache.hadoop.ozone.recon.TestStorageDistributionEndpointEC.txt
- https://github.com/adoroszlai/ozone-build-results/blob/master/2026/06/16/49905/integration-recon/hadoop-ozone/integration-test-recon/org.apache.hadoop.ozone.recon.TestStorageDistributionEndpointRatis.txt
> TestStorageDistributionEndpoint is flaky
> ----------------------------------------
>
> Key: HDDS-15519
> URL: https://issues.apache.org/jira/browse/HDDS-15519
> Project: Apache Ozone
> Issue Type: Sub-task
> Components: test
> Reporter: Attila Doroszlai
> Assignee: Priyesh K
> Priority: Major
> Attachments: org.apache.hadoop.ozone.recon.TestStorageDistributionEndpointEC-output.txt, org.apache.hadoop.ozone.recon.TestStorageDistributionEndpointEC.txt, org.apache.hadoop.ozone.recon.TestStorageDistributionEndpointRatis-output.txt, org.apache.hadoop.ozone.recon.TestStorageDistributionEndpointRatis.txt
>
>
> TestStorageDistributionEndpoint may fail with timeout waiting for {{verifyPendingDeletionAfterKeyDeletionDn}}:
> {code}
> [ERROR] Tests run: 1, Failures: 0, Errors: 1, Skipped: 0, Time elapsed: 148.7 s <<< FAILURE! -- in org.apache.hadoop.ozone.recon.TestStorageDistributionEndpointRatis
> [ERROR] org.apache.hadoop.ozone.recon.TestStorageDistributionEndpointRatis.testStorageDistributionEndpoint -- Time elapsed: 118.6 s <<< ERROR!
> ...
> at org.apache.ozone.test.GenericTestUtils.waitFor(GenericTestUtils.java:137)
> at org.apache.hadoop.ozone.recon.TestStorageDistributionEndpointRatis.testStorageDistributionEndpoint(TestStorageDistributionEndpointRatis.java:92)
> {code}
> The test does not log which assertion failed. The runner was probably slow, as TestUnhealthyContainersDerbyPerformance also failed with longer than expected run time.
--
This message was sent by Atlassian Jira
(v8.20.10#820010)
---------------------------------------------------------------------
To unsubscribe, e-mail: issues-unsubscribe@ozone.apache.org
For additional commands, e-mail: issues-help@ozone.apache.org