You are viewing a plain text version of this content. The canonical link for it is here.
Posted to builds@beam.apache.org by Apache Jenkins Server <je...@builds.apache.org> on 2023/04/09 03:57:22 UTC
Build failed in Jenkins: beam_PostCommit_Java_DataflowV2 #2898
See <https://ci-beam.apache.org/job/beam_PostCommit_Java_DataflowV2/2898/display/redirect>
Changes:
------------------------------------------
Started by timer
Running as SYSTEM
[EnvInject] - Loading node environment variables.
Building remotely on apache-beam-jenkins-12 (beam) in workspace <https://ci-beam.apache.org/job/beam_PostCommit_Java_DataflowV2/ws/>
The recommended git tool is: NONE
No credentials specified
Wiping out workspace first.
Cloning the remote Git repository
Using shallow clone with depth 1
Avoid fetching tags
Cloning repository https://github.com/apache/beam.git
> git init <https://ci-beam.apache.org/job/beam_PostCommit_Java_DataflowV2/ws/src> # timeout=10
Fetching upstream changes from https://github.com/apache/beam.git
> git --version # timeout=10
> git --version # 'git version 2.25.1'
> git fetch --no-tags --force --progress --depth=1 -- https://github.com/apache/beam.git +refs/heads/*:refs/remotes/origin/* # timeout=10
> git config remote.origin.url https://github.com/apache/beam.git # timeout=10
> git config --add remote.origin.fetch +refs/heads/*:refs/remotes/origin/* # timeout=10
> git config remote.origin.url https://github.com/apache/beam.git # timeout=10
Using shallow fetch with depth 1
Fetching upstream changes from https://github.com/apache/beam.git
> git fetch --no-tags --force --progress --depth=1 -- https://github.com/apache/beam.git +refs/heads/*:refs/remotes/origin/* +refs/pull/${ghprbPullId}/*:refs/remotes/origin/pr/${ghprbPullId}/* # timeout=10
> git rev-parse origin/master^{commit} # timeout=10
Checking out Revision dc7f9d11498b5bec567bcb5f29ff27ed2c1fde23 (origin/master)
> git config core.sparsecheckout # timeout=10
> git checkout -f dc7f9d11498b5bec567bcb5f29ff27ed2c1fde23 # timeout=10
Commit message: "Merge pull request #26096: Allow to set operator chaining for flink runner (#26095)"
java.nio.file.FileSystemException: /home/jenkins/jenkins-home/jobs/beam_PostCommit_Java_DataflowV2/builds/2898/changelog.xml: No space left on device
at java.base/sun.nio.fs.UnixException.translateToIOException(UnixException.java:100)
at java.base/sun.nio.fs.UnixException.rethrowAsIOException(UnixException.java:111)
at java.base/sun.nio.fs.UnixException.rethrowAsIOException(UnixException.java:116)
at java.base/sun.nio.fs.UnixFileSystemProvider.newByteChannel(UnixFileSystemProvider.java:219)
at java.base/java.nio.file.spi.FileSystemProvider.newOutputStream(FileSystemProvider.java:478)
at java.base/java.nio.file.Files.newOutputStream(Files.java:220)
at hudson.FilePath.write(FilePath.java:2405)
at hudson.plugins.git.GitSCM.computeChangeLog(GitSCM.java:1463)
at hudson.plugins.git.GitSCM.checkout(GitSCM.java:1386)
at hudson.scm.SCM.checkout(SCM.java:540)
at hudson.model.AbstractProject.checkout(AbstractProject.java:1215)
at hudson.model.AbstractBuild$AbstractBuildExecution.defaultCheckout(AbstractBuild.java:645)
at jenkins.scm.SCMCheckoutStrategy.checkout(SCMCheckoutStrategy.java:85)
at hudson.model.AbstractBuild$AbstractBuildExecution.run(AbstractBuild.java:517)
at hudson.model.Run.execute(Run.java:1896)
at hudson.model.FreeStyleBuild.run(FreeStyleBuild.java:44)
at hudson.model.ResourceController.execute(ResourceController.java:101)
at hudson.model.Executor.run(Executor.java:442)
---------------------------------------------------------------------
To unsubscribe, e-mail: builds-unsubscribe@beam.apache.org
For additional commands, e-mail: builds-help@beam.apache.org
Jenkins build is back to normal : beam_PostCommit_Java_DataflowV2 #2916
Posted by Apache Jenkins Server <je...@builds.apache.org>.
See <https://ci-beam.apache.org/job/beam_PostCommit_Java_DataflowV2/2916/display/redirect>
---------------------------------------------------------------------
To unsubscribe, e-mail: builds-unsubscribe@beam.apache.org
For additional commands, e-mail: builds-help@beam.apache.org
Build failed in Jenkins: beam_PostCommit_Java_DataflowV2 #2915
Posted by Apache Jenkins Server <je...@builds.apache.org>.
See <https://ci-beam.apache.org/job/beam_PostCommit_Java_DataflowV2/2915/display/redirect>
Changes:
------------------------------------------
[...truncated 66.06 KB...]
> Task :sdks:java:container:java8:docker
#1 [internal] load build definition from Dockerfile
#1 transferring dockerfile:
#1 transferring dockerfile: 2.58kB done
#1 DONE 0.0s
#2 [internal] load .dockerignore
#2 transferring context: 2B done
#2 DONE 0.0s
#3 [internal] load metadata for docker.io/library/eclipse-temurin:8
#3 DONE 0.3s
#4 [ 1/16] FROM docker.io/library/eclipse-temurin:8@sha256:1f41c45c94ce6b02640030362ebd29eaec22ccc65c3e42f3c28f5edd5ca2aab8
#4 resolve docker.io/library/eclipse-temurin:8@sha256:1f41c45c94ce6b02640030362ebd29eaec22ccc65c3e42f3c28f5edd5ca2aab8 0.0s done
#4 CACHED
#5 [internal] load build context
#5 transferring context: 46.89MB 0.5s done
#5 DONE 0.5s
#6 [ 2/16] ADD target/slf4j-api.jar /opt/apache/beam/jars/
> Task :runners:direct-java:shadowTestJar
> Task :sdks:java:extensions:ml:classes
> Task :sdks:java:extensions:ml:jar
> Task :sdks:java:container:java8:docker
#6 DONE 1.4s
#7 [ 3/16] ADD target/slf4j-jdk14.jar /opt/apache/beam/jars/
#7 DONE 0.1s
#8 [ 4/16] ADD target/jcl-over-slf4j.jar /opt/apache/beam/jars/
#8 DONE 0.1s
#9 [ 5/16] ADD target/log4j-over-slf4j.jar /opt/apache/beam/jars/
#9 DONE 0.1s
#10 [ 6/16] ADD target/log4j-to-slf4j.jar /opt/apache/beam/jars/
#10 DONE 0.1s
#11 [ 7/16] ADD target/beam-sdks-java-harness.jar /opt/apache/beam/jars/
#11 DONE 0.1s
#12 [ 8/16] COPY target/jamm.jar target/open-module-agent*.jar /opt/apache/beam/jars/
#12 DONE 0.2s
#13 [ 9/16] COPY target/linux_amd64/boot /opt/apache/beam/
#13 DONE 0.2s
#14 [10/16] COPY target/LICENSE /opt/apache/beam/
#14 DONE 0.1s
#15 [11/16] COPY target/NOTICE /opt/apache/beam/
#15 DONE 0.1s
#16 [12/16] ADD target/third_party_licenses /opt/apache/beam/third_party_licenses/
#16 DONE 0.2s
#17 [13/16] COPY target/LICENSE target/options/* /opt/apache/beam/options/
#17 DONE 0.1s
#18 [14/16] COPY target/go-licenses/* /opt/apache/beam/third_party_licenses/golang/
#18 DONE 0.1s
#19 [15/16] RUN if [ "true" = "false" ] ; then rm -rf /opt/apache/beam/third_party_licenses ; fi
#19 DONE 0.4s
#20 [16/16] COPY target/profiler/* /opt/google_cloud_profiler/
#20 DONE 0.1s
#21 exporting to image
#21 exporting layers
#21 exporting layers 0.4s done
#21 writing image sha256:6781dc6d1a87d386e9f322b4b658df546995892a074d69f876f70e6e3dfbe4e5 done
#21 naming to docker.io/apache/beam_java8_sdk:2.48.0.dev done
#21 DONE 0.4s
> Task :runners:google-cloud-dataflow-java:buildAndPushDockerJavaContainer
WARNING: `gcloud docker` will not be supported for Docker client versions above 18.03.
As an alternative, use `gcloud auth configure-docker` to configure `docker` to
use `gcloud` as a credential helper, then use `docker` as you would for non-GCR
registries, e.g. `docker pull gcr.io/project-id/my-image`. Add
`--verbosity=error` to silence this warning: `gcloud docker
--verbosity=error -- pull gcr.io/project-id/my-image`.
See: https://cloud.google.com/container-registry/docs/support/deprecation-notices#gcloud-docker
The push refers to repository [us.gcr.io/apache-beam-testing/java-postcommit-it/java]
b641f39a234f: Preparing
5f70bf18a086: Preparing
490b8295127f: Preparing
4aeada2d2e5b: Preparing
8999b3519a44: Preparing
8acccf15ecd0: Preparing
d092aa550992: Preparing
6353d98c04d4: Preparing
63995b1052cc: Preparing
bce71708e132: Preparing
9ac9cad1cf74: Preparing
97bbe131b72e: Preparing
f683612072f8: Preparing
b9c79a7d3cf4: Preparing
25dafdce988b: Preparing
533af4d05d89: Preparing
d09fdd9ad3ef: Preparing
04d1dcab20cb: Preparing
b93c1bd012ab: Preparing
9ac9cad1cf74: Waiting
533af4d05d89: Waiting
d09fdd9ad3ef: Waiting
97bbe131b72e: Waiting
f683612072f8: Waiting
b9c79a7d3cf4: Waiting
25dafdce988b: Waiting
04d1dcab20cb: Waiting
b93c1bd012ab: Waiting
6353d98c04d4: Waiting
8acccf15ecd0: Waiting
63995b1052cc: Waiting
bce71708e132: Waiting
d092aa550992: Waiting
5f70bf18a086: Layer already exists
4aeada2d2e5b: Pushed
490b8295127f: Pushed
8acccf15ecd0: Pushed
8999b3519a44: Pushed
d092aa550992: Pushed
63995b1052cc: Pushed
9ac9cad1cf74: Pushed
97bbe131b72e: Pushed
bce71708e132: Pushed
6353d98c04d4: Pushed
533af4d05d89: Layer already exists
d09fdd9ad3ef: Layer already exists
04d1dcab20cb: Layer already exists
b93c1bd012ab: Layer already exists
f683612072f8: Pushed
b9c79a7d3cf4: Pushed
25dafdce988b: Pushed
b641f39a234f: Pushed
20230413095741: digest: sha256:7200b902398a3ca75c4a6afd7138d9ee9b3cd55db61b1a31da5b448a916bb733 size: 4296
> Task :runners:google-cloud-dataflow-java:coreSDKJavaRunnerV2IntegrationTest NO-SOURCE
> Task :sdks:java:io:google-cloud-platform:compileTestJava
> Task :examples:java:compileJava
> Task :sdks:java:io:google-cloud-platform:compileTestJava
Note: Some input files use or override a deprecated API.
Note: Recompile with -Xlint:deprecation for details.
Note: Some input files use unchecked or unsafe operations.
Note: Recompile with -Xlint:unchecked for details.
> Task :sdks:java:io:google-cloud-platform:testClasses
> Task :sdks:java:io:google-cloud-platform:testJar
> Task :examples:java:compileJava
Note: Some input files use or override a deprecated API.
Note: Recompile with -Xlint:deprecation for details.
Note: Some input files use unchecked or unsafe operations.
Note: Recompile with -Xlint:unchecked for details.
> Task :examples:java:classes
> Task :examples:java:jar
> Task :examples:java:compileTestJava
Note: Some input files use or override a deprecated API.
Note: Recompile with -Xlint:deprecation for details.
Note: Some input files use unchecked or unsafe operations.
Note: Recompile with -Xlint:unchecked for details.
> Task :examples:java:testClasses
> Task :examples:java:testJar
> Task :runners:google-cloud-dataflow-java:googleCloudPlatformRunnerV2IntegrationTest
org.apache.beam.sdk.io.gcp.spanner.SpannerReadIT > testReadWithDataBoost FAILED
java.lang.RuntimeException at SpannerReadIT.java:214
87 tests completed, 1 failed, 2 skipped
> Task :runners:google-cloud-dataflow-java:googleCloudPlatformRunnerV2IntegrationTest FAILED
> Task :runners:google-cloud-dataflow-java:examplesJavaRunnerV2IntegrationTest
***********************************************************
***********************************************************
**********************Set Up Pubsub************************
The Pub/Sub topic has been set up for this example: projects/apache-beam-testing/topics/testpipeline-jenkins-0413124027-1719e8f0
The Pub/Sub subscription has been set up for this example: projects/apache-beam-testing/subscriptions/testpipeline-jenkins-0413124027-1719e8f0
*************************Tear Down*************************
The Pub/Sub topic has been deleted: projects/apache-beam-testing/topics/testpipeline-jenkins-0413124027-1719e8f0
The Pub/Sub subscription has been deleted: projects/apache-beam-testing/subscriptions/testpipeline-jenkins-0413124027-1719e8f0
***********************************************************
***********************************************************
***********************************************************
***********************************************************
**********************Set Up Pubsub************************
The Pub/Sub topic has been set up for this example: projects/apache-beam-testing/topics/testpipeline-jenkins-0413124027-1b59a652
The Pub/Sub subscription has been set up for this example: projects/apache-beam-testing/subscriptions/testpipeline-jenkins-0413124027-1b59a652
*************************Tear Down*************************
The Pub/Sub topic has been deleted: projects/apache-beam-testing/topics/testpipeline-jenkins-0413124027-1b59a652
The Pub/Sub subscription has been deleted: projects/apache-beam-testing/subscriptions/testpipeline-jenkins-0413124027-1b59a652
***********************************************************
***********************************************************
> Task :runners:google-cloud-dataflow-java:cleanUpDockerJavaImages
Untagged: us.gcr.io/apache-beam-testing/java-postcommit-it/java:20230413095741
Untagged: us.gcr.io/apache-beam-testing/java-postcommit-it/java@sha256:7200b902398a3ca75c4a6afd7138d9ee9b3cd55db61b1a31da5b448a916bb733
WARNING: Successfully resolved tag to sha256, but it is recommended to use sha256 directly.
Tag: [us.gcr.io/apache-beam-testing/java-postcommit-it/java:20230413095741]
- referencing digest: [us.gcr.io/apache-beam-testing/java-postcommit-it/java@sha256:7200b902398a3ca75c4a6afd7138d9ee9b3cd55db61b1a31da5b448a916bb733]
Deleted [[us.gcr.io/apache-beam-testing/java-postcommit-it/java:20230413095741] (referencing [us.gcr.io/apache-beam-testing/java-postcommit-it/java@sha256:7200b902398a3ca75c4a6afd7138d9ee9b3cd55db61b1a31da5b448a916bb733])].
Removing untagged image us.gcr.io/apache-beam-testing/java-postcommit-it/java@sha256:7200b902398a3ca75c4a6afd7138d9ee9b3cd55db61b1a31da5b448a916bb733
Digests:
- us.gcr.io/apache-beam-testing/java-postcommit-it/java@sha256:7200b902398a3ca75c4a6afd7138d9ee9b3cd55db61b1a31da5b448a916bb733
Deleted [us.gcr.io/apache-beam-testing/java-postcommit-it/java@sha256:7200b902398a3ca75c4a6afd7138d9ee9b3cd55db61b1a31da5b448a916bb733].
FAILURE: Build failed with an exception.
* What went wrong:
Execution failed for task ':runners:google-cloud-dataflow-java:googleCloudPlatformRunnerV2IntegrationTest'.
> There were failing tests. See the report at: file://<https://ci-beam.apache.org/job/beam_PostCommit_Java_DataflowV2/ws/src/runners/google-cloud-dataflow-java/build/reports/tests/googleCloudPlatformRunnerV2IntegrationTest/index.html>
* Try:
> Run with --stacktrace option to get the stack trace.
> Run with --info or --debug option to get more log output.
* Get more help at https://help.gradle.org
Deprecated Gradle features were used in this build, making it incompatible with Gradle 8.0.
You can use '--warning-mode all' to show the individual deprecation warnings and determine if they come from your own scripts or plugins.
See https://docs.gradle.org/7.5.1/userguide/command_line_interface.html#sec:command_line_warnings
Execution optimizations have been disabled for 1 invalid unit(s) of work during this build to ensure correctness.
Please consult deprecation warnings for more details.
BUILD FAILED in 3h 13m 52s
152 actionable tasks: 110 executed, 38 from cache, 4 up-to-date
Publishing build scan...
https://gradle.com/s/57opdba2jl3x4
Build step 'Invoke Gradle script' changed build result to FAILURE
Build step 'Invoke Gradle script' marked build as failure
---------------------------------------------------------------------
To unsubscribe, e-mail: builds-unsubscribe@beam.apache.org
For additional commands, e-mail: builds-help@beam.apache.org
Build failed in Jenkins: beam_PostCommit_Java_DataflowV2 #2914
Posted by Apache Jenkins Server <je...@builds.apache.org>.
See <https://ci-beam.apache.org/job/beam_PostCommit_Java_DataflowV2/2914/display/redirect>
Changes:
------------------------------------------
[...truncated 56.38 KB...]
> Task :release:go-licenses:java:dockerRun
+ go-licenses csv github.com/apache/beam/sdks/v2/java/container
+ tee /output/licenses/list.csv
W0413 03:59:08.095494 79 library.go:101] "golang.org/x/sys/unix" contains non-Go code that can't be inspected for further dependencies:
/go/pkg/mod/golang.org/x/sys@v0.5.0/unix/asm_linux_amd64.s
> Task :sdks:java:extensions:google-cloud-platform-core:compileTestJava
Note: Some input files use or override a deprecated API.
Note: Recompile with -Xlint:deprecation for details.
> Task :sdks:java:extensions:google-cloud-platform-core:testClasses
> Task :sdks:java:extensions:google-cloud-platform-core:testJar
> Task :sdks:java:io:kafka:compileJava
> Task :sdks:java:extensions:ml:compileJava
> Task :sdks:java:extensions:ml:classes
> Task :release:go-licenses:java:dockerRun
+ chmod -R a+w /output/licenses
> Task :release:go-licenses:java:createLicenses
> Task :sdks:java:container:java8:copyGolangLicenses
> Task :sdks:java:extensions:ml:jar
> Task :sdks:java:container:java8:dockerPrepare
> Task :sdks:java:extensions:protobuf:compileTestJava
Note: Some input files use or override a deprecated API.
Note: Recompile with -Xlint:deprecation for details.
Note: Some input files use unchecked or unsafe operations.
Note: Recompile with -Xlint:unchecked for details.
> Task :sdks:java:extensions:protobuf:testClasses
> Task :sdks:java:extensions:protobuf:testJar
> Task :sdks:java:container:java8:docker
#1 [internal] load build definition from Dockerfile
#1 transferring dockerfile: 2.58kB 0.0s done
#1 DONE 0.0s
#2 [internal] load .dockerignore
#2 transferring context: 2B done
#2 DONE 0.0s
#3 [internal] load metadata for docker.io/library/eclipse-temurin:8
#3 DONE 0.3s
#4 [ 1/16] FROM docker.io/library/eclipse-temurin:8@sha256:1f41c45c94ce6b02640030362ebd29eaec22ccc65c3e42f3c28f5edd5ca2aab8
#4 resolve docker.io/library/eclipse-temurin:8@sha256:1f41c45c94ce6b02640030362ebd29eaec22ccc65c3e42f3c28f5edd5ca2aab8 0.1s done
#4 ...
#5 [internal] load build context
#5 transferring context: 46.89MB 0.9s done
#5 DONE 0.9s
#6 [ 2/16] ADD target/slf4j-api.jar /opt/apache/beam/jars/
#6 DONE 1.2s
#4 [ 1/16] FROM docker.io/library/eclipse-temurin:8@sha256:1f41c45c94ce6b02640030362ebd29eaec22ccc65c3e42f3c28f5edd5ca2aab8
#4 ...
#7 [ 3/16] ADD target/slf4j-jdk14.jar /opt/apache/beam/jars/
#7 DONE 0.1s
#8 [ 4/16] ADD target/jcl-over-slf4j.jar /opt/apache/beam/jars/
#8 DONE 0.1s
> Task :runners:direct-java:compileTestJava
Note: Some input files use or override a deprecated API.
Note: Recompile with -Xlint:deprecation for details.
Note: Some input files use unchecked or unsafe operations.
Note: Recompile with -Xlint:unchecked for details.
> Task :runners:direct-java:testClasses
> Task :sdks:java:container:java8:docker
#9 [ 5/16] ADD target/log4j-over-slf4j.jar /opt/apache/beam/jars/
#9 DONE 0.1s
#10 [ 6/16] ADD target/log4j-to-slf4j.jar /opt/apache/beam/jars/
#10 DONE 0.1s
#11 [ 7/16] ADD target/beam-sdks-java-harness.jar /opt/apache/beam/jars/
#11 DONE 0.1s
#4 [ 1/16] FROM docker.io/library/eclipse-temurin:8@sha256:1f41c45c94ce6b02640030362ebd29eaec22ccc65c3e42f3c28f5edd5ca2aab8
#4 ...
#12 [ 8/16] COPY target/jamm.jar target/open-module-agent*.jar /opt/apache/beam/jars/
#12 DONE 0.1s
#13 [ 9/16] COPY target/linux_amd64/boot /opt/apache/beam/
#13 DONE 0.2s
#14 [10/16] COPY target/LICENSE /opt/apache/beam/
#14 DONE 0.1s
#15 [11/16] COPY target/NOTICE /opt/apache/beam/
#15 DONE 0.1s
#16 [12/16] ADD target/third_party_licenses /opt/apache/beam/third_party_licenses/
#16 DONE 0.2s
#17 [13/16] COPY target/LICENSE target/options/* /opt/apache/beam/options/
#17 DONE 0.1s
#4 [ 1/16] FROM docker.io/library/eclipse-temurin:8@sha256:1f41c45c94ce6b02640030362ebd29eaec22ccc65c3e42f3c28f5edd5ca2aab8
#4 ...
#18 [14/16] COPY target/go-licenses/* /opt/apache/beam/third_party_licenses/golang/
#18 DONE 0.1s
#19 [15/16] RUN if [ "true" = "false" ] ; then rm -rf /opt/apache/beam/third_party_licenses ; fi
#19 DONE 0.8s
#20 [16/16] COPY target/profiler/* /opt/google_cloud_profiler/
#20 DONE 0.1s
#4 [ 1/16] FROM docker.io/library/eclipse-temurin:8@sha256:1f41c45c94ce6b02640030362ebd29eaec22ccc65c3e42f3c28f5edd5ca2aab8
#4 ...
#21 exporting to image
#21 exporting layers
#21 exporting layers 0.5s done
#21 writing image sha256:1f35e67437af9dcfe80e2f715f22b784ac314d745a333c960a1ae997bdfb80cb done
#21 naming to docker.io/apache/beam_java8_sdk:2.48.0.dev done
#21 DONE 0.5s
#4 [ 1/16] FROM docker.io/library/eclipse-temurin:8@sha256:1f41c45c94ce6b02640030362ebd29eaec22ccc65c3e42f3c28f5edd5ca2aab8
> Task :sdks:java:io:google-cloud-platform:compileJava
> Task :runners:direct-java:shadowTestJar
> Task :runners:google-cloud-dataflow-java:buildAndPushDockerJavaContainer
WARNING: `gcloud docker` will not be supported for Docker client versions above 18.03.
As an alternative, use `gcloud auth configure-docker` to configure `docker` to
use `gcloud` as a credential helper, then use `docker` as you would for non-GCR
registries, e.g. `docker pull gcr.io/project-id/my-image`. Add
`--verbosity=error` to silence this warning: `gcloud docker
--verbosity=error -- pull gcr.io/project-id/my-image`.
See: https://cloud.google.com/container-registry/docs/support/deprecation-notices#gcloud-docker
> Task :sdks:java:io:kafka:compileJava
Note: Some input files use or override a deprecated API.
Note: Recompile with -Xlint:deprecation for details.
Note: Some input files use unchecked or unsafe operations.
Note: Recompile with -Xlint:unchecked for details.
> Task :sdks:java:io:kafka:classes
> Task :sdks:java:io:kafka:jar
> Task :sdks:java:io:google-cloud-platform:compileJava
Note: Some input files use or override a deprecated API.
Note: Recompile with -Xlint:deprecation for details.
Note: Some input files use unchecked or unsafe operations.
Note: Recompile with -Xlint:unchecked for details.
> Task :sdks:java:io:google-cloud-platform:classes
> Task :sdks:java:io:google-cloud-platform:jar
> Task :runners:google-cloud-dataflow-java:compileJava
> Task :examples:java:compileJava
> Task :sdks:java:io:google-cloud-platform:compileTestJava
Note: Some input files use or override a deprecated API.
Note: Recompile with -Xlint:deprecation for details.
Note: Some input files use unchecked or unsafe operations.
Note: Recompile with -Xlint:unchecked for details.
> Task :sdks:java:io:google-cloud-platform:testClasses
> Task :sdks:java:io:google-cloud-platform:testJar
> Task :examples:java:compileJava
Note: Some input files use or override a deprecated API.
Note: Recompile with -Xlint:deprecation for details.
Note: Some input files use unchecked or unsafe operations.
Note: Recompile with -Xlint:unchecked for details.
> Task :examples:java:classes
> Task :examples:java:jar
> Task :examples:java:compileTestJava
Note: Some input files use or override a deprecated API.
Note: Recompile with -Xlint:deprecation for details.
Note: Some input files use unchecked or unsafe operations.
Note: Recompile with -Xlint:unchecked for details.
> Task :examples:java:testClasses
> Task :examples:java:testJar
> Task :runners:google-cloud-dataflow-java:compileJava
Note: Some input files use or override a deprecated API.
Note: Recompile with -Xlint:deprecation for details.
Note: Some input files use unchecked or unsafe operations.
Note: Recompile with -Xlint:unchecked for details.
> Task :runners:google-cloud-dataflow-java:classes
> Task :runners:google-cloud-dataflow-java:jar
> Task :runners:google-cloud-dataflow-java:coreSDKJavaRunnerV2IntegrationTest NO-SOURCE
> Task :runners:google-cloud-dataflow-java:examplesJavaRunnerV2IntegrationTest
> Task :runners:google-cloud-dataflow-java:googleCloudPlatformRunnerV2IntegrationTest
org.apache.beam.sdk.io.gcp.spanner.SpannerReadIT > testReadWithDataBoost FAILED
java.lang.RuntimeException at SpannerReadIT.java:214
87 tests completed, 1 failed, 2 skipped
> Task :runners:google-cloud-dataflow-java:googleCloudPlatformRunnerV2IntegrationTest FAILED
> Task :runners:google-cloud-dataflow-java:cleanUpDockerJavaImages
WARNING: Successfully resolved tag to sha256, but it is recommended to use sha256 directly.
Tag: [us.gcr.io/apache-beam-testing/java-postcommit-it/java:20230413035744]
- referencing digest: [us.gcr.io/apache-beam-testing/java-postcommit-it/java@sha256:c55701cb28396b8021a2d1004ebd2a06591ecff5c1ff645f584cc0af6a07ff3a]
Deleted [[us.gcr.io/apache-beam-testing/java-postcommit-it/java:20230413035744] (referencing [us.gcr.io/apache-beam-testing/java-postcommit-it/java@sha256:c55701cb28396b8021a2d1004ebd2a06591ecff5c1ff645f584cc0af6a07ff3a])].
Digests:
- us.gcr.io/apache-beam-testing/java-postcommit-it/java@sha256:c55701cb28396b8021a2d1004ebd2a06591ecff5c1ff645f584cc0af6a07ff3a
Deleted [us.gcr.io/apache-beam-testing/java-postcommit-it/java@sha256:c55701cb28396b8021a2d1004ebd2a06591ecff5c1ff645f584cc0af6a07ff3a].
FAILURE: Build failed with an exception.
* What went wrong:
Execution failed for task ':runners:google-cloud-dataflow-java:googleCloudPlatformRunnerV2IntegrationTest'.
> There were failing tests. See the report at: file://<https://ci-beam.apache.org/job/beam_PostCommit_Java_DataflowV2/ws/src/runners/google-cloud-dataflow-java/build/reports/tests/googleCloudPlatformRunnerV2IntegrationTest/index.html>
* Try:
> Run with --stacktrace option to get the stack trace.
> Run with --info or --debug option to get more log output.
* Get more help at https://help.gradle.org
Deprecated Gradle features were used in this build, making it incompatible with Gradle 8.0.
You can use '--warning-mode all' to show the individual deprecation warnings and determine if they come from your own scripts or plugins.
See https://docs.gradle.org/7.5.1/userguide/command_line_interface.html#sec:command_line_warnings
Execution optimizations have been disabled for 1 invalid unit(s) of work during this build to ensure correctness.
Please consult deprecation warnings for more details.
BUILD FAILED in 3h 14m 52s
152 actionable tasks: 118 executed, 30 from cache, 4 up-to-date
Publishing build scan...
https://gradle.com/s/4j3zqi7wvkml4
Build step 'Invoke Gradle script' changed build result to FAILURE
Build step 'Invoke Gradle script' marked build as failure
---------------------------------------------------------------------
To unsubscribe, e-mail: builds-unsubscribe@beam.apache.org
For additional commands, e-mail: builds-help@beam.apache.org
Build failed in Jenkins: beam_PostCommit_Java_DataflowV2 #2913
Posted by Apache Jenkins Server <je...@builds.apache.org>.
See <https://ci-beam.apache.org/job/beam_PostCommit_Java_DataflowV2/2913/display/redirect>
Changes:
------------------------------------------
[...truncated 62.98 KB...]
go: downloading golang.org/x/sys v0.5.0
go: downloading google.golang.org/grpc v1.52.3
go: downloading google.golang.org/protobuf v1.28.1
go: downloading google.golang.org/genproto v0.0.0-20230110181048-76db0878b65f
go: downloading golang.org/x/text v0.7.0
go: added github.com/apache/beam/sdks/v2 v2.46.0
go: added github.com/golang/protobuf v1.5.2
go: added golang.org/x/net v0.5.0
go: added golang.org/x/sys v0.5.0
go: added golang.org/x/text v0.7.0
go: added google.golang.org/genproto v0.0.0-20230110181048-76db0878b65f
go: added google.golang.org/grpc v1.52.3
go: added google.golang.org/protobuf v1.28.1
+ go-licenses save github.com/apache/beam/sdks/v2/java/container --save_path=/output/licenses
W0412 21:59:56.798275 38 library.go:101] "golang.org/x/sys/unix" contains non-Go code that can't be inspected for further dependencies:
/go/pkg/mod/golang.org/x/sys@v0.5.0/unix/asm_linux_amd64.s
+ go-licenses csv github.com/apache/beam/sdks/v2/java/container
+ tee /output/licenses/list.csv
W0412 22:00:01.023070 84 library.go:101] "golang.org/x/sys/unix" contains non-Go code that can't be inspected for further dependencies:
/go/pkg/mod/golang.org/x/sys@v0.5.0/unix/asm_linux_amd64.s
github.com/apache/beam/sdks/v2/go/pkg/beam,https://github.com/apache/beam/blob/sdks/v2.46.0/sdks/go/README.md,Apache-2.0
github.com/apache/beam/sdks/v2/java/container,https://github.com/apache/beam/blob/sdks/v2.46.0/sdks/LICENSE,Apache-2.0
github.com/golang/protobuf,https://github.com/golang/protobuf/blob/v1.5.2/LICENSE,BSD-3-Clause
golang.org/x/net,https://cs.opensource.google/go/x/net/+/v0.5.0:LICENSE,BSD-3-Clause
golang.org/x/sys/unix,https://cs.opensource.google/go/x/sys/+/v0.5.0:LICENSE,BSD-3-Clause
golang.org/x/text,https://cs.opensource.google/go/x/text/+/v0.7.0:LICENSE,BSD-3-Clause
google.golang.org/genproto/googleapis/rpc/status,https://github.com/googleapis/go-genproto/blob/76db0878b65f/LICENSE,Apache-2.0
google.golang.org/grpc,https://github.com/grpc/grpc-go/blob/v1.52.3/LICENSE,Apache-2.0
google.golang.org/protobuf,https://github.com/protocolbuffers/protobuf-go/blob/v1.28.1/LICENSE,BSD-3-Clause
+ chmod -R a+w /output/licenses
> Task :release:go-licenses:java:createLicenses
> Task :sdks:java:container:java8:copyGolangLicenses
> Task :sdks:java:container:java8:dockerPrepare
> Task :sdks:java:container:java8:docker
#1 [internal] load build definition from Dockerfile
#1 transferring dockerfile: 2.58kB 0.0s done
#1 DONE 0.0s
#2 [internal] load .dockerignore
#2 transferring context: 2B done
#2 DONE 0.0s
#3 [internal] load metadata for docker.io/library/eclipse-temurin:8
#3 DONE 0.3s
#4 [ 1/16] FROM docker.io/library/eclipse-temurin:8@sha256:1f41c45c94ce6b02640030362ebd29eaec22ccc65c3e42f3c28f5edd5ca2aab8
#4 resolve docker.io/library/eclipse-temurin:8@sha256:1f41c45c94ce6b02640030362ebd29eaec22ccc65c3e42f3c28f5edd5ca2aab8 0.0s done
#4 CACHED
#5 [internal] load build context
#5 transferring context: 46.89MB 0.4s done
#5 DONE 0.4s
#6 [ 2/16] ADD target/slf4j-api.jar /opt/apache/beam/jars/
#6 DONE 1.7s
#7 [ 3/16] ADD target/slf4j-jdk14.jar /opt/apache/beam/jars/
#7 DONE 0.1s
#8 [ 4/16] ADD target/jcl-over-slf4j.jar /opt/apache/beam/jars/
#8 DONE 0.1s
#9 [ 5/16] ADD target/log4j-over-slf4j.jar /opt/apache/beam/jars/
#9 DONE 0.1s
#10 [ 6/16] ADD target/log4j-to-slf4j.jar /opt/apache/beam/jars/
#10 DONE 0.1s
#11 [ 7/16] ADD target/beam-sdks-java-harness.jar /opt/apache/beam/jars/
#11 DONE 0.1s
#12 [ 8/16] COPY target/jamm.jar target/open-module-agent*.jar /opt/apache/beam/jars/
#12 DONE 0.1s
#13 [ 9/16] COPY target/linux_amd64/boot /opt/apache/beam/
#13 DONE 0.2s
#14 [10/16] COPY target/LICENSE /opt/apache/beam/
#14 DONE 0.1s
#15 [11/16] COPY target/NOTICE /opt/apache/beam/
#15 DONE 0.1s
#16 [12/16] ADD target/third_party_licenses /opt/apache/beam/third_party_licenses/
#16 DONE 0.3s
#17 [13/16] COPY target/LICENSE target/options/* /opt/apache/beam/options/
#17 DONE 0.1s
#18 [14/16] COPY target/go-licenses/* /opt/apache/beam/third_party_licenses/golang/
#18 DONE 0.1s
#19 [15/16] RUN if [ "true" = "false" ] ; then rm -rf /opt/apache/beam/third_party_licenses ; fi
#19 DONE 0.8s
#20 [16/16] COPY target/profiler/* /opt/google_cloud_profiler/
#20 DONE 0.4s
#21 exporting to image
#21 exporting layers
#21 exporting layers 0.2s done
#21 writing image sha256:1743cbb7c822f9a832ab1af3a5bae59175051e2ab70c0e5243ac171345d4a71e done
#21 naming to docker.io/apache/beam_java8_sdk:2.48.0.dev done
#21 DONE 0.2s
> Task :runners:google-cloud-dataflow-java:buildAndPushDockerJavaContainer
WARNING: `gcloud docker` will not be supported for Docker client versions above 18.03.
As an alternative, use `gcloud auth configure-docker` to configure `docker` to
use `gcloud` as a credential helper, then use `docker` as you would for non-GCR
registries, e.g. `docker pull gcr.io/project-id/my-image`. Add
`--verbosity=error` to silence this warning: `gcloud docker
--verbosity=error -- pull gcr.io/project-id/my-image`.
See: https://cloud.google.com/container-registry/docs/support/deprecation-notices#gcloud-docker
The push refers to repository [us.gcr.io/apache-beam-testing/java-postcommit-it/java]
3ac9ad0aa9a8: Preparing
5f70bf18a086: Preparing
4f1378e4e00f: Preparing
f74500ad8544: Preparing
15bb96458e20: Preparing
e6019076a62c: Preparing
87072b031455: Preparing
9f4dbbe71c34: Preparing
7d91698f776e: Preparing
0ab71bbcc183: Preparing
dc23278b1cae: Preparing
c1e6782b12f1: Preparing
a350abe92807: Preparing
40c8bff19cae: Preparing
04ab3e09f8f8: Preparing
533af4d05d89: Preparing
d09fdd9ad3ef: Preparing
04d1dcab20cb: Preparing
b93c1bd012ab: Preparing
87072b031455: Waiting
0ab71bbcc183: Waiting
9f4dbbe71c34: Waiting
dc23278b1cae: Waiting
7d91698f776e: Waiting
c1e6782b12f1: Waiting
a350abe92807: Waiting
e6019076a62c: Waiting
40c8bff19cae: Waiting
04d1dcab20cb: Waiting
b93c1bd012ab: Waiting
04ab3e09f8f8: Waiting
d09fdd9ad3ef: Waiting
5f70bf18a086: Layer already exists
f74500ad8544: Pushed
4f1378e4e00f: Pushed
e6019076a62c: Pushed
15bb96458e20: Pushed
7d91698f776e: Pushed
3ac9ad0aa9a8: Pushed
87072b031455: Pushed
9f4dbbe71c34: Pushed
0ab71bbcc183: Pushed
dc23278b1cae: Pushed
533af4d05d89: Layer already exists
c1e6782b12f1: Pushed
a350abe92807: Pushed
d09fdd9ad3ef: Layer already exists
04d1dcab20cb: Layer already exists
b93c1bd012ab: Layer already exists
04ab3e09f8f8: Pushed
40c8bff19cae: Pushed
20230412215838: digest: sha256:57791d9a32945bde03b5d23646b8a1c688b5a83db624b46babf3177f25fa51d6 size: 4296
> Task :runners:google-cloud-dataflow-java:coreSDKJavaRunnerV2IntegrationTest NO-SOURCE
> Task :runners:google-cloud-dataflow-java:examplesJavaRunnerV2IntegrationTest
***********************************************************
***********************************************************
**********************Set Up Pubsub************************
The Pub/Sub topic has been set up for this example: projects/apache-beam-testing/topics/testpipeline-jenkins-0412220045-7c08e233
The Pub/Sub subscription has been set up for this example: projects/apache-beam-testing/subscriptions/testpipeline-jenkins-0412220045-7c08e233
*************************Tear Down*************************
The Pub/Sub topic has been deleted: projects/apache-beam-testing/topics/testpipeline-jenkins-0412220045-7c08e233
The Pub/Sub subscription has been deleted: projects/apache-beam-testing/subscriptions/testpipeline-jenkins-0412220045-7c08e233
***********************************************************
***********************************************************
***********************************************************
***********************************************************
**********************Set Up Pubsub************************
The Pub/Sub topic has been set up for this example: projects/apache-beam-testing/topics/testpipeline-jenkins-0412220044-f7c521b8
The Pub/Sub subscription has been set up for this example: projects/apache-beam-testing/subscriptions/testpipeline-jenkins-0412220044-f7c521b8
*************************Tear Down*************************
The Pub/Sub topic has been deleted: projects/apache-beam-testing/topics/testpipeline-jenkins-0412220044-f7c521b8
The Pub/Sub subscription has been deleted: projects/apache-beam-testing/subscriptions/testpipeline-jenkins-0412220044-f7c521b8
***********************************************************
***********************************************************
> Task :runners:google-cloud-dataflow-java:googleCloudPlatformRunnerV2IntegrationTest
org.apache.beam.sdk.io.gcp.spanner.SpannerReadIT > testReadWithDataBoost FAILED
java.lang.RuntimeException at SpannerReadIT.java:214
87 tests completed, 1 failed, 2 skipped
> Task :runners:google-cloud-dataflow-java:googleCloudPlatformRunnerV2IntegrationTest FAILED
> Task :runners:google-cloud-dataflow-java:cleanUpDockerJavaImages
Untagged: us.gcr.io/apache-beam-testing/java-postcommit-it/java:20230412215838
Untagged: us.gcr.io/apache-beam-testing/java-postcommit-it/java@sha256:57791d9a32945bde03b5d23646b8a1c688b5a83db624b46babf3177f25fa51d6
Deleted: sha256:1743cbb7c822f9a832ab1af3a5bae59175051e2ab70c0e5243ac171345d4a71e
WARNING: Successfully resolved tag to sha256, but it is recommended to use sha256 directly.
Tag: [us.gcr.io/apache-beam-testing/java-postcommit-it/java:20230412215838]
- referencing digest: [us.gcr.io/apache-beam-testing/java-postcommit-it/java@sha256:57791d9a32945bde03b5d23646b8a1c688b5a83db624b46babf3177f25fa51d6]
Deleted [[us.gcr.io/apache-beam-testing/java-postcommit-it/java:20230412215838] (referencing [us.gcr.io/apache-beam-testing/java-postcommit-it/java@sha256:57791d9a32945bde03b5d23646b8a1c688b5a83db624b46babf3177f25fa51d6])].
Removing untagged image us.gcr.io/apache-beam-testing/java-postcommit-it/java@sha256:57791d9a32945bde03b5d23646b8a1c688b5a83db624b46babf3177f25fa51d6
Digests:
- us.gcr.io/apache-beam-testing/java-postcommit-it/java@sha256:57791d9a32945bde03b5d23646b8a1c688b5a83db624b46babf3177f25fa51d6
Deleted [us.gcr.io/apache-beam-testing/java-postcommit-it/java@sha256:57791d9a32945bde03b5d23646b8a1c688b5a83db624b46babf3177f25fa51d6].
FAILURE: Build failed with an exception.
* What went wrong:
Execution failed for task ':runners:google-cloud-dataflow-java:googleCloudPlatformRunnerV2IntegrationTest'.
> There were failing tests. See the report at: file://<https://ci-beam.apache.org/job/beam_PostCommit_Java_DataflowV2/ws/src/runners/google-cloud-dataflow-java/build/reports/tests/googleCloudPlatformRunnerV2IntegrationTest/index.html>
* Try:
> Run with --stacktrace option to get the stack trace.
> Run with --info or --debug option to get more log output.
* Get more help at https://help.gradle.org
Deprecated Gradle features were used in this build, making it incompatible with Gradle 8.0.
You can use '--warning-mode all' to show the individual deprecation warnings and determine if they come from your own scripts or plugins.
See https://docs.gradle.org/7.5.1/userguide/command_line_interface.html#sec:command_line_warnings
Execution optimizations have been disabled for 1 invalid unit(s) of work during this build to ensure correctness.
Please consult deprecation warnings for more details.
BUILD FAILED in 3h 17m 21s
152 actionable tasks: 98 executed, 50 from cache, 4 up-to-date
Publishing build scan...
https://gradle.com/s/fmhw3z5mcbb2k
Build step 'Invoke Gradle script' changed build result to FAILURE
Build step 'Invoke Gradle script' marked build as failure
---------------------------------------------------------------------
To unsubscribe, e-mail: builds-unsubscribe@beam.apache.org
For additional commands, e-mail: builds-help@beam.apache.org
Build failed in Jenkins: beam_PostCommit_Java_DataflowV2 #2912
Posted by Apache Jenkins Server <je...@builds.apache.org>.
See <https://ci-beam.apache.org/job/beam_PostCommit_Java_DataflowV2/2912/display/redirect?page=changes>
Changes:
[noreply] update documentation (#26201)
------------------------------------------
[...truncated 62.65 KB...]
> Task :sdks:java:container:java8:copyJavaThirdPartyLicenses
> Task :sdks:java:container:goBuild
/home/jenkins/go/bin/go1.20.2 build -o ./build/target/linux_amd64/boot boot.go boot_test.go pathingjar.go pathingjar_test.go
go: downloading golang.org/x/net v0.9.0
go: downloading google.golang.org/genproto v0.0.0-20230403163135-c38d8f061ccd
> Task :release:go-licenses:java:dockerRun
+ go-licenses csv github.com/apache/beam/sdks/v2/java/container
+ tee /output/licenses/list.csv
W0412 15:58:16.907576 86 library.go:101] "golang.org/x/sys/unix" contains non-Go code that can't be inspected for further dependencies:
/go/pkg/mod/golang.org/x/sys@v0.5.0/unix/asm_linux_amd64.s
github.com/apache/beam/sdks/v2/go/pkg/beam,https://github.com/apache/beam/blob/sdks/v2.46.0/sdks/go/README.md,Apache-2.0
github.com/apache/beam/sdks/v2/java/container,https://github.com/apache/beam/blob/sdks/v2.46.0/sdks/LICENSE,Apache-2.0
github.com/golang/protobuf,https://github.com/golang/protobuf/blob/v1.5.2/LICENSE,BSD-3-Clause
golang.org/x/net,https://cs.opensource.google/go/x/net/+/v0.5.0:LICENSE,BSD-3-Clause
golang.org/x/sys/unix,https://cs.opensource.google/go/x/sys/+/v0.5.0:LICENSE,BSD-3-Clause
golang.org/x/text,https://cs.opensource.google/go/x/text/+/v0.7.0:LICENSE,BSD-3-Clause
google.golang.org/genproto/googleapis/rpc/status,https://github.com/googleapis/go-genproto/blob/76db0878b65f/LICENSE,Apache-2.0
google.golang.org/grpc,https://github.com/grpc/grpc-go/blob/v1.52.3/LICENSE,Apache-2.0
google.golang.org/protobuf,https://github.com/protocolbuffers/protobuf-go/blob/v1.28.1/LICENSE,BSD-3-Clause
+ chmod -R a+w /output/licenses
> Task :release:go-licenses:java:createLicenses
> Task :sdks:java:container:java8:copyGolangLicenses
> Task :sdks:java:container:java8:copySdkHarnessLauncher
Execution optimizations have been disabled for task ':sdks:java:container:java8:copySdkHarnessLauncher' to ensure correctness due to the following reasons:
- Gradle detected a problem with the following location: '<https://ci-beam.apache.org/job/beam_PostCommit_Java_DataflowV2/ws/src/sdks/java/container/build/target'.> Reason: Task ':sdks:java:container:java8:copySdkHarnessLauncher' uses this output of task ':sdks:java:container:downloadCloudProfilerAgent' without declaring an explicit or implicit dependency. This can lead to incorrect results being produced, depending on what order the tasks are executed. Please refer to https://docs.gradle.org/7.5.1/userguide/validation_problems.html#implicit_dependency for more details about this problem.
- Gradle detected a problem with the following location: '<https://ci-beam.apache.org/job/beam_PostCommit_Java_DataflowV2/ws/src/sdks/java/container/build/target'.> Reason: Task ':sdks:java:container:java8:copySdkHarnessLauncher' uses this output of task ':sdks:java:container:pullLicenses' without declaring an explicit or implicit dependency. This can lead to incorrect results being produced, depending on what order the tasks are executed. Please refer to https://docs.gradle.org/7.5.1/userguide/validation_problems.html#implicit_dependency for more details about this problem.
> Task :sdks:java:container:java8:dockerPrepare
> Task :sdks:java:container:java8:docker
#1 [internal] load .dockerignore
#1 transferring context: 2B 0.0s done
#1 DONE 0.1s
#2 [internal] load build definition from Dockerfile
#2 transferring dockerfile: 2.58kB 0.1s done
#2 DONE 0.1s
#3 [internal] load metadata for docker.io/library/eclipse-temurin:8
#3 DONE 0.4s
#4 [ 1/16] FROM docker.io/library/eclipse-temurin:8@sha256:1f41c45c94ce6b02640030362ebd29eaec22ccc65c3e42f3c28f5edd5ca2aab8
#4 resolve docker.io/library/eclipse-temurin:8@sha256:1f41c45c94ce6b02640030362ebd29eaec22ccc65c3e42f3c28f5edd5ca2aab8 0.0s done
#4 CACHED
#5 [internal] load build context
#5 transferring context: 46.89MB 0.4s done
#5 DONE 0.4s
#6 [ 2/16] ADD target/slf4j-api.jar /opt/apache/beam/jars/
#6 DONE 5.3s
#7 [ 3/16] ADD target/slf4j-jdk14.jar /opt/apache/beam/jars/
#7 DONE 0.1s
#8 [ 4/16] ADD target/jcl-over-slf4j.jar /opt/apache/beam/jars/
#8 DONE 0.1s
#9 [ 5/16] ADD target/log4j-over-slf4j.jar /opt/apache/beam/jars/
#9 DONE 0.1s
#10 [ 6/16] ADD target/log4j-to-slf4j.jar /opt/apache/beam/jars/
#10 DONE 0.1s
#11 [ 7/16] ADD target/beam-sdks-java-harness.jar /opt/apache/beam/jars/
#11 DONE 0.1s
#12 [ 8/16] COPY target/jamm.jar target/open-module-agent*.jar /opt/apache/beam/jars/
#12 DONE 0.1s
#13 [ 9/16] COPY target/linux_amd64/boot /opt/apache/beam/
#13 DONE 0.2s
#14 [10/16] COPY target/LICENSE /opt/apache/beam/
#14 DONE 0.1s
#15 [11/16] COPY target/NOTICE /opt/apache/beam/
#15 DONE 0.1s
#16 [12/16] ADD target/third_party_licenses /opt/apache/beam/third_party_licenses/
#16 DONE 0.3s
#17 [13/16] COPY target/LICENSE target/options/* /opt/apache/beam/options/
#17 DONE 0.1s
#18 [14/16] COPY target/go-licenses/* /opt/apache/beam/third_party_licenses/golang/
#18 DONE 0.1s
#19 [15/16] RUN if [ "true" = "false" ] ; then rm -rf /opt/apache/beam/third_party_licenses ; fi
#19 DONE 0.7s
#20 [16/16] COPY target/profiler/* /opt/google_cloud_profiler/
#20 DONE 0.1s
#21 exporting to image
#21 exporting layers
#21 exporting layers 0.3s done
#21 writing image sha256:9cb500dd41a326b94ba514a7ca56ef0930169926c7f999037824922dfcf75a04 done
#21 naming to docker.io/apache/beam_java8_sdk:2.48.0.dev done
#21 DONE 0.3s
> Task :runners:google-cloud-dataflow-java:buildAndPushDockerJavaContainer
WARNING: `gcloud docker` will not be supported for Docker client versions above 18.03.
As an alternative, use `gcloud auth configure-docker` to configure `docker` to
use `gcloud` as a credential helper, then use `docker` as you would for non-GCR
registries, e.g. `docker pull gcr.io/project-id/my-image`. Add
`--verbosity=error` to silence this warning: `gcloud docker
--verbosity=error -- pull gcr.io/project-id/my-image`.
See: https://cloud.google.com/container-registry/docs/support/deprecation-notices#gcloud-docker
The push refers to repository [us.gcr.io/apache-beam-testing/java-postcommit-it/java]
d2c1cc11f0b7: Preparing
5f70bf18a086: Preparing
5cc4f3af4606: Preparing
3a9418a3c2f3: Preparing
c2b2569fdc08: Preparing
4f5616ac45b3: Preparing
477af8171244: Preparing
987e2866cf98: Preparing
62a2a5b04a43: Preparing
7f4c3dab7402: Preparing
35fcd9cb1f2c: Preparing
ce47b241ed46: Preparing
2eb2d2457563: Preparing
1636faf92831: Preparing
1f4fa56b7c98: Preparing
533af4d05d89: Preparing
d09fdd9ad3ef: Preparing
04d1dcab20cb: Preparing
b93c1bd012ab: Preparing
2eb2d2457563: Waiting
62a2a5b04a43: Waiting
7f4c3dab7402: Waiting
987e2866cf98: Waiting
d09fdd9ad3ef: Waiting
04d1dcab20cb: Waiting
477af8171244: Waiting
1636faf92831: Waiting
35fcd9cb1f2c: Waiting
b93c1bd012ab: Waiting
4f5616ac45b3: Waiting
5f70bf18a086: Layer already exists
5cc4f3af4606: Pushed
4f5616ac45b3: Pushed
3a9418a3c2f3: Pushed
d2c1cc11f0b7: Pushed
c2b2569fdc08: Pushed
477af8171244: Pushed
62a2a5b04a43: Pushed
35fcd9cb1f2c: Pushed
987e2866cf98: Pushed
7f4c3dab7402: Pushed
ce47b241ed46: Pushed
533af4d05d89: Layer already exists
d09fdd9ad3ef: Layer already exists
b93c1bd012ab: Layer already exists
2eb2d2457563: Pushed
04d1dcab20cb: Layer already exists
1636faf92831: Pushed
1f4fa56b7c98: Pushed
20230412155743: digest: sha256:4695159466e1b92094bf49b01573c960338d991606e937ba86f6d3a21cdd6776 size: 4296
> Task :runners:google-cloud-dataflow-java:coreSDKJavaRunnerV2IntegrationTest NO-SOURCE
> Task :runners:google-cloud-dataflow-java:examplesJavaRunnerV2IntegrationTest
***********************************************************
***********************************************************
**********************Set Up Pubsub************************
The Pub/Sub topic has been set up for this example: projects/apache-beam-testing/topics/testpipeline-jenkins-0412155901-a095a3fc
The Pub/Sub subscription has been set up for this example: projects/apache-beam-testing/subscriptions/testpipeline-jenkins-0412155901-a095a3fc
*************************Tear Down*************************
The Pub/Sub topic has been deleted: projects/apache-beam-testing/topics/testpipeline-jenkins-0412155901-a095a3fc
The Pub/Sub subscription has been deleted: projects/apache-beam-testing/subscriptions/testpipeline-jenkins-0412155901-a095a3fc
***********************************************************
***********************************************************
***********************************************************
***********************************************************
**********************Set Up Pubsub************************
The Pub/Sub topic has been set up for this example: projects/apache-beam-testing/topics/testpipeline-jenkins-0412155900-d2be1c5d
The Pub/Sub subscription has been set up for this example: projects/apache-beam-testing/subscriptions/testpipeline-jenkins-0412155900-d2be1c5d
*************************Tear Down*************************
The Pub/Sub topic has been deleted: projects/apache-beam-testing/topics/testpipeline-jenkins-0412155900-d2be1c5d
The Pub/Sub subscription has been deleted: projects/apache-beam-testing/subscriptions/testpipeline-jenkins-0412155900-d2be1c5d
***********************************************************
***********************************************************
> Task :runners:google-cloud-dataflow-java:googleCloudPlatformRunnerV2IntegrationTest
org.apache.beam.sdk.io.gcp.pubsub.PubsubReadIT > testReadPubsubMessageId FAILED
java.lang.AssertionError at PubsubReadIT.java:85
org.apache.beam.sdk.io.gcp.spanner.SpannerReadIT > testReadWithDataBoost FAILED
java.lang.RuntimeException at SpannerReadIT.java:214
87 tests completed, 2 failed, 2 skipped
> Task :runners:google-cloud-dataflow-java:googleCloudPlatformRunnerV2IntegrationTest FAILED
> Task :runners:google-cloud-dataflow-java:cleanUpDockerJavaImages
Untagged: us.gcr.io/apache-beam-testing/java-postcommit-it/java:20230412155743
Untagged: us.gcr.io/apache-beam-testing/java-postcommit-it/java@sha256:4695159466e1b92094bf49b01573c960338d991606e937ba86f6d3a21cdd6776
Deleted: sha256:9cb500dd41a326b94ba514a7ca56ef0930169926c7f999037824922dfcf75a04
WARNING: Successfully resolved tag to sha256, but it is recommended to use sha256 directly.
Tag: [us.gcr.io/apache-beam-testing/java-postcommit-it/java:20230412155743]
- referencing digest: [us.gcr.io/apache-beam-testing/java-postcommit-it/java@sha256:4695159466e1b92094bf49b01573c960338d991606e937ba86f6d3a21cdd6776]
Deleted [[us.gcr.io/apache-beam-testing/java-postcommit-it/java:20230412155743] (referencing [us.gcr.io/apache-beam-testing/java-postcommit-it/java@sha256:4695159466e1b92094bf49b01573c960338d991606e937ba86f6d3a21cdd6776])].
Removing untagged image us.gcr.io/apache-beam-testing/java-postcommit-it/java@sha256:4695159466e1b92094bf49b01573c960338d991606e937ba86f6d3a21cdd6776
Digests:
- us.gcr.io/apache-beam-testing/java-postcommit-it/java@sha256:4695159466e1b92094bf49b01573c960338d991606e937ba86f6d3a21cdd6776
Deleted [us.gcr.io/apache-beam-testing/java-postcommit-it/java@sha256:4695159466e1b92094bf49b01573c960338d991606e937ba86f6d3a21cdd6776].
FAILURE: Build failed with an exception.
* What went wrong:
Execution failed for task ':runners:google-cloud-dataflow-java:googleCloudPlatformRunnerV2IntegrationTest'.
> There were failing tests. See the report at: file://<https://ci-beam.apache.org/job/beam_PostCommit_Java_DataflowV2/ws/src/runners/google-cloud-dataflow-java/build/reports/tests/googleCloudPlatformRunnerV2IntegrationTest/index.html>
* Try:
> Run with --stacktrace option to get the stack trace.
> Run with --info or --debug option to get more log output.
* Get more help at https://help.gradle.org
Deprecated Gradle features were used in this build, making it incompatible with Gradle 8.0.
You can use '--warning-mode all' to show the individual deprecation warnings and determine if they come from your own scripts or plugins.
See https://docs.gradle.org/7.5.1/userguide/command_line_interface.html#sec:command_line_warnings
Execution optimizations have been disabled for 1 invalid unit(s) of work during this build to ensure correctness.
Please consult deprecation warnings for more details.
BUILD FAILED in 3h 23m 52s
152 actionable tasks: 98 executed, 50 from cache, 4 up-to-date
Publishing build scan...
https://gradle.com/s/h63blqjcp72tq
Build step 'Invoke Gradle script' changed build result to FAILURE
Build step 'Invoke Gradle script' marked build as failure
---------------------------------------------------------------------
To unsubscribe, e-mail: builds-unsubscribe@beam.apache.org
For additional commands, e-mail: builds-help@beam.apache.org
Build failed in Jenkins: beam_PostCommit_Java_DataflowV2 #2911
Posted by Apache Jenkins Server <je...@builds.apache.org>.
See <https://ci-beam.apache.org/job/beam_PostCommit_Java_DataflowV2/2911/display/redirect>
Changes:
------------------------------------------
[...truncated 61.47 KB...]
Finished license_scripts.sh
> Task :sdks:java:container:goPrepare UP-TO-DATE
> Task :sdks:java:container:java8:copyJavaThirdPartyLicenses
> Task :release:go-licenses:java:dockerRun
+ go-licenses csv github.com/apache/beam/sdks/v2/java/container
+ tee /output/licenses/list.csv
> Task :sdks:java:container:goBuild
/home/jenkins/go/bin/go1.20.2 build -o ./build/target/linux_amd64/boot boot.go boot_test.go pathingjar.go pathingjar_test.go
> Task :sdks:java:container:java8:copySdkHarnessLauncher
Execution optimizations have been disabled for task ':sdks:java:container:java8:copySdkHarnessLauncher' to ensure correctness due to the following reasons:
- Gradle detected a problem with the following location: '<https://ci-beam.apache.org/job/beam_PostCommit_Java_DataflowV2/ws/src/sdks/java/container/build/target'.> Reason: Task ':sdks:java:container:java8:copySdkHarnessLauncher' uses this output of task ':sdks:java:container:downloadCloudProfilerAgent' without declaring an explicit or implicit dependency. This can lead to incorrect results being produced, depending on what order the tasks are executed. Please refer to https://docs.gradle.org/7.5.1/userguide/validation_problems.html#implicit_dependency for more details about this problem.
- Gradle detected a problem with the following location: '<https://ci-beam.apache.org/job/beam_PostCommit_Java_DataflowV2/ws/src/sdks/java/container/build/target'.> Reason: Task ':sdks:java:container:java8:copySdkHarnessLauncher' uses this output of task ':sdks:java:container:pullLicenses' without declaring an explicit or implicit dependency. This can lead to incorrect results being produced, depending on what order the tasks are executed. Please refer to https://docs.gradle.org/7.5.1/userguide/validation_problems.html#implicit_dependency for more details about this problem.
> Task :release:go-licenses:java:dockerRun
W0412 09:58:02.440709 84 library.go:101] "golang.org/x/sys/unix" contains non-Go code that can't be inspected for further dependencies:
/go/pkg/mod/golang.org/x/sys@v0.5.0/unix/asm_linux_amd64.s
github.com/apache/beam/sdks/v2/go/pkg/beam,https://github.com/apache/beam/blob/sdks/v2.46.0/sdks/go/README.md,Apache-2.0
github.com/apache/beam/sdks/v2/java/container,https://github.com/apache/beam/blob/sdks/v2.46.0/sdks/LICENSE,Apache-2.0
github.com/golang/protobuf,https://github.com/golang/protobuf/blob/v1.5.2/LICENSE,BSD-3-Clause
golang.org/x/net,https://cs.opensource.google/go/x/net/+/v0.5.0:LICENSE,BSD-3-Clause
golang.org/x/sys/unix,https://cs.opensource.google/go/x/sys/+/v0.5.0:LICENSE,BSD-3-Clause
golang.org/x/text,https://cs.opensource.google/go/x/text/+/v0.7.0:LICENSE,BSD-3-Clause
google.golang.org/genproto/googleapis/rpc/status,https://github.com/googleapis/go-genproto/blob/76db0878b65f/LICENSE,Apache-2.0
google.golang.org/grpc,https://github.com/grpc/grpc-go/blob/v1.52.3/LICENSE,Apache-2.0
google.golang.org/protobuf,https://github.com/protocolbuffers/protobuf-go/blob/v1.28.1/LICENSE,BSD-3-Clause
+ chmod -R a+w /output/licenses
> Task :release:go-licenses:java:createLicenses
> Task :sdks:java:container:java8:copyGolangLicenses
> Task :sdks:java:container:java8:dockerPrepare
> Task :sdks:java:container:java8:docker
#1 [internal] load build definition from Dockerfile
#1 transferring dockerfile: 2.58kB done
#1 DONE 0.0s
#2 [internal] load .dockerignore
#2 transferring context: 2B done
#2 DONE 0.0s
#3 [internal] load metadata for docker.io/library/eclipse-temurin:8
#3 DONE 0.3s
#4 [ 1/16] FROM docker.io/library/eclipse-temurin:8@sha256:005d3189b2ec1612c3ade6eadabd1935c312f03aa7905cf0528e9d71980ad512
#4 resolve docker.io/library/eclipse-temurin:8@sha256:005d3189b2ec1612c3ade6eadabd1935c312f03aa7905cf0528e9d71980ad512 0.0s done
#4 CACHED
#5 [internal] load build context
#5 transferring context: 46.89MB 0.4s done
#5 DONE 0.4s
#6 [ 2/16] ADD target/slf4j-api.jar /opt/apache/beam/jars/
#6 DONE 2.3s
#7 [ 3/16] ADD target/slf4j-jdk14.jar /opt/apache/beam/jars/
#7 DONE 0.2s
#8 [ 4/16] ADD target/jcl-over-slf4j.jar /opt/apache/beam/jars/
#8 DONE 0.1s
#9 [ 5/16] ADD target/log4j-over-slf4j.jar /opt/apache/beam/jars/
#9 DONE 0.1s
#10 [ 6/16] ADD target/log4j-to-slf4j.jar /opt/apache/beam/jars/
#10 DONE 0.1s
#11 [ 7/16] ADD target/beam-sdks-java-harness.jar /opt/apache/beam/jars/
#11 DONE 0.1s
#12 [ 8/16] COPY target/jamm.jar target/open-module-agent*.jar /opt/apache/beam/jars/
#12 DONE 0.1s
#13 [ 9/16] COPY target/linux_amd64/boot /opt/apache/beam/
#13 DONE 0.2s
#14 [10/16] COPY target/LICENSE /opt/apache/beam/
#14 DONE 0.1s
#15 [11/16] COPY target/NOTICE /opt/apache/beam/
#15 DONE 0.1s
#16 [12/16] ADD target/third_party_licenses /opt/apache/beam/third_party_licenses/
#16 DONE 0.3s
#17 [13/16] COPY target/LICENSE target/options/* /opt/apache/beam/options/
#17 DONE 0.1s
#18 [14/16] COPY target/go-licenses/* /opt/apache/beam/third_party_licenses/golang/
#18 DONE 0.1s
#19 [15/16] RUN if [ "true" = "false" ] ; then rm -rf /opt/apache/beam/third_party_licenses ; fi
#19 DONE 0.3s
#20 [16/16] COPY target/profiler/* /opt/google_cloud_profiler/
#20 DONE 0.1s
#21 exporting to image
#21 exporting layers
#21 exporting layers 0.2s done
#21 writing image sha256:595d557ab45b6a518e846cd72c0a3ef0c788e21b00681a3a4d6213eb5e5934de done
#21 naming to docker.io/apache/beam_java8_sdk:2.48.0.dev done
#21 DONE 0.2s
> Task :runners:google-cloud-dataflow-java:buildAndPushDockerJavaContainer
WARNING: `gcloud docker` will not be supported for Docker client versions above 18.03.
As an alternative, use `gcloud auth configure-docker` to configure `docker` to
use `gcloud` as a credential helper, then use `docker` as you would for non-GCR
registries, e.g. `docker pull gcr.io/project-id/my-image`. Add
`--verbosity=error` to silence this warning: `gcloud docker
--verbosity=error -- pull gcr.io/project-id/my-image`.
See: https://cloud.google.com/container-registry/docs/support/deprecation-notices#gcloud-docker
The push refers to repository [us.gcr.io/apache-beam-testing/java-postcommit-it/java]
c961991bab35: Preparing
5f70bf18a086: Preparing
f44ffe526170: Preparing
38da482fdb88: Preparing
203958e6292f: Preparing
f597082ffe54: Preparing
769241135ec0: Preparing
46146030e1b4: Preparing
032081a932ac: Preparing
a40cc4b9d16b: Preparing
819637b1ee80: Preparing
99fc4dd62824: Preparing
6c58149890f2: Preparing
eaefecf8fa42: Preparing
68422e0d1d2d: Preparing
533af4d05d89: Preparing
d09fdd9ad3ef: Preparing
769241135ec0: Waiting
04d1dcab20cb: Preparing
46146030e1b4: Waiting
b93c1bd012ab: Preparing
819637b1ee80: Waiting
99fc4dd62824: Waiting
533af4d05d89: Waiting
032081a932ac: Waiting
d09fdd9ad3ef: Waiting
6c58149890f2: Waiting
a40cc4b9d16b: Waiting
04d1dcab20cb: Waiting
eaefecf8fa42: Waiting
68422e0d1d2d: Waiting
b93c1bd012ab: Waiting
5f70bf18a086: Layer already exists
38da482fdb88: Pushed
f597082ffe54: Pushed
f44ffe526170: Pushed
c961991bab35: Pushed
203958e6292f: Pushed
769241135ec0: Pushed
032081a932ac: Pushed
819637b1ee80: Pushed
46146030e1b4: Pushed
a40cc4b9d16b: Pushed
533af4d05d89: Layer already exists
d09fdd9ad3ef: Layer already exists
04d1dcab20cb: Layer already exists
b93c1bd012ab: Layer already exists
99fc4dd62824: Pushed
6c58149890f2: Pushed
eaefecf8fa42: Pushed
68422e0d1d2d: Pushed
20230412095740: digest: sha256:e68d7feac964a5172dff24a7135dc3f392cd4b79c252a8836ebd1b64f11e507d size: 4296
> Task :runners:google-cloud-dataflow-java:coreSDKJavaRunnerV2IntegrationTest NO-SOURCE
> Task :runners:google-cloud-dataflow-java:examplesJavaRunnerV2IntegrationTest
***********************************************************
***********************************************************
**********************Set Up Pubsub************************
The Pub/Sub topic has been set up for this example: projects/apache-beam-testing/topics/testpipeline-jenkins-0412095832-b5eaf291
The Pub/Sub subscription has been set up for this example: projects/apache-beam-testing/subscriptions/testpipeline-jenkins-0412095832-b5eaf291
*************************Tear Down*************************
The Pub/Sub topic has been deleted: projects/apache-beam-testing/topics/testpipeline-jenkins-0412095832-b5eaf291
The Pub/Sub subscription has been deleted: projects/apache-beam-testing/subscriptions/testpipeline-jenkins-0412095832-b5eaf291
***********************************************************
***********************************************************
***********************************************************
***********************************************************
**********************Set Up Pubsub************************
The Pub/Sub topic has been set up for this example: projects/apache-beam-testing/topics/testpipeline-jenkins-0412095832-ac3630eb
The Pub/Sub subscription has been set up for this example: projects/apache-beam-testing/subscriptions/testpipeline-jenkins-0412095832-ac3630eb
*************************Tear Down*************************
The Pub/Sub topic has been deleted: projects/apache-beam-testing/topics/testpipeline-jenkins-0412095832-ac3630eb
The Pub/Sub subscription has been deleted: projects/apache-beam-testing/subscriptions/testpipeline-jenkins-0412095832-ac3630eb
***********************************************************
***********************************************************
> Task :runners:google-cloud-dataflow-java:googleCloudPlatformRunnerV2IntegrationTest
org.apache.beam.sdk.io.gcp.spanner.SpannerReadIT > testReadWithDataBoost FAILED
java.lang.RuntimeException at SpannerReadIT.java:214
87 tests completed, 1 failed, 2 skipped
> Task :runners:google-cloud-dataflow-java:googleCloudPlatformRunnerV2IntegrationTest FAILED
> Task :runners:google-cloud-dataflow-java:cleanUpDockerJavaImages
Untagged: us.gcr.io/apache-beam-testing/java-postcommit-it/java:20230412095740
Untagged: us.gcr.io/apache-beam-testing/java-postcommit-it/java@sha256:e68d7feac964a5172dff24a7135dc3f392cd4b79c252a8836ebd1b64f11e507d
Deleted: sha256:595d557ab45b6a518e846cd72c0a3ef0c788e21b00681a3a4d6213eb5e5934de
WARNING: Successfully resolved tag to sha256, but it is recommended to use sha256 directly.
Tag: [us.gcr.io/apache-beam-testing/java-postcommit-it/java:20230412095740]
- referencing digest: [us.gcr.io/apache-beam-testing/java-postcommit-it/java@sha256:e68d7feac964a5172dff24a7135dc3f392cd4b79c252a8836ebd1b64f11e507d]
Deleted [[us.gcr.io/apache-beam-testing/java-postcommit-it/java:20230412095740] (referencing [us.gcr.io/apache-beam-testing/java-postcommit-it/java@sha256:e68d7feac964a5172dff24a7135dc3f392cd4b79c252a8836ebd1b64f11e507d])].
Removing untagged image us.gcr.io/apache-beam-testing/java-postcommit-it/java@sha256:e68d7feac964a5172dff24a7135dc3f392cd4b79c252a8836ebd1b64f11e507d
Digests:
- us.gcr.io/apache-beam-testing/java-postcommit-it/java@sha256:e68d7feac964a5172dff24a7135dc3f392cd4b79c252a8836ebd1b64f11e507d
Deleted [us.gcr.io/apache-beam-testing/java-postcommit-it/java@sha256:e68d7feac964a5172dff24a7135dc3f392cd4b79c252a8836ebd1b64f11e507d].
FAILURE: Build failed with an exception.
* What went wrong:
Execution failed for task ':runners:google-cloud-dataflow-java:googleCloudPlatformRunnerV2IntegrationTest'.
> There were failing tests. See the report at: file://<https://ci-beam.apache.org/job/beam_PostCommit_Java_DataflowV2/ws/src/runners/google-cloud-dataflow-java/build/reports/tests/googleCloudPlatformRunnerV2IntegrationTest/index.html>
* Try:
> Run with --stacktrace option to get the stack trace.
> Run with --info or --debug option to get more log output.
* Get more help at https://help.gradle.org
Deprecated Gradle features were used in this build, making it incompatible with Gradle 8.0.
You can use '--warning-mode all' to show the individual deprecation warnings and determine if they come from your own scripts or plugins.
See https://docs.gradle.org/7.5.1/userguide/command_line_interface.html#sec:command_line_warnings
Execution optimizations have been disabled for 1 invalid unit(s) of work during this build to ensure correctness.
Please consult deprecation warnings for more details.
BUILD FAILED in 3h 14m 24s
152 actionable tasks: 98 executed, 50 from cache, 4 up-to-date
Publishing build scan...
https://gradle.com/s/e5mvrvyebipnq
Build step 'Invoke Gradle script' changed build result to FAILURE
Build step 'Invoke Gradle script' marked build as failure
---------------------------------------------------------------------
To unsubscribe, e-mail: builds-unsubscribe@beam.apache.org
For additional commands, e-mail: builds-help@beam.apache.org
Build failed in Jenkins: beam_PostCommit_Java_DataflowV2 #2910
Posted by Apache Jenkins Server <je...@builds.apache.org>.
See <https://ci-beam.apache.org/job/beam_PostCommit_Java_DataflowV2/2910/display/redirect>
Changes:
------------------------------------------
[...truncated 62.56 KB...]
INFO:root:pull_licenses_java.py succeed. It took 1.385558 seconds with 16 threads.
Copying licenses from <https://ci-beam.apache.org/job/beam_PostCommit_Java_DataflowV2/ws/src/sdks/java/container/build/target/java_third_party_licenses> to <https://ci-beam.apache.org/job/beam_PostCommit_Java_DataflowV2/ws/src/sdks/java/container/build/target/third_party_licenses.>
Finished license_scripts.sh
> Task :sdks:java:container:goPrepare UP-TO-DATE
> Task :sdks:java:container:java8:copyJavaThirdPartyLicenses
> Task :release:go-licenses:java:dockerRun
W0412 03:57:59.868545 83 library.go:101] "golang.org/x/sys/unix" contains non-Go code that can't be inspected for further dependencies:
/go/pkg/mod/golang.org/x/sys@v0.5.0/unix/asm_linux_amd64.s
> Task :sdks:java:container:goBuild
/home/jenkins/go/bin/go1.20.2 build -o ./build/target/linux_amd64/boot boot.go boot_test.go pathingjar.go pathingjar_test.go
> Task :sdks:java:container:java8:copySdkHarnessLauncher
Execution optimizations have been disabled for task ':sdks:java:container:java8:copySdkHarnessLauncher' to ensure correctness due to the following reasons:
- Gradle detected a problem with the following location: '<https://ci-beam.apache.org/job/beam_PostCommit_Java_DataflowV2/ws/src/sdks/java/container/build/target'.> Reason: Task ':sdks:java:container:java8:copySdkHarnessLauncher' uses this output of task ':sdks:java:container:downloadCloudProfilerAgent' without declaring an explicit or implicit dependency. This can lead to incorrect results being produced, depending on what order the tasks are executed. Please refer to https://docs.gradle.org/7.5.1/userguide/validation_problems.html#implicit_dependency for more details about this problem.
- Gradle detected a problem with the following location: '<https://ci-beam.apache.org/job/beam_PostCommit_Java_DataflowV2/ws/src/sdks/java/container/build/target'.> Reason: Task ':sdks:java:container:java8:copySdkHarnessLauncher' uses this output of task ':sdks:java:container:pullLicenses' without declaring an explicit or implicit dependency. This can lead to incorrect results being produced, depending on what order the tasks are executed. Please refer to https://docs.gradle.org/7.5.1/userguide/validation_problems.html#implicit_dependency for more details about this problem.
> Task :release:go-licenses:java:dockerRun
github.com/apache/beam/sdks/v2/go/pkg/beam,https://github.com/apache/beam/blob/sdks/v2.46.0/sdks/go/README.md,Apache-2.0
github.com/apache/beam/sdks/v2/java/container,https://github.com/apache/beam/blob/sdks/v2.46.0/sdks/LICENSE,Apache-2.0
github.com/golang/protobuf,https://github.com/golang/protobuf/blob/v1.5.2/LICENSE,BSD-3-Clause
golang.org/x/net,https://cs.opensource.google/go/x/net/+/v0.5.0:LICENSE,BSD-3-Clause
golang.org/x/sys/unix,https://cs.opensource.google/go/x/sys/+/v0.5.0:LICENSE,BSD-3-Clause
golang.org/x/text,https://cs.opensource.google/go/x/text/+/v0.7.0:LICENSE,BSD-3-Clause
google.golang.org/genproto/googleapis/rpc/status,https://github.com/googleapis/go-genproto/blob/76db0878b65f/LICENSE,Apache-2.0
google.golang.org/grpc,https://github.com/grpc/grpc-go/blob/v1.52.3/LICENSE,Apache-2.0
google.golang.org/protobuf,https://github.com/protocolbuffers/protobuf-go/blob/v1.28.1/LICENSE,BSD-3-Clause
+ chmod -R a+w /output/licenses
> Task :release:go-licenses:java:createLicenses
> Task :sdks:java:container:java8:copyGolangLicenses
> Task :sdks:java:container:java8:dockerPrepare
> Task :sdks:java:container:java8:docker
#1 [internal] load build definition from Dockerfile
#1 transferring dockerfile: 2.58kB done
#1 DONE 0.0s
#2 [internal] load .dockerignore
#2 transferring context: 2B done
#2 DONE 0.0s
#3 [internal] load metadata for docker.io/library/eclipse-temurin:8
#3 DONE 0.3s
#4 [ 1/16] FROM docker.io/library/eclipse-temurin:8@sha256:005d3189b2ec1612c3ade6eadabd1935c312f03aa7905cf0528e9d71980ad512
#4 resolve docker.io/library/eclipse-temurin:8@sha256:005d3189b2ec1612c3ade6eadabd1935c312f03aa7905cf0528e9d71980ad512 0.0s done
#4 CACHED
#5 [internal] load build context
#5 transferring context: 46.89MB 0.4s done
#5 DONE 0.4s
#6 [ 2/16] ADD target/slf4j-api.jar /opt/apache/beam/jars/
#6 DONE 1.1s
#7 [ 3/16] ADD target/slf4j-jdk14.jar /opt/apache/beam/jars/
#7 DONE 0.1s
#8 [ 4/16] ADD target/jcl-over-slf4j.jar /opt/apache/beam/jars/
#8 DONE 0.1s
#9 [ 5/16] ADD target/log4j-over-slf4j.jar /opt/apache/beam/jars/
#9 DONE 0.1s
#10 [ 6/16] ADD target/log4j-to-slf4j.jar /opt/apache/beam/jars/
#10 DONE 0.1s
#11 [ 7/16] ADD target/beam-sdks-java-harness.jar /opt/apache/beam/jars/
#11 DONE 0.1s
#12 [ 8/16] COPY target/jamm.jar target/open-module-agent*.jar /opt/apache/beam/jars/
#12 DONE 0.1s
#13 [ 9/16] COPY target/linux_amd64/boot /opt/apache/beam/
#13 DONE 0.2s
#14 [10/16] COPY target/LICENSE /opt/apache/beam/
#14 DONE 0.1s
#15 [11/16] COPY target/NOTICE /opt/apache/beam/
#15 DONE 0.1s
#16 [12/16] ADD target/third_party_licenses /opt/apache/beam/third_party_licenses/
#16 DONE 0.2s
#17 [13/16] COPY target/LICENSE target/options/* /opt/apache/beam/options/
#17 DONE 0.1s
#18 [14/16] COPY target/go-licenses/* /opt/apache/beam/third_party_licenses/golang/
#18 DONE 0.1s
#19 [15/16] RUN if [ "true" = "false" ] ; then rm -rf /opt/apache/beam/third_party_licenses ; fi
#19 DONE 0.3s
#20 [16/16] COPY target/profiler/* /opt/google_cloud_profiler/
#20 DONE 0.1s
#21 exporting to image
#21 exporting layers
#21 exporting layers 0.2s done
#21 writing image sha256:c31e3a9c39138cdce2dc2a3324f8e5683e76682ebc858fbebeba7c049041661d done
#21 naming to docker.io/apache/beam_java8_sdk:2.48.0.dev done
#21 DONE 0.2s
> Task :runners:google-cloud-dataflow-java:buildAndPushDockerJavaContainer
WARNING: `gcloud docker` will not be supported for Docker client versions above 18.03.
As an alternative, use `gcloud auth configure-docker` to configure `docker` to
use `gcloud` as a credential helper, then use `docker` as you would for non-GCR
registries, e.g. `docker pull gcr.io/project-id/my-image`. Add
`--verbosity=error` to silence this warning: `gcloud docker
--verbosity=error -- pull gcr.io/project-id/my-image`.
See: https://cloud.google.com/container-registry/docs/support/deprecation-notices#gcloud-docker
The push refers to repository [us.gcr.io/apache-beam-testing/java-postcommit-it/java]
275dfd5317d1: Preparing
5f70bf18a086: Preparing
df7a06d97f73: Preparing
1d52524ad1f6: Preparing
de20933e7e6b: Preparing
e79668b3e990: Preparing
5c46ab5f10d9: Preparing
4423ad9bb3ed: Preparing
ce11392e6065: Preparing
228156c72e6a: Preparing
0732c73097eb: Preparing
39523acf3f71: Preparing
5efe70f4167c: Preparing
5df617156efb: Preparing
787a24ecee8d: Preparing
533af4d05d89: Preparing
d09fdd9ad3ef: Preparing
04d1dcab20cb: Preparing
b93c1bd012ab: Preparing
5df617156efb: Waiting
0732c73097eb: Waiting
4423ad9bb3ed: Waiting
39523acf3f71: Waiting
ce11392e6065: Waiting
e79668b3e990: Waiting
787a24ecee8d: Waiting
228156c72e6a: Waiting
d09fdd9ad3ef: Waiting
533af4d05d89: Waiting
5c46ab5f10d9: Waiting
04d1dcab20cb: Waiting
b93c1bd012ab: Waiting
5f70bf18a086: Layer already exists
1d52524ad1f6: Pushed
df7a06d97f73: Pushed
e79668b3e990: Pushed
275dfd5317d1: Pushed
de20933e7e6b: Pushed
5c46ab5f10d9: Pushed
ce11392e6065: Pushed
0732c73097eb: Pushed
4423ad9bb3ed: Pushed
228156c72e6a: Pushed
533af4d05d89: Layer already exists
d09fdd9ad3ef: Layer already exists
39523acf3f71: Pushed
04d1dcab20cb: Layer already exists
b93c1bd012ab: Layer already exists
5efe70f4167c: Pushed
5df617156efb: Pushed
787a24ecee8d: Pushed
20230412035738: digest: sha256:b233af0a69d90b89586278694fb4e431518fad6fa6256107ad32e23162b626c0 size: 4296
> Task :runners:google-cloud-dataflow-java:coreSDKJavaRunnerV2IntegrationTest NO-SOURCE
> Task :runners:google-cloud-dataflow-java:examplesJavaRunnerV2IntegrationTest
***********************************************************
***********************************************************
**********************Set Up Pubsub************************
The Pub/Sub topic has been set up for this example: projects/apache-beam-testing/topics/testpipeline-jenkins-0412035827-32c36f68
The Pub/Sub subscription has been set up for this example: projects/apache-beam-testing/subscriptions/testpipeline-jenkins-0412035827-32c36f68
*************************Tear Down*************************
The Pub/Sub topic has been deleted: projects/apache-beam-testing/topics/testpipeline-jenkins-0412035827-32c36f68
The Pub/Sub subscription has been deleted: projects/apache-beam-testing/subscriptions/testpipeline-jenkins-0412035827-32c36f68
***********************************************************
***********************************************************
***********************************************************
***********************************************************
**********************Set Up Pubsub************************
The Pub/Sub topic has been set up for this example: projects/apache-beam-testing/topics/testpipeline-jenkins-0412035827-3ca688e8
The Pub/Sub subscription has been set up for this example: projects/apache-beam-testing/subscriptions/testpipeline-jenkins-0412035827-3ca688e8
*************************Tear Down*************************
The Pub/Sub topic has been deleted: projects/apache-beam-testing/topics/testpipeline-jenkins-0412035827-3ca688e8
The Pub/Sub subscription has been deleted: projects/apache-beam-testing/subscriptions/testpipeline-jenkins-0412035827-3ca688e8
***********************************************************
***********************************************************
> Task :runners:google-cloud-dataflow-java:googleCloudPlatformRunnerV2IntegrationTest
org.apache.beam.sdk.io.gcp.spanner.SpannerReadIT > testReadWithDataBoost FAILED
java.lang.RuntimeException at SpannerReadIT.java:214
87 tests completed, 1 failed, 2 skipped
> Task :runners:google-cloud-dataflow-java:googleCloudPlatformRunnerV2IntegrationTest FAILED
> Task :runners:google-cloud-dataflow-java:cleanUpDockerJavaImages
Untagged: us.gcr.io/apache-beam-testing/java-postcommit-it/java:20230412035738
Untagged: us.gcr.io/apache-beam-testing/java-postcommit-it/java@sha256:b233af0a69d90b89586278694fb4e431518fad6fa6256107ad32e23162b626c0
Deleted: sha256:c31e3a9c39138cdce2dc2a3324f8e5683e76682ebc858fbebeba7c049041661d
WARNING: Successfully resolved tag to sha256, but it is recommended to use sha256 directly.
Tag: [us.gcr.io/apache-beam-testing/java-postcommit-it/java:20230412035738]
- referencing digest: [us.gcr.io/apache-beam-testing/java-postcommit-it/java@sha256:b233af0a69d90b89586278694fb4e431518fad6fa6256107ad32e23162b626c0]
Deleted [[us.gcr.io/apache-beam-testing/java-postcommit-it/java:20230412035738] (referencing [us.gcr.io/apache-beam-testing/java-postcommit-it/java@sha256:b233af0a69d90b89586278694fb4e431518fad6fa6256107ad32e23162b626c0])].
Removing untagged image us.gcr.io/apache-beam-testing/java-postcommit-it/java@sha256:b233af0a69d90b89586278694fb4e431518fad6fa6256107ad32e23162b626c0
Digests:
- us.gcr.io/apache-beam-testing/java-postcommit-it/java@sha256:b233af0a69d90b89586278694fb4e431518fad6fa6256107ad32e23162b626c0
Deleted [us.gcr.io/apache-beam-testing/java-postcommit-it/java@sha256:b233af0a69d90b89586278694fb4e431518fad6fa6256107ad32e23162b626c0].
FAILURE: Build failed with an exception.
* What went wrong:
Execution failed for task ':runners:google-cloud-dataflow-java:googleCloudPlatformRunnerV2IntegrationTest'.
> There were failing tests. See the report at: file://<https://ci-beam.apache.org/job/beam_PostCommit_Java_DataflowV2/ws/src/runners/google-cloud-dataflow-java/build/reports/tests/googleCloudPlatformRunnerV2IntegrationTest/index.html>
* Try:
> Run with --stacktrace option to get the stack trace.
> Run with --info or --debug option to get more log output.
* Get more help at https://help.gradle.org
Deprecated Gradle features were used in this build, making it incompatible with Gradle 8.0.
You can use '--warning-mode all' to show the individual deprecation warnings and determine if they come from your own scripts or plugins.
See https://docs.gradle.org/7.5.1/userguide/command_line_interface.html#sec:command_line_warnings
Execution optimizations have been disabled for 1 invalid unit(s) of work during this build to ensure correctness.
Please consult deprecation warnings for more details.
BUILD FAILED in 3h 16m 41s
152 actionable tasks: 98 executed, 50 from cache, 4 up-to-date
Publishing build scan...
https://gradle.com/s/rurpbsbqs46mk
Build step 'Invoke Gradle script' changed build result to FAILURE
Build step 'Invoke Gradle script' marked build as failure
---------------------------------------------------------------------
To unsubscribe, e-mail: builds-unsubscribe@beam.apache.org
For additional commands, e-mail: builds-help@beam.apache.org
beam_PostCommit_Java_DataflowV2 - Build # 2909 - Aborted!
Posted by Apache Jenkins Server <je...@builds.apache.org>.
beam_PostCommit_Java_DataflowV2 - Build # 2909 - Aborted:
Check console output at https://ci-beam.apache.org/job/beam_PostCommit_Java_DataflowV2/2909/ to view the results.
Build failed in Jenkins: beam_PostCommit_Java_DataflowV2 #2907
Posted by Apache Jenkins Server <je...@builds.apache.org>.
See <https://ci-beam.apache.org/job/beam_PostCommit_Java_DataflowV2/2907/display/redirect>
Changes:
------------------------------------------
[...truncated 63.45 KB...]
> Task :release:go-licenses:java:dockerRun
go: downloading github.com/golang/protobuf v1.5.2
go: downloading google.golang.org/grpc v1.52.3
go: downloading google.golang.org/protobuf v1.28.1
go: downloading golang.org/x/sys v0.5.0
go: downloading google.golang.org/genproto v0.0.0-20230110181048-76db0878b65f
go: downloading golang.org/x/text v0.7.0
go: added github.com/apache/beam/sdks/v2 v2.46.0
go: added github.com/golang/protobuf v1.5.2
go: added golang.org/x/net v0.5.0
go: added golang.org/x/sys v0.5.0
go: added golang.org/x/text v0.7.0
go: added google.golang.org/genproto v0.0.0-20230110181048-76db0878b65f
go: added google.golang.org/grpc v1.52.3
go: added google.golang.org/protobuf v1.28.1
+ go-licenses save github.com/apache/beam/sdks/v2/java/container --save_path=/output/licenses
W0411 09:58:49.713040 40 library.go:101] "golang.org/x/sys/unix" contains non-Go code that can't be inspected for further dependencies:
/go/pkg/mod/golang.org/x/sys@v0.5.0/unix/asm_linux_amd64.s
+ go-licenses csv github.com/apache/beam/sdks/v2/java/container
+ tee /output/licenses/list.csv
W0411 09:58:54.646201 85 library.go:101] "golang.org/x/sys/unix" contains non-Go code that can't be inspected for further dependencies:
/go/pkg/mod/golang.org/x/sys@v0.5.0/unix/asm_linux_amd64.s
github.com/apache/beam/sdks/v2/go/pkg/beam,https://github.com/apache/beam/blob/sdks/v2.46.0/sdks/go/README.md,Apache-2.0
github.com/apache/beam/sdks/v2/java/container,https://github.com/apache/beam/blob/sdks/v2.46.0/sdks/LICENSE,Apache-2.0
github.com/golang/protobuf,https://github.com/golang/protobuf/blob/v1.5.2/LICENSE,BSD-3-Clause
golang.org/x/net,https://cs.opensource.google/go/x/net/+/v0.5.0:LICENSE,BSD-3-Clause
golang.org/x/sys/unix,https://cs.opensource.google/go/x/sys/+/v0.5.0:LICENSE,BSD-3-Clause
golang.org/x/text,https://cs.opensource.google/go/x/text/+/v0.7.0:LICENSE,BSD-3-Clause
google.golang.org/genproto/googleapis/rpc/status,https://github.com/googleapis/go-genproto/blob/76db0878b65f/LICENSE,Apache-2.0
google.golang.org/grpc,https://github.com/grpc/grpc-go/blob/v1.52.3/LICENSE,Apache-2.0
google.golang.org/protobuf,https://github.com/protocolbuffers/protobuf-go/blob/v1.28.1/LICENSE,BSD-3-Clause
+ chmod -R a+w /output/licenses
> Task :release:go-licenses:java:createLicenses
> Task :sdks:java:container:java8:copyGolangLicenses
> Task :sdks:java:container:java8:dockerPrepare
> Task :sdks:java:container:java8:docker
#1 [internal] load build definition from Dockerfile
#1 transferring dockerfile: 2.58kB done
#1 DONE 0.0s
#2 [internal] load .dockerignore
#2 transferring context: 2B done
#2 DONE 0.0s
#3 [internal] load metadata for docker.io/library/eclipse-temurin:8
#3 DONE 0.0s
#4 [ 1/16] FROM docker.io/library/eclipse-temurin:8@sha256:005d3189b2ec1612c3ade6eadabd1935c312f03aa7905cf0528e9d71980ad512
#4 resolve docker.io/library/eclipse-temurin:8@sha256:005d3189b2ec1612c3ade6eadabd1935c312f03aa7905cf0528e9d71980ad512 0.0s done
#4 CACHED
#5 [internal] load build context
#5 transferring context: 46.73MB 0.5s done
#5 DONE 0.5s
#6 [ 2/16] ADD target/slf4j-api.jar /opt/apache/beam/jars/
#6 DONE 4.6s
#7 [ 3/16] ADD target/slf4j-jdk14.jar /opt/apache/beam/jars/
#7 DONE 0.1s
#8 [ 4/16] ADD target/jcl-over-slf4j.jar /opt/apache/beam/jars/
#8 DONE 0.1s
#9 [ 5/16] ADD target/log4j-over-slf4j.jar /opt/apache/beam/jars/
#9 DONE 0.1s
#10 [ 6/16] ADD target/log4j-to-slf4j.jar /opt/apache/beam/jars/
#10 DONE 0.1s
#11 [ 7/16] ADD target/beam-sdks-java-harness.jar /opt/apache/beam/jars/
#11 DONE 0.1s
#12 [ 8/16] COPY target/jamm.jar target/open-module-agent*.jar /opt/apache/beam/jars/
#12 DONE 0.1s
#13 [ 9/16] COPY target/linux_amd64/boot /opt/apache/beam/
#13 DONE 0.4s
#14 [10/16] COPY target/LICENSE /opt/apache/beam/
#14 DONE 0.1s
#15 [11/16] COPY target/NOTICE /opt/apache/beam/
#15 DONE 0.1s
#16 [12/16] ADD target/third_party_licenses /opt/apache/beam/third_party_licenses/
#16 DONE 0.4s
#17 [13/16] COPY target/LICENSE target/options/* /opt/apache/beam/options/
#17 DONE 0.2s
#18 [14/16] COPY target/go-licenses/* /opt/apache/beam/third_party_licenses/golang/
#18 DONE 0.1s
#19 [15/16] RUN if [ "true" = "false" ] ; then rm -rf /opt/apache/beam/third_party_licenses ; fi
#19 DONE 0.5s
#20 [16/16] COPY target/profiler/* /opt/google_cloud_profiler/
#20 DONE 0.3s
#21 exporting to image
#21 exporting layers
#21 exporting layers 0.3s done
#21 writing image sha256:692ca5e06422a129821c29fc49868a224ac32646e6df482147c6828642347167 done
#21 naming to docker.io/apache/beam_java8_sdk:2.48.0.dev done
#21 DONE 0.3s
> Task :runners:google-cloud-dataflow-java:buildAndPushDockerJavaContainer
WARNING: `gcloud docker` will not be supported for Docker client versions above 18.03.
As an alternative, use `gcloud auth configure-docker` to configure `docker` to
use `gcloud` as a credential helper, then use `docker` as you would for non-GCR
registries, e.g. `docker pull gcr.io/project-id/my-image`. Add
`--verbosity=error` to silence this warning: `gcloud docker
--verbosity=error -- pull gcr.io/project-id/my-image`.
See: https://cloud.google.com/container-registry/docs/support/deprecation-notices#gcloud-docker
The push refers to repository [us.gcr.io/apache-beam-testing/java-postcommit-it/java]
9cad62499cae: Preparing
5f70bf18a086: Preparing
b0e68e300378: Preparing
398311cbd5e7: Preparing
fc6ca1b593b3: Preparing
22b44b5c861d: Preparing
43c8788bf4e7: Preparing
f2ac4357b66d: Preparing
5ddff777792f: Preparing
f6d88bde45f1: Preparing
27400bc9d77f: Preparing
1537bf266019: Preparing
5a78e3e324b9: Preparing
fd202d433eee: Preparing
67b474c1910e: Preparing
22b44b5c861d: Waiting
533af4d05d89: Preparing
d09fdd9ad3ef: Preparing
43c8788bf4e7: Waiting
04d1dcab20cb: Preparing
b93c1bd012ab: Preparing
f2ac4357b66d: Waiting
533af4d05d89: Waiting
5ddff777792f: Waiting
27400bc9d77f: Waiting
f6d88bde45f1: Waiting
1537bf266019: Waiting
b93c1bd012ab: Waiting
5a78e3e324b9: Waiting
fd202d433eee: Waiting
67b474c1910e: Waiting
5f70bf18a086: Layer already exists
b0e68e300378: Pushed
22b44b5c861d: Pushed
398311cbd5e7: Pushed
fc6ca1b593b3: Pushed
43c8788bf4e7: Pushed
5ddff777792f: Pushed
f6d88bde45f1: Pushed
f2ac4357b66d: Pushed
9cad62499cae: Pushed
27400bc9d77f: Pushed
533af4d05d89: Layer already exists
d09fdd9ad3ef: Layer already exists
04d1dcab20cb: Layer already exists
1537bf266019: Pushed
b93c1bd012ab: Layer already exists
5a78e3e324b9: Pushed
fd202d433eee: Pushed
67b474c1910e: Pushed
20230411095739: digest: sha256:6cee592bf0d0ba94fee61fe501f75766dda0cc2e9ab27811fd2dfdab493920f4 size: 4296
> Task :runners:google-cloud-dataflow-java:coreSDKJavaRunnerV2IntegrationTest NO-SOURCE
> Task :runners:google-cloud-dataflow-java:examplesJavaRunnerV2IntegrationTest
***********************************************************
***********************************************************
**********************Set Up Pubsub************************
The Pub/Sub topic has been set up for this example: projects/apache-beam-testing/topics/testpipeline-jenkins-0411095930-30063422
The Pub/Sub subscription has been set up for this example: projects/apache-beam-testing/subscriptions/testpipeline-jenkins-0411095930-30063422
*************************Tear Down*************************
The Pub/Sub topic has been deleted: projects/apache-beam-testing/topics/testpipeline-jenkins-0411095930-30063422
The Pub/Sub subscription has been deleted: projects/apache-beam-testing/subscriptions/testpipeline-jenkins-0411095930-30063422
***********************************************************
***********************************************************
***********************************************************
***********************************************************
**********************Set Up Pubsub************************
The Pub/Sub topic has been set up for this example: projects/apache-beam-testing/topics/testpipeline-jenkins-0411095930-f9cf76bb
The Pub/Sub subscription has been set up for this example: projects/apache-beam-testing/subscriptions/testpipeline-jenkins-0411095930-f9cf76bb
*************************Tear Down*************************
The Pub/Sub topic has been deleted: projects/apache-beam-testing/topics/testpipeline-jenkins-0411095930-f9cf76bb
The Pub/Sub subscription has been deleted: projects/apache-beam-testing/subscriptions/testpipeline-jenkins-0411095930-f9cf76bb
***********************************************************
***********************************************************
> Task :runners:google-cloud-dataflow-java:googleCloudPlatformRunnerV2IntegrationTest
org.apache.beam.sdk.io.gcp.spanner.SpannerReadIT > testReadWithDataBoost FAILED
java.lang.RuntimeException at SpannerReadIT.java:214
87 tests completed, 1 failed, 2 skipped
> Task :runners:google-cloud-dataflow-java:googleCloudPlatformRunnerV2IntegrationTest FAILED
> Task :runners:google-cloud-dataflow-java:cleanUpDockerJavaImages
Untagged: us.gcr.io/apache-beam-testing/java-postcommit-it/java:20230411095739
Untagged: us.gcr.io/apache-beam-testing/java-postcommit-it/java@sha256:6cee592bf0d0ba94fee61fe501f75766dda0cc2e9ab27811fd2dfdab493920f4
WARNING: Successfully resolved tag to sha256, but it is recommended to use sha256 directly.
Tag: [us.gcr.io/apache-beam-testing/java-postcommit-it/java:20230411095739]
- referencing digest: [us.gcr.io/apache-beam-testing/java-postcommit-it/java@sha256:6cee592bf0d0ba94fee61fe501f75766dda0cc2e9ab27811fd2dfdab493920f4]
Deleted [[us.gcr.io/apache-beam-testing/java-postcommit-it/java:20230411095739] (referencing [us.gcr.io/apache-beam-testing/java-postcommit-it/java@sha256:6cee592bf0d0ba94fee61fe501f75766dda0cc2e9ab27811fd2dfdab493920f4])].
Removing untagged image us.gcr.io/apache-beam-testing/java-postcommit-it/java@sha256:6cee592bf0d0ba94fee61fe501f75766dda0cc2e9ab27811fd2dfdab493920f4
Digests:
- us.gcr.io/apache-beam-testing/java-postcommit-it/java@sha256:6cee592bf0d0ba94fee61fe501f75766dda0cc2e9ab27811fd2dfdab493920f4
Deleted [us.gcr.io/apache-beam-testing/java-postcommit-it/java@sha256:6cee592bf0d0ba94fee61fe501f75766dda0cc2e9ab27811fd2dfdab493920f4].
FAILURE: Build failed with an exception.
* What went wrong:
Execution failed for task ':runners:google-cloud-dataflow-java:googleCloudPlatformRunnerV2IntegrationTest'.
> There were failing tests. See the report at: file://<https://ci-beam.apache.org/job/beam_PostCommit_Java_DataflowV2/ws/src/runners/google-cloud-dataflow-java/build/reports/tests/googleCloudPlatformRunnerV2IntegrationTest/index.html>
* Try:
> Run with --stacktrace option to get the stack trace.
> Run with --info or --debug option to get more log output.
* Get more help at https://help.gradle.org
Deprecated Gradle features were used in this build, making it incompatible with Gradle 8.0.
You can use '--warning-mode all' to show the individual deprecation warnings and determine if they come from your own scripts or plugins.
See https://docs.gradle.org/7.5.1/userguide/command_line_interface.html#sec:command_line_warnings
Execution optimizations have been disabled for 1 invalid unit(s) of work during this build to ensure correctness.
Please consult deprecation warnings for more details.
BUILD FAILED in 3h 20m 3s
152 actionable tasks: 98 executed, 50 from cache, 4 up-to-date
Publishing build scan...
https://gradle.com/s/2lnvlni4t4sus
Build step 'Invoke Gradle script' changed build result to FAILURE
Build step 'Invoke Gradle script' marked build as failure
---------------------------------------------------------------------
To unsubscribe, e-mail: builds-unsubscribe@beam.apache.org
For additional commands, e-mail: builds-help@beam.apache.org
Build failed in Jenkins: beam_PostCommit_Java_DataflowV2 #2906
Posted by Apache Jenkins Server <je...@builds.apache.org>.
See <https://ci-beam.apache.org/job/beam_PostCommit_Java_DataflowV2/2906/display/redirect>
Changes:
------------------------------------------
[...truncated 62.44 KB...]
W0411 03:57:54.763280 38 library.go:101] "golang.org/x/sys/unix" contains non-Go code that can't be inspected for further dependencies:
/go/pkg/mod/golang.org/x/sys@v0.5.0/unix/asm_linux_amd64.s
+ go-licenses csv github.com/apache/beam/sdks/v2/java/container
+ tee /output/licenses/list.csv
> Task :sdks:java:container:java8:copyJavaThirdPartyLicenses
> Task :sdks:java:container:goBuild
/home/jenkins/go/bin/go1.20.2 build -o ./build/target/linux_amd64/boot boot.go boot_test.go
> Task :release:go-licenses:java:dockerRun
W0411 03:57:58.889519 83 library.go:101] "golang.org/x/sys/unix" contains non-Go code that can't be inspected for further dependencies:
/go/pkg/mod/golang.org/x/sys@v0.5.0/unix/asm_linux_amd64.s
> Task :sdks:java:container:java8:copySdkHarnessLauncher
Execution optimizations have been disabled for task ':sdks:java:container:java8:copySdkHarnessLauncher' to ensure correctness due to the following reasons:
- Gradle detected a problem with the following location: '<https://ci-beam.apache.org/job/beam_PostCommit_Java_DataflowV2/ws/src/sdks/java/container/build/target'.> Reason: Task ':sdks:java:container:java8:copySdkHarnessLauncher' uses this output of task ':sdks:java:container:downloadCloudProfilerAgent' without declaring an explicit or implicit dependency. This can lead to incorrect results being produced, depending on what order the tasks are executed. Please refer to https://docs.gradle.org/7.5.1/userguide/validation_problems.html#implicit_dependency for more details about this problem.
- Gradle detected a problem with the following location: '<https://ci-beam.apache.org/job/beam_PostCommit_Java_DataflowV2/ws/src/sdks/java/container/build/target'.> Reason: Task ':sdks:java:container:java8:copySdkHarnessLauncher' uses this output of task ':sdks:java:container:pullLicenses' without declaring an explicit or implicit dependency. This can lead to incorrect results being produced, depending on what order the tasks are executed. Please refer to https://docs.gradle.org/7.5.1/userguide/validation_problems.html#implicit_dependency for more details about this problem.
> Task :release:go-licenses:java:dockerRun
github.com/apache/beam/sdks/v2/go/pkg/beam,https://github.com/apache/beam/blob/sdks/v2.46.0/sdks/go/README.md,Apache-2.0
github.com/apache/beam/sdks/v2/java/container,https://github.com/apache/beam/blob/sdks/v2.46.0/sdks/LICENSE,Apache-2.0
github.com/golang/protobuf,https://github.com/golang/protobuf/blob/v1.5.2/LICENSE,BSD-3-Clause
golang.org/x/net,https://cs.opensource.google/go/x/net/+/v0.5.0:LICENSE,BSD-3-Clause
golang.org/x/sys/unix,https://cs.opensource.google/go/x/sys/+/v0.5.0:LICENSE,BSD-3-Clause
golang.org/x/text,https://cs.opensource.google/go/x/text/+/v0.7.0:LICENSE,BSD-3-Clause
google.golang.org/genproto/googleapis/rpc/status,https://github.com/googleapis/go-genproto/blob/76db0878b65f/LICENSE,Apache-2.0
google.golang.org/grpc,https://github.com/grpc/grpc-go/blob/v1.52.3/LICENSE,Apache-2.0
google.golang.org/protobuf,https://github.com/protocolbuffers/protobuf-go/blob/v1.28.1/LICENSE,BSD-3-Clause
+ chmod -R a+w /output/licenses
> Task :release:go-licenses:java:createLicenses
> Task :sdks:java:container:java8:copyGolangLicenses
> Task :sdks:java:container:java8:dockerPrepare
> Task :sdks:java:container:java8:docker
#1 [internal] load build definition from Dockerfile
#1 transferring dockerfile: 2.58kB done
#1 DONE 0.1s
#2 [internal] load .dockerignore
#2 transferring context: 2B done
#2 DONE 0.1s
#3 [internal] load metadata for docker.io/library/eclipse-temurin:8
#3 DONE 0.3s
#4 [ 1/16] FROM docker.io/library/eclipse-temurin:8@sha256:005d3189b2ec1612c3ade6eadabd1935c312f03aa7905cf0528e9d71980ad512
#4 resolve docker.io/library/eclipse-temurin:8@sha256:005d3189b2ec1612c3ade6eadabd1935c312f03aa7905cf0528e9d71980ad512 0.0s done
#4 CACHED
#5 [internal] load build context
#5 transferring context: 46.73MB 0.3s done
#5 DONE 0.3s
#6 [ 2/16] ADD target/slf4j-api.jar /opt/apache/beam/jars/
#6 DONE 1.1s
#7 [ 3/16] ADD target/slf4j-jdk14.jar /opt/apache/beam/jars/
#7 DONE 0.1s
#8 [ 4/16] ADD target/jcl-over-slf4j.jar /opt/apache/beam/jars/
#8 DONE 0.1s
#9 [ 5/16] ADD target/log4j-over-slf4j.jar /opt/apache/beam/jars/
#9 DONE 0.1s
#10 [ 6/16] ADD target/log4j-to-slf4j.jar /opt/apache/beam/jars/
#10 DONE 0.1s
#11 [ 7/16] ADD target/beam-sdks-java-harness.jar /opt/apache/beam/jars/
#11 DONE 0.1s
#12 [ 8/16] COPY target/jamm.jar target/open-module-agent*.jar /opt/apache/beam/jars/
#12 DONE 0.2s
#13 [ 9/16] COPY target/linux_amd64/boot /opt/apache/beam/
#13 DONE 0.2s
#14 [10/16] COPY target/LICENSE /opt/apache/beam/
#14 DONE 0.1s
#15 [11/16] COPY target/NOTICE /opt/apache/beam/
#15 DONE 0.1s
#16 [12/16] ADD target/third_party_licenses /opt/apache/beam/third_party_licenses/
#16 DONE 0.3s
#17 [13/16] COPY target/LICENSE target/options/* /opt/apache/beam/options/
#17 DONE 0.1s
#18 [14/16] COPY target/go-licenses/* /opt/apache/beam/third_party_licenses/golang/
#18 DONE 0.1s
#19 [15/16] RUN if [ "true" = "false" ] ; then rm -rf /opt/apache/beam/third_party_licenses ; fi
#19 DONE 0.3s
#20 [16/16] COPY target/profiler/* /opt/google_cloud_profiler/
#20 DONE 0.2s
#21 exporting to image
#21 exporting layers
#21 exporting layers 0.3s done
#21 writing image sha256:22794ccd32e16b61861e6739e0b9b1ab62c9811c003ad0cfd622b35ba75aae9d done
#21 naming to docker.io/apache/beam_java8_sdk:2.48.0.dev done
#21 DONE 0.3s
> Task :runners:google-cloud-dataflow-java:buildAndPushDockerJavaContainer
WARNING: `gcloud docker` will not be supported for Docker client versions above 18.03.
As an alternative, use `gcloud auth configure-docker` to configure `docker` to
use `gcloud` as a credential helper, then use `docker` as you would for non-GCR
registries, e.g. `docker pull gcr.io/project-id/my-image`. Add
`--verbosity=error` to silence this warning: `gcloud docker
--verbosity=error -- pull gcr.io/project-id/my-image`.
See: https://cloud.google.com/container-registry/docs/support/deprecation-notices#gcloud-docker
The push refers to repository [us.gcr.io/apache-beam-testing/java-postcommit-it/java]
d39990a0e1fd: Preparing
5f70bf18a086: Preparing
35597c473f57: Preparing
2a0d5ae1b188: Preparing
1d27fb1ba2b1: Preparing
b725c955b8c1: Preparing
6788f77dbde9: Preparing
9b8818d61dd3: Preparing
0ced054245de: Preparing
689376ef0c5c: Preparing
3a1e5ba350fe: Preparing
509153ef3076: Preparing
db6da8bc2146: Preparing
8ee3cfc6451a: Preparing
b465b47c430a: Preparing
533af4d05d89: Preparing
d09fdd9ad3ef: Preparing
04d1dcab20cb: Preparing
b93c1bd012ab: Preparing
689376ef0c5c: Waiting
3a1e5ba350fe: Waiting
8ee3cfc6451a: Waiting
509153ef3076: Waiting
db6da8bc2146: Waiting
b465b47c430a: Waiting
9b8818d61dd3: Waiting
533af4d05d89: Waiting
b725c955b8c1: Waiting
d09fdd9ad3ef: Waiting
b93c1bd012ab: Waiting
6788f77dbde9: Waiting
0ced054245de: Waiting
5f70bf18a086: Layer already exists
2a0d5ae1b188: Pushed
35597c473f57: Pushed
b725c955b8c1: Pushed
1d27fb1ba2b1: Pushed
d39990a0e1fd: Pushed
6788f77dbde9: Pushed
0ced054245de: Pushed
689376ef0c5c: Pushed
9b8818d61dd3: Pushed
3a1e5ba350fe: Pushed
509153ef3076: Pushed
db6da8bc2146: Pushed
533af4d05d89: Layer already exists
d09fdd9ad3ef: Layer already exists
04d1dcab20cb: Layer already exists
b93c1bd012ab: Layer already exists
8ee3cfc6451a: Pushed
b465b47c430a: Pushed
20230411035738: digest: sha256:b5456fe7e7a9713068b7510146ea6da91d29e77b2b7566489997e363f224d85a size: 4296
> Task :runners:google-cloud-dataflow-java:coreSDKJavaRunnerV2IntegrationTest NO-SOURCE
> Task :runners:google-cloud-dataflow-java:examplesJavaRunnerV2IntegrationTest
***********************************************************
***********************************************************
**********************Set Up Pubsub************************
The Pub/Sub topic has been set up for this example: projects/apache-beam-testing/topics/testpipeline-jenkins-0411035827-2895d74d
The Pub/Sub subscription has been set up for this example: projects/apache-beam-testing/subscriptions/testpipeline-jenkins-0411035827-2895d74d
*************************Tear Down*************************
The Pub/Sub topic has been deleted: projects/apache-beam-testing/topics/testpipeline-jenkins-0411035827-2895d74d
The Pub/Sub subscription has been deleted: projects/apache-beam-testing/subscriptions/testpipeline-jenkins-0411035827-2895d74d
***********************************************************
***********************************************************
***********************************************************
***********************************************************
**********************Set Up Pubsub************************
The Pub/Sub topic has been set up for this example: projects/apache-beam-testing/topics/testpipeline-jenkins-0411035827-d8bd6f7e
The Pub/Sub subscription has been set up for this example: projects/apache-beam-testing/subscriptions/testpipeline-jenkins-0411035827-d8bd6f7e
*************************Tear Down*************************
The Pub/Sub topic has been deleted: projects/apache-beam-testing/topics/testpipeline-jenkins-0411035827-d8bd6f7e
The Pub/Sub subscription has been deleted: projects/apache-beam-testing/subscriptions/testpipeline-jenkins-0411035827-d8bd6f7e
***********************************************************
***********************************************************
> Task :runners:google-cloud-dataflow-java:googleCloudPlatformRunnerV2IntegrationTest
org.apache.beam.sdk.io.gcp.spanner.SpannerReadIT > testReadWithDataBoost FAILED
java.lang.RuntimeException at SpannerReadIT.java:214
87 tests completed, 1 failed, 2 skipped
> Task :runners:google-cloud-dataflow-java:googleCloudPlatformRunnerV2IntegrationTest FAILED
> Task :runners:google-cloud-dataflow-java:cleanUpDockerJavaImages
Untagged: us.gcr.io/apache-beam-testing/java-postcommit-it/java:20230411035738
Untagged: us.gcr.io/apache-beam-testing/java-postcommit-it/java@sha256:b5456fe7e7a9713068b7510146ea6da91d29e77b2b7566489997e363f224d85a
Deleted: sha256:22794ccd32e16b61861e6739e0b9b1ab62c9811c003ad0cfd622b35ba75aae9d
WARNING: Successfully resolved tag to sha256, but it is recommended to use sha256 directly.
Tag: [us.gcr.io/apache-beam-testing/java-postcommit-it/java:20230411035738]
- referencing digest: [us.gcr.io/apache-beam-testing/java-postcommit-it/java@sha256:b5456fe7e7a9713068b7510146ea6da91d29e77b2b7566489997e363f224d85a]
Deleted [[us.gcr.io/apache-beam-testing/java-postcommit-it/java:20230411035738] (referencing [us.gcr.io/apache-beam-testing/java-postcommit-it/java@sha256:b5456fe7e7a9713068b7510146ea6da91d29e77b2b7566489997e363f224d85a])].
Removing untagged image us.gcr.io/apache-beam-testing/java-postcommit-it/java@sha256:b5456fe7e7a9713068b7510146ea6da91d29e77b2b7566489997e363f224d85a
Digests:
- us.gcr.io/apache-beam-testing/java-postcommit-it/java@sha256:b5456fe7e7a9713068b7510146ea6da91d29e77b2b7566489997e363f224d85a
Deleted [us.gcr.io/apache-beam-testing/java-postcommit-it/java@sha256:b5456fe7e7a9713068b7510146ea6da91d29e77b2b7566489997e363f224d85a].
FAILURE: Build failed with an exception.
* What went wrong:
Execution failed for task ':runners:google-cloud-dataflow-java:googleCloudPlatformRunnerV2IntegrationTest'.
> There were failing tests. See the report at: file://<https://ci-beam.apache.org/job/beam_PostCommit_Java_DataflowV2/ws/src/runners/google-cloud-dataflow-java/build/reports/tests/googleCloudPlatformRunnerV2IntegrationTest/index.html>
* Try:
> Run with --stacktrace option to get the stack trace.
> Run with --info or --debug option to get more log output.
* Get more help at https://help.gradle.org
Deprecated Gradle features were used in this build, making it incompatible with Gradle 8.0.
You can use '--warning-mode all' to show the individual deprecation warnings and determine if they come from your own scripts or plugins.
See https://docs.gradle.org/7.5.1/userguide/command_line_interface.html#sec:command_line_warnings
Execution optimizations have been disabled for 1 invalid unit(s) of work during this build to ensure correctness.
Please consult deprecation warnings for more details.
BUILD FAILED in 3h 14m 22s
152 actionable tasks: 98 executed, 50 from cache, 4 up-to-date
Publishing build scan...
https://gradle.com/s/vwk2k4hmcjvyy
Build step 'Invoke Gradle script' changed build result to FAILURE
Build step 'Invoke Gradle script' marked build as failure
---------------------------------------------------------------------
To unsubscribe, e-mail: builds-unsubscribe@beam.apache.org
For additional commands, e-mail: builds-help@beam.apache.org
Build failed in Jenkins: beam_PostCommit_Java_DataflowV2 #2905
Posted by Apache Jenkins Server <je...@builds.apache.org>.
See <https://ci-beam.apache.org/job/beam_PostCommit_Java_DataflowV2/2905/display/redirect>
Changes:
------------------------------------------
[...truncated 63.49 KB...]
go: downloading github.com/golang/protobuf v1.5.2
go: downloading google.golang.org/grpc v1.52.3
go: downloading google.golang.org/protobuf v1.28.1
go: downloading golang.org/x/sys v0.5.0
go: downloading google.golang.org/genproto v0.0.0-20230110181048-76db0878b65f
go: downloading golang.org/x/text v0.7.0
go: added github.com/apache/beam/sdks/v2 v2.46.0
go: added github.com/golang/protobuf v1.5.2
go: added golang.org/x/net v0.5.0
go: added golang.org/x/sys v0.5.0
go: added golang.org/x/text v0.7.0
go: added google.golang.org/genproto v0.0.0-20230110181048-76db0878b65f
go: added google.golang.org/grpc v1.52.3
go: added google.golang.org/protobuf v1.28.1
+ go-licenses save github.com/apache/beam/sdks/v2/java/container --save_path=/output/licenses
W0410 21:58:52.706703 37 library.go:101] "golang.org/x/sys/unix" contains non-Go code that can't be inspected for further dependencies:
/go/pkg/mod/golang.org/x/sys@v0.5.0/unix/asm_linux_amd64.s
+ go-licenses csv github.com/apache/beam/sdks/v2/java/container
+ tee /output/licenses/list.csv
W0410 21:58:57.005948 82 library.go:101] "golang.org/x/sys/unix" contains non-Go code that can't be inspected for further dependencies:
/go/pkg/mod/golang.org/x/sys@v0.5.0/unix/asm_linux_amd64.s
github.com/apache/beam/sdks/v2/go/pkg/beam,https://github.com/apache/beam/blob/sdks/v2.46.0/sdks/go/README.md,Apache-2.0
github.com/apache/beam/sdks/v2/java/container,https://github.com/apache/beam/blob/sdks/v2.46.0/sdks/LICENSE,Apache-2.0
github.com/golang/protobuf,https://github.com/golang/protobuf/blob/v1.5.2/LICENSE,BSD-3-Clause
golang.org/x/net,https://cs.opensource.google/go/x/net/+/v0.5.0:LICENSE,BSD-3-Clause
golang.org/x/sys/unix,https://cs.opensource.google/go/x/sys/+/v0.5.0:LICENSE,BSD-3-Clause
golang.org/x/text,https://cs.opensource.google/go/x/text/+/v0.7.0:LICENSE,BSD-3-Clause
google.golang.org/genproto/googleapis/rpc/status,https://github.com/googleapis/go-genproto/blob/76db0878b65f/LICENSE,Apache-2.0
google.golang.org/grpc,https://github.com/grpc/grpc-go/blob/v1.52.3/LICENSE,Apache-2.0
google.golang.org/protobuf,https://github.com/protocolbuffers/protobuf-go/blob/v1.28.1/LICENSE,BSD-3-Clause
+ chmod -R a+w /output/licenses
> Task :release:go-licenses:java:createLicenses
> Task :sdks:java:container:java8:copyGolangLicenses
> Task :sdks:java:container:java8:dockerPrepare
> Task :sdks:java:container:java8:docker
#1 [internal] load build definition from Dockerfile
#1 transferring dockerfile: 2.58kB done
#1 DONE 0.0s
#2 [internal] load .dockerignore
#2 transferring context: 2B done
#2 DONE 0.0s
#3 [internal] load metadata for docker.io/library/eclipse-temurin:8
#3 DONE 0.3s
#4 [ 1/16] FROM docker.io/library/eclipse-temurin:8@sha256:005d3189b2ec1612c3ade6eadabd1935c312f03aa7905cf0528e9d71980ad512
#4 resolve docker.io/library/eclipse-temurin:8@sha256:005d3189b2ec1612c3ade6eadabd1935c312f03aa7905cf0528e9d71980ad512 0.0s done
#4 CACHED
#5 [internal] load build context
#5 transferring context: 46.73MB 0.4s done
#5 DONE 0.4s
#6 [ 2/16] ADD target/slf4j-api.jar /opt/apache/beam/jars/
#6 DONE 1.1s
#7 [ 3/16] ADD target/slf4j-jdk14.jar /opt/apache/beam/jars/
#7 DONE 0.1s
#8 [ 4/16] ADD target/jcl-over-slf4j.jar /opt/apache/beam/jars/
#8 DONE 0.1s
#9 [ 5/16] ADD target/log4j-over-slf4j.jar /opt/apache/beam/jars/
#9 DONE 0.1s
#10 [ 6/16] ADD target/log4j-to-slf4j.jar /opt/apache/beam/jars/
#10 DONE 0.1s
#11 [ 7/16] ADD target/beam-sdks-java-harness.jar /opt/apache/beam/jars/
#11 DONE 0.1s
#12 [ 8/16] COPY target/jamm.jar target/open-module-agent*.jar /opt/apache/beam/jars/
#12 DONE 0.1s
#13 [ 9/16] COPY target/linux_amd64/boot /opt/apache/beam/
#13 DONE 0.2s
#14 [10/16] COPY target/LICENSE /opt/apache/beam/
#14 DONE 0.1s
#15 [11/16] COPY target/NOTICE /opt/apache/beam/
#15 DONE 0.1s
#16 [12/16] ADD target/third_party_licenses /opt/apache/beam/third_party_licenses/
#16 DONE 0.2s
#17 [13/16] COPY target/LICENSE target/options/* /opt/apache/beam/options/
#17 DONE 0.1s
#18 [14/16] COPY target/go-licenses/* /opt/apache/beam/third_party_licenses/golang/
#18 DONE 0.1s
#19 [15/16] RUN if [ "true" = "false" ] ; then rm -rf /opt/apache/beam/third_party_licenses ; fi
#19 DONE 0.3s
#20 [16/16] COPY target/profiler/* /opt/google_cloud_profiler/
#20 DONE 0.1s
#21 exporting to image
#21 exporting layers
#21 exporting layers 0.2s done
#21 writing image sha256:d31b632445a7630c6e32fd124223a4e05bb5e44c3168f52bed00c57ec23101a0 done
#21 naming to docker.io/apache/beam_java8_sdk:2.48.0.dev done
#21 DONE 0.2s
> Task :runners:google-cloud-dataflow-java:buildAndPushDockerJavaContainer
WARNING: `gcloud docker` will not be supported for Docker client versions above 18.03.
As an alternative, use `gcloud auth configure-docker` to configure `docker` to
use `gcloud` as a credential helper, then use `docker` as you would for non-GCR
registries, e.g. `docker pull gcr.io/project-id/my-image`. Add
`--verbosity=error` to silence this warning: `gcloud docker
--verbosity=error -- pull gcr.io/project-id/my-image`.
See: https://cloud.google.com/container-registry/docs/support/deprecation-notices#gcloud-docker
The push refers to repository [us.gcr.io/apache-beam-testing/java-postcommit-it/java]
7cce404b898f: Preparing
5f70bf18a086: Preparing
e8c0dde5d8e4: Preparing
024496866edf: Preparing
dba53486864f: Preparing
2746c263aeea: Preparing
5fd3f8bc4cf0: Preparing
6c138bdcafd3: Preparing
024b3a27b995: Preparing
21fcd6a8be72: Preparing
e7d438d808d9: Preparing
654f7d319eb9: Preparing
727815047d4c: Preparing
1c6710f3d5e3: Preparing
5fd3f8bc4cf0: Waiting
024b3a27b995: Waiting
05fc8ef082e5: Preparing
533af4d05d89: Preparing
21fcd6a8be72: Waiting
d09fdd9ad3ef: Preparing
04d1dcab20cb: Preparing
e7d438d808d9: Waiting
b93c1bd012ab: Preparing
654f7d319eb9: Waiting
727815047d4c: Waiting
533af4d05d89: Waiting
05fc8ef082e5: Waiting
2746c263aeea: Waiting
d09fdd9ad3ef: Waiting
04d1dcab20cb: Waiting
b93c1bd012ab: Waiting
5f70bf18a086: Layer already exists
024496866edf: Pushed
e8c0dde5d8e4: Pushed
2746c263aeea: Pushed
7cce404b898f: Pushed
dba53486864f: Pushed
5fd3f8bc4cf0: Pushed
024b3a27b995: Pushed
e7d438d808d9: Pushed
21fcd6a8be72: Pushed
654f7d319eb9: Pushed
533af4d05d89: Layer already exists
d09fdd9ad3ef: Layer already exists
727815047d4c: Pushed
04d1dcab20cb: Layer already exists
b93c1bd012ab: Layer already exists
6c138bdcafd3: Pushed
1c6710f3d5e3: Pushed
05fc8ef082e5: Pushed
20230410215743: digest: sha256:4c083fa64b933907433aae70fa0bd5024f8a730d28082543e0de28562d907885 size: 4296
> Task :runners:google-cloud-dataflow-java:coreSDKJavaRunnerV2IntegrationTest NO-SOURCE
> Task :runners:google-cloud-dataflow-java:examplesJavaRunnerV2IntegrationTest
***********************************************************
***********************************************************
**********************Set Up Pubsub************************
The Pub/Sub topic has been set up for this example: projects/apache-beam-testing/topics/testpipeline-jenkins-0410215924-1da819ee
The Pub/Sub subscription has been set up for this example: projects/apache-beam-testing/subscriptions/testpipeline-jenkins-0410215924-1da819ee
*************************Tear Down*************************
The Pub/Sub topic has been deleted: projects/apache-beam-testing/topics/testpipeline-jenkins-0410215924-1da819ee
The Pub/Sub subscription has been deleted: projects/apache-beam-testing/subscriptions/testpipeline-jenkins-0410215924-1da819ee
***********************************************************
***********************************************************
***********************************************************
***********************************************************
**********************Set Up Pubsub************************
The Pub/Sub topic has been set up for this example: projects/apache-beam-testing/topics/testpipeline-jenkins-0410215924-89e762f4
The Pub/Sub subscription has been set up for this example: projects/apache-beam-testing/subscriptions/testpipeline-jenkins-0410215924-89e762f4
*************************Tear Down*************************
The Pub/Sub topic has been deleted: projects/apache-beam-testing/topics/testpipeline-jenkins-0410215924-89e762f4
The Pub/Sub subscription has been deleted: projects/apache-beam-testing/subscriptions/testpipeline-jenkins-0410215924-89e762f4
***********************************************************
***********************************************************
> Task :runners:google-cloud-dataflow-java:googleCloudPlatformRunnerV2IntegrationTest
org.apache.beam.sdk.io.gcp.spanner.SpannerReadIT > testReadWithDataBoost FAILED
java.lang.RuntimeException at SpannerReadIT.java:214
87 tests completed, 1 failed, 2 skipped
> Task :runners:google-cloud-dataflow-java:googleCloudPlatformRunnerV2IntegrationTest FAILED
> Task :runners:google-cloud-dataflow-java:cleanUpDockerJavaImages
Untagged: us.gcr.io/apache-beam-testing/java-postcommit-it/java:20230410215743
Untagged: us.gcr.io/apache-beam-testing/java-postcommit-it/java@sha256:4c083fa64b933907433aae70fa0bd5024f8a730d28082543e0de28562d907885
Deleted: sha256:d31b632445a7630c6e32fd124223a4e05bb5e44c3168f52bed00c57ec23101a0
WARNING: Successfully resolved tag to sha256, but it is recommended to use sha256 directly.
Tag: [us.gcr.io/apache-beam-testing/java-postcommit-it/java:20230410215743]
- referencing digest: [us.gcr.io/apache-beam-testing/java-postcommit-it/java@sha256:4c083fa64b933907433aae70fa0bd5024f8a730d28082543e0de28562d907885]
Deleted [[us.gcr.io/apache-beam-testing/java-postcommit-it/java:20230410215743] (referencing [us.gcr.io/apache-beam-testing/java-postcommit-it/java@sha256:4c083fa64b933907433aae70fa0bd5024f8a730d28082543e0de28562d907885])].
Removing untagged image us.gcr.io/apache-beam-testing/java-postcommit-it/java@sha256:4c083fa64b933907433aae70fa0bd5024f8a730d28082543e0de28562d907885
Digests:
- us.gcr.io/apache-beam-testing/java-postcommit-it/java@sha256:4c083fa64b933907433aae70fa0bd5024f8a730d28082543e0de28562d907885
Deleted [us.gcr.io/apache-beam-testing/java-postcommit-it/java@sha256:4c083fa64b933907433aae70fa0bd5024f8a730d28082543e0de28562d907885].
FAILURE: Build failed with an exception.
* What went wrong:
Execution failed for task ':runners:google-cloud-dataflow-java:googleCloudPlatformRunnerV2IntegrationTest'.
> There were failing tests. See the report at: file://<https://ci-beam.apache.org/job/beam_PostCommit_Java_DataflowV2/ws/src/runners/google-cloud-dataflow-java/build/reports/tests/googleCloudPlatformRunnerV2IntegrationTest/index.html>
* Try:
> Run with --stacktrace option to get the stack trace.
> Run with --info or --debug option to get more log output.
* Get more help at https://help.gradle.org
Deprecated Gradle features were used in this build, making it incompatible with Gradle 8.0.
You can use '--warning-mode all' to show the individual deprecation warnings and determine if they come from your own scripts or plugins.
See https://docs.gradle.org/7.5.1/userguide/command_line_interface.html#sec:command_line_warnings
Execution optimizations have been disabled for 1 invalid unit(s) of work during this build to ensure correctness.
Please consult deprecation warnings for more details.
BUILD FAILED in 3h 16m 44s
152 actionable tasks: 98 executed, 50 from cache, 4 up-to-date
Publishing build scan...
https://gradle.com/s/xcsme3gtj5q2s
Build step 'Invoke Gradle script' changed build result to FAILURE
Build step 'Invoke Gradle script' marked build as failure
---------------------------------------------------------------------
To unsubscribe, e-mail: builds-unsubscribe@beam.apache.org
For additional commands, e-mail: builds-help@beam.apache.org
Build failed in Jenkins: beam_PostCommit_Java_DataflowV2 #2904
Posted by Apache Jenkins Server <je...@builds.apache.org>.
See <https://ci-beam.apache.org/job/beam_PostCommit_Java_DataflowV2/2904/display/redirect?page=changes>
Changes:
[noreply] Add recently added notebooks to readme (#26198)
------------------------------------------
[...truncated 61.62 KB...]
/home/jenkins/go/bin/go1.20.2 build -o ./build/target/linux_amd64/boot boot.go boot_test.go
> Task :sdks:java:container:java8:copySdkHarnessLauncher
Execution optimizations have been disabled for task ':sdks:java:container:java8:copySdkHarnessLauncher' to ensure correctness due to the following reasons:
- Gradle detected a problem with the following location: '/home/jenkins/jenkins-slave/workspace/beam_PostCommit_Java_DataflowV2/src/sdks/java/container/build/target'. Reason: Task ':sdks:java:container:java8:copySdkHarnessLauncher' uses this output of task ':sdks:java:container:downloadCloudProfilerAgent' without declaring an explicit or implicit dependency. This can lead to incorrect results being produced, depending on what order the tasks are executed. Please refer to https://docs.gradle.org/7.5.1/userguide/validation_problems.html#implicit_dependency for more details about this problem.
- Gradle detected a problem with the following location: '/home/jenkins/jenkins-slave/workspace/beam_PostCommit_Java_DataflowV2/src/sdks/java/container/build/target'. Reason: Task ':sdks:java:container:java8:copySdkHarnessLauncher' uses this output of task ':sdks:java:container:pullLicenses' without declaring an explicit or implicit dependency. This can lead to incorrect results being produced, depending on what order the tasks are executed. Please refer to https://docs.gradle.org/7.5.1/userguide/validation_problems.html#implicit_dependency for more details about this problem.
> Task :release:go-licenses:java:dockerRun
go: downloading github.com/golang/protobuf v1.5.2
go: downloading google.golang.org/protobuf v1.28.1
go: downloading google.golang.org/grpc v1.52.3
go: downloading golang.org/x/sys v0.5.0
go: downloading google.golang.org/genproto v0.0.0-20230110181048-76db0878b65f
go: downloading golang.org/x/text v0.7.0
go: added github.com/apache/beam/sdks/v2 v2.46.0
go: added github.com/golang/protobuf v1.5.2
go: added golang.org/x/net v0.5.0
go: added golang.org/x/sys v0.5.0
go: added golang.org/x/text v0.7.0
go: added google.golang.org/genproto v0.0.0-20230110181048-76db0878b65f
go: added google.golang.org/grpc v1.52.3
go: added google.golang.org/protobuf v1.28.1
+ go-licenses save github.com/apache/beam/sdks/v2/java/container --save_path=/output/licenses
W0410 15:58:12.671531 38 library.go:101] "golang.org/x/sys/unix" contains non-Go code that can't be inspected for further dependencies:
/go/pkg/mod/golang.org/x/sys@v0.5.0/unix/asm_linux_amd64.s
+ go-licenses csv github.com/apache/beam/sdks/v2/java/container
+ tee /output/licenses/list.csv
W0410 15:58:17.082501 82 library.go:101] "golang.org/x/sys/unix" contains non-Go code that can't be inspected for further dependencies:
/go/pkg/mod/golang.org/x/sys@v0.5.0/unix/asm_linux_amd64.s
github.com/apache/beam/sdks/v2/go/pkg/beam,https://github.com/apache/beam/blob/sdks/v2.46.0/sdks/go/README.md,Apache-2.0
github.com/apache/beam/sdks/v2/java/container,https://github.com/apache/beam/blob/sdks/v2.46.0/sdks/LICENSE,Apache-2.0
github.com/golang/protobuf,https://github.com/golang/protobuf/blob/v1.5.2/LICENSE,BSD-3-Clause
golang.org/x/net,https://cs.opensource.google/go/x/net/+/v0.5.0:LICENSE,BSD-3-Clause
golang.org/x/sys/unix,https://cs.opensource.google/go/x/sys/+/v0.5.0:LICENSE,BSD-3-Clause
golang.org/x/text,https://cs.opensource.google/go/x/text/+/v0.7.0:LICENSE,BSD-3-Clause
google.golang.org/genproto/googleapis/rpc/status,https://github.com/googleapis/go-genproto/blob/76db0878b65f/LICENSE,Apache-2.0
google.golang.org/grpc,https://github.com/grpc/grpc-go/blob/v1.52.3/LICENSE,Apache-2.0
google.golang.org/protobuf,https://github.com/protocolbuffers/protobuf-go/blob/v1.28.1/LICENSE,BSD-3-Clause
+ chmod -R a+w /output/licenses
> Task :release:go-licenses:java:createLicenses
> Task :sdks:java:container:java8:copyGolangLicenses
> Task :sdks:java:container:java8:dockerPrepare
> Task :sdks:java:container:java8:docker
#1 [internal] load build definition from Dockerfile
#1 transferring dockerfile: 2.85kB done
#1 DONE 0.0s
#2 [internal] load .dockerignore
#2 transferring context: 2B done
#2 DONE 0.0s
#3 [internal] load metadata for docker.io/library/eclipse-temurin:8
#3 DONE 0.3s
#4 [ 1/18] FROM docker.io/library/eclipse-temurin:8@sha256:005d3189b2ec1612c3ade6eadabd1935c312f03aa7905cf0528e9d71980ad512
#4 resolve docker.io/library/eclipse-temurin:8@sha256:005d3189b2ec1612c3ade6eadabd1935c312f03aa7905cf0528e9d71980ad512 0.0s done
#4 CACHED
#5 [internal] load build context
#5 transferring context: 46.73MB 0.4s done
#5 DONE 0.4s
#6 [ 2/18] ADD target/slf4j-api.jar /opt/apache/beam/jars/
#6 DONE 1.0s
#7 [ 3/18] ADD target/slf4j-jdk14.jar /opt/apache/beam/jars/
#7 DONE 0.1s
#8 [ 4/18] ADD target/jcl-over-slf4j.jar /opt/apache/beam/jars/
#8 DONE 0.1s
#9 [ 5/18] ADD target/log4j-over-slf4j.jar /opt/apache/beam/jars/
#9 DONE 0.1s
#10 [ 6/18] ADD target/log4j-to-slf4j.jar /opt/apache/beam/jars/
#10 DONE 0.1s
#11 [ 7/18] ADD target/beam-sdks-java-harness.jar /opt/apache/beam/jars/
#11 DONE 0.1s
#12 [ 8/18] COPY target/jamm.jar target/open-module-agent*.jar /opt/apache/beam/jars/
#12 DONE 0.1s
#13 [ 9/18] COPY target/linux_amd64/boot /opt/apache/beam/
#13 DONE 0.2s
#14 [10/18] COPY target/LICENSE /opt/apache/beam/
#14 DONE 0.1s
#15 [11/18] COPY target/NOTICE /opt/apache/beam/
#15 DONE 0.1s
#16 [12/18] ADD target/third_party_licenses /opt/apache/beam/third_party_licenses/
#16 DONE 0.2s
#17 [13/18] COPY target/LICENSE target/options/* /opt/apache/beam/options/
#17 DONE 0.1s
#18 [14/18] RUN rm /opt/apache/beam/options/LICENSE
#18 DONE 0.3s
#19 [15/18] COPY target/LICENSE target/go-licenses/* /opt/apache/beam/third_party_licenses/golang/
#19 DONE 0.0s
#20 [16/18] RUN rm /opt/apache/beam/third_party_licenses/golang/LICENSE
#20 DONE 0.4s
#21 [17/18] RUN if [ "true" = "false" ] ; then rm -rf /opt/apache/beam/third_party_licenses ; fi
#21 DONE 0.5s
#22 [18/18] COPY target/profiler/* /opt/google_cloud_profiler/
#22 DONE 0.1s
#23 exporting to image
#23 exporting layers
#23 exporting layers 0.2s done
#23 writing image sha256:aaf47a809fdcdd4233e599a74333f1ddab27022eb607b85f16d97d18821f365f done
#23 naming to docker.io/apache/beam_java8_sdk:2.48.0.dev done
#23 DONE 0.2s
> Task :runners:google-cloud-dataflow-java:buildAndPushDockerJavaContainer
WARNING: `gcloud docker` will not be supported for Docker client versions above 18.03.
As an alternative, use `gcloud auth configure-docker` to configure `docker` to
use `gcloud` as a credential helper, then use `docker` as you would for non-GCR
registries, e.g. `docker pull gcr.io/project-id/my-image`. Add
`--verbosity=error` to silence this warning: `gcloud docker
--verbosity=error -- pull gcr.io/project-id/my-image`.
See: https://cloud.google.com/container-registry/docs/support/deprecation-notices#gcloud-docker
The push refers to repository [us.gcr.io/apache-beam-testing/java-postcommit-it/java]
f1a35b0c15bc: Preparing
5f70bf18a086: Preparing
7a2f177b5738: Preparing
1c11aab42aa3: Preparing
c9bef03790a7: Preparing
d46816f0e16f: Preparing
535559db67bc: Preparing
e7a63723e5b6: Preparing
d095e3699a27: Preparing
1f790ad5b8e3: Preparing
7d96d5053925: Preparing
8a666f7d2b3d: Preparing
1e3b6343598b: Preparing
895f6597e7f3: Preparing
96d4e0a7af35: Preparing
6c237aefb89a: Preparing
66f99a72cdcb: Preparing
533af4d05d89: Preparing
d09fdd9ad3ef: Preparing
04d1dcab20cb: Preparing
d46816f0e16f: Waiting
b93c1bd012ab: Preparing
535559db67bc: Waiting
8a666f7d2b3d: Waiting
d09fdd9ad3ef: Waiting
e7a63723e5b6: Waiting
04d1dcab20cb: Waiting
d095e3699a27: Waiting
1e3b6343598b: Waiting
b93c1bd012ab: Waiting
96d4e0a7af35: Waiting
1f790ad5b8e3: Waiting
895f6597e7f3: Waiting
7d96d5053925: Waiting
533af4d05d89: Waiting
6c237aefb89a: Waiting
66f99a72cdcb: Waiting
5f70bf18a086: Layer already exists
d46816f0e16f: Pushed
7a2f177b5738: Pushed
1c11aab42aa3: Pushed
c9bef03790a7: Pushed
f1a35b0c15bc: Pushed
d095e3699a27: Pushed
e7a63723e5b6: Pushed
7d96d5053925: Pushed
535559db67bc: Pushed
1f790ad5b8e3: Pushed
8a666f7d2b3d: Pushed
1e3b6343598b: Pushed
533af4d05d89: Layer already exists
d09fdd9ad3ef: Layer already exists
04d1dcab20cb: Layer already exists
895f6597e7f3: Pushed
b93c1bd012ab: Layer already exists
96d4e0a7af35: Pushed
66f99a72cdcb: Pushed
6c237aefb89a: Pushed
20230410155743: digest: sha256:f8a0098f8b4aaac9f13cb672d5ea7baa31c62365e0df61abd383440c5b32d944 size: 4710
> Task :runners:google-cloud-dataflow-java:coreSDKJavaRunnerV2IntegrationTest NO-SOURCE
> Task :runners:google-cloud-dataflow-java:examplesJavaRunnerV2IntegrationTest
FATAL: command execution failed
java.io.IOException: Backing channel 'apache-beam-jenkins-12' is disconnected.
at hudson.remoting.RemoteInvocationHandler.channelOrFail(RemoteInvocationHandler.java:215)
at hudson.remoting.RemoteInvocationHandler.invoke(RemoteInvocationHandler.java:285)
at com.sun.proxy.$Proxy133.isAlive(Unknown Source)
at hudson.Launcher$RemoteLauncher$ProcImpl.isAlive(Launcher.java:1215)
at hudson.Launcher$RemoteLauncher$ProcImpl.join(Launcher.java:1207)
at hudson.Launcher$ProcStarter.join(Launcher.java:524)
at hudson.plugins.gradle.Gradle.perform(Gradle.java:317)
at hudson.tasks.BuildStepMonitor$1.perform(BuildStepMonitor.java:20)
at hudson.model.AbstractBuild$AbstractBuildExecution.perform(AbstractBuild.java:814)
at hudson.model.Build$BuildExecution.build(Build.java:199)
at hudson.model.Build$BuildExecution.doRun(Build.java:164)
at hudson.model.AbstractBuild$AbstractBuildExecution.run(AbstractBuild.java:522)
at hudson.model.Run.execute(Run.java:1896)
at hudson.model.FreeStyleBuild.run(FreeStyleBuild.java:44)
at hudson.model.ResourceController.execute(ResourceController.java:101)
at hudson.model.Executor.run(Executor.java:442)
Caused by: java.io.IOException: Unexpected termination of the channel
at hudson.remoting.SynchronousCommandTransport$ReaderThread.run(SynchronousCommandTransport.java:75)
Caused by: java.io.EOFException
at java.base/java.io.ObjectInputStream$PeekInputStream.readFully(ObjectInputStream.java:2911)
at java.base/java.io.ObjectInputStream$BlockDataInputStream.readShort(ObjectInputStream.java:3406)
at java.base/java.io.ObjectInputStream.readStreamHeader(ObjectInputStream.java:932)
at java.base/java.io.ObjectInputStream.<init>(ObjectInputStream.java:375)
at hudson.remoting.ObjectInputStreamEx.<init>(ObjectInputStreamEx.java:49)
at hudson.remoting.Command.readFrom(Command.java:142)
at hudson.remoting.Command.readFrom(Command.java:128)
at hudson.remoting.AbstractSynchronousByteArrayCommandTransport.read(AbstractSynchronousByteArrayCommandTransport.java:35)
at hudson.remoting.SynchronousCommandTransport$ReaderThread.run(SynchronousCommandTransport.java:61)
Build step 'Invoke Gradle script' changed build result to FAILURE
Build step 'Invoke Gradle script' marked build as failure
FATAL: Channel "hudson.remoting.Channel@46262853:apache-beam-jenkins-12": Remote call on apache-beam-jenkins-12 failed. The channel is closing down or has closed down
java.io.EOFException
at java.base/java.io.ObjectInputStream$PeekInputStream.readFully(ObjectInputStream.java:2911)
at java.base/java.io.ObjectInputStream$BlockDataInputStream.readShort(ObjectInputStream.java:3406)
at java.base/java.io.ObjectInputStream.readStreamHeader(ObjectInputStream.java:932)
at java.base/java.io.ObjectInputStream.<init>(ObjectInputStream.java:375)
at hudson.remoting.ObjectInputStreamEx.<init>(ObjectInputStreamEx.java:49)
at hudson.remoting.Command.readFrom(Command.java:142)
at hudson.remoting.Command.readFrom(Command.java:128)
at hudson.remoting.AbstractSynchronousByteArrayCommandTransport.read(AbstractSynchronousByteArrayCommandTransport.java:35)
at hudson.remoting.SynchronousCommandTransport$ReaderThread.run(SynchronousCommandTransport.java:61)
Caused: java.io.IOException: Unexpected termination of the channel
at hudson.remoting.SynchronousCommandTransport$ReaderThread.run(SynchronousCommandTransport.java:75)
Caused: hudson.remoting.ChannelClosedException: Channel "hudson.remoting.Channel@46262853:apache-beam-jenkins-12": Remote call on apache-beam-jenkins-12 failed. The channel is closing down or has closed down
at hudson.remoting.Channel.call(Channel.java:993)
at hudson.Launcher$RemoteLauncher.kill(Launcher.java:1150)
at hudson.model.AbstractBuild$AbstractBuildExecution.run(AbstractBuild.java:534)
at hudson.model.Run.execute(Run.java:1896)
at hudson.model.FreeStyleBuild.run(FreeStyleBuild.java:44)
at hudson.model.ResourceController.execute(ResourceController.java:101)
at hudson.model.Executor.run(Executor.java:442)
---------------------------------------------------------------------
To unsubscribe, e-mail: builds-unsubscribe@beam.apache.org
For additional commands, e-mail: builds-help@beam.apache.org
Build failed in Jenkins: beam_PostCommit_Java_DataflowV2 #2901
Posted by Apache Jenkins Server <je...@builds.apache.org>.
See <https://ci-beam.apache.org/job/beam_PostCommit_Java_DataflowV2/2901/display/redirect>
Changes:
------------------------------------------
[...truncated 63.50 KB...]
go: added google.golang.org/grpc v1.52.3
go: added google.golang.org/protobuf v1.28.1
+ go-licenses save github.com/apache/beam/sdks/v2/java/container --save_path=/output/licenses
W0409 21:58:47.869974 38 library.go:101] "golang.org/x/sys/unix" contains non-Go code that can't be inspected for further dependencies:
/go/pkg/mod/golang.org/x/sys@v0.5.0/unix/asm_linux_amd64.s
+ go-licenses csv github.com/apache/beam/sdks/v2/java/container
+ tee /output/licenses/list.csv
W0409 21:58:51.948116 82 library.go:101] "golang.org/x/sys/unix" contains non-Go code that can't be inspected for further dependencies:
/go/pkg/mod/golang.org/x/sys@v0.5.0/unix/asm_linux_amd64.s
github.com/apache/beam/sdks/v2/go/pkg/beam,https://github.com/apache/beam/blob/sdks/v2.46.0/sdks/go/README.md,Apache-2.0
github.com/apache/beam/sdks/v2/java/container,https://github.com/apache/beam/blob/sdks/v2.46.0/sdks/LICENSE,Apache-2.0
github.com/golang/protobuf,https://github.com/golang/protobuf/blob/v1.5.2/LICENSE,BSD-3-Clause
golang.org/x/net,https://cs.opensource.google/go/x/net/+/v0.5.0:LICENSE,BSD-3-Clause
golang.org/x/sys/unix,https://cs.opensource.google/go/x/sys/+/v0.5.0:LICENSE,BSD-3-Clause
golang.org/x/text,https://cs.opensource.google/go/x/text/+/v0.7.0:LICENSE,BSD-3-Clause
google.golang.org/genproto/googleapis/rpc/status,https://github.com/googleapis/go-genproto/blob/76db0878b65f/LICENSE,Apache-2.0
google.golang.org/grpc,https://github.com/grpc/grpc-go/blob/v1.52.3/LICENSE,Apache-2.0
google.golang.org/protobuf,https://github.com/protocolbuffers/protobuf-go/blob/v1.28.1/LICENSE,BSD-3-Clause
+ chmod -R a+w /output/licenses
> Task :release:go-licenses:java:createLicenses
> Task :sdks:java:container:java8:copyGolangLicenses
> Task :sdks:java:container:java8:dockerPrepare
> Task :sdks:java:container:java8:docker
#1 [internal] load build definition from Dockerfile
#1 transferring dockerfile: 2.85kB done
#1 DONE 0.0s
#2 [internal] load .dockerignore
#2 transferring context: 2B done
#2 DONE 0.0s
#3 [internal] load metadata for docker.io/library/eclipse-temurin:8
#3 DONE 0.3s
#4 [ 1/18] FROM docker.io/library/eclipse-temurin:8@sha256:005d3189b2ec1612c3ade6eadabd1935c312f03aa7905cf0528e9d71980ad512
#4 resolve docker.io/library/eclipse-temurin:8@sha256:005d3189b2ec1612c3ade6eadabd1935c312f03aa7905cf0528e9d71980ad512 0.0s done
#4 CACHED
#5 [internal] load build context
#5 transferring context: 46.73MB 0.3s done
#5 DONE 0.4s
#6 [ 2/18] ADD target/slf4j-api.jar /opt/apache/beam/jars/
#6 DONE 1.0s
#7 [ 3/18] ADD target/slf4j-jdk14.jar /opt/apache/beam/jars/
#7 DONE 0.1s
#8 [ 4/18] ADD target/jcl-over-slf4j.jar /opt/apache/beam/jars/
#8 DONE 0.1s
#9 [ 5/18] ADD target/log4j-over-slf4j.jar /opt/apache/beam/jars/
#9 DONE 0.1s
#10 [ 6/18] ADD target/log4j-to-slf4j.jar /opt/apache/beam/jars/
#10 DONE 0.1s
#11 [ 7/18] ADD target/beam-sdks-java-harness.jar /opt/apache/beam/jars/
#11 DONE 0.1s
#12 [ 8/18] COPY target/jamm.jar target/open-module-agent*.jar /opt/apache/beam/jars/
#12 DONE 0.1s
#13 [ 9/18] COPY target/linux_amd64/boot /opt/apache/beam/
#13 DONE 0.2s
#14 [10/18] COPY target/LICENSE /opt/apache/beam/
#14 DONE 0.1s
#15 [11/18] COPY target/NOTICE /opt/apache/beam/
#15 DONE 0.1s
#16 [12/18] ADD target/third_party_licenses /opt/apache/beam/third_party_licenses/
#16 DONE 0.2s
#17 [13/18] COPY target/LICENSE target/options/* /opt/apache/beam/options/
#17 DONE 0.1s
#18 [14/18] RUN rm /opt/apache/beam/options/LICENSE
#18 DONE 0.3s
#19 [15/18] COPY target/LICENSE target/go-licenses/* /opt/apache/beam/third_party_licenses/golang/
#19 DONE 0.0s
#20 [16/18] RUN rm /opt/apache/beam/third_party_licenses/golang/LICENSE
#20 DONE 0.4s
#21 [17/18] RUN if [ "true" = "false" ] ; then rm -rf /opt/apache/beam/third_party_licenses ; fi
#21 DONE 0.4s
#22 [18/18] COPY target/profiler/* /opt/google_cloud_profiler/
#22 DONE 0.1s
#23 exporting to image
#23 exporting layers
#23 exporting layers 0.3s done
#23 writing image sha256:7289d5adf0a0e774703d3e7afd4cc41dbf6a7b18a600aa5563b8b0fa1d168074 done
#23 naming to docker.io/apache/beam_java8_sdk:2.48.0.dev done
#23 DONE 0.3s
> Task :runners:google-cloud-dataflow-java:buildAndPushDockerJavaContainer
WARNING: `gcloud docker` will not be supported for Docker client versions above 18.03.
As an alternative, use `gcloud auth configure-docker` to configure `docker` to
use `gcloud` as a credential helper, then use `docker` as you would for non-GCR
registries, e.g. `docker pull gcr.io/project-id/my-image`. Add
`--verbosity=error` to silence this warning: `gcloud docker
--verbosity=error -- pull gcr.io/project-id/my-image`.
See: https://cloud.google.com/container-registry/docs/support/deprecation-notices#gcloud-docker
The push refers to repository [us.gcr.io/apache-beam-testing/java-postcommit-it/java]
a65a04671958: Preparing
5f70bf18a086: Preparing
545a8fc77f70: Preparing
cc5c58fb697c: Preparing
18f81023b870: Preparing
d54c2f32d29b: Preparing
019686320117: Preparing
e7c009b22c29: Preparing
b19e836ab08f: Preparing
44cf44a95e08: Preparing
2321856ad9ae: Preparing
fe35aec60623: Preparing
8f09681b287b: Preparing
a931646ec75e: Preparing
5226f0f5897d: Preparing
33521f752011: Preparing
372b0e7e8529: Preparing
533af4d05d89: Preparing
d09fdd9ad3ef: Preparing
04d1dcab20cb: Preparing
b93c1bd012ab: Preparing
e7c009b22c29: Waiting
b19e836ab08f: Waiting
8f09681b287b: Waiting
44cf44a95e08: Waiting
533af4d05d89: Waiting
fe35aec60623: Waiting
a931646ec75e: Waiting
d54c2f32d29b: Waiting
d09fdd9ad3ef: Waiting
2321856ad9ae: Waiting
04d1dcab20cb: Waiting
5226f0f5897d: Waiting
019686320117: Waiting
33521f752011: Waiting
372b0e7e8529: Waiting
5f70bf18a086: Layer already exists
cc5c58fb697c: Pushed
545a8fc77f70: Pushed
d54c2f32d29b: Pushed
18f81023b870: Pushed
a65a04671958: Pushed
e7c009b22c29: Pushed
b19e836ab08f: Pushed
019686320117: Pushed
2321856ad9ae: Pushed
44cf44a95e08: Pushed
8f09681b287b: Pushed
fe35aec60623: Pushed
533af4d05d89: Layer already exists
d09fdd9ad3ef: Layer already exists
04d1dcab20cb: Layer already exists
b93c1bd012ab: Layer already exists
a931646ec75e: Pushed
5226f0f5897d: Pushed
33521f752011: Pushed
372b0e7e8529: Pushed
20230409215738: digest: sha256:f901bb0a90fccd3de55d1c7c0105ee479dbcee79ee694f9e59364b073246d9e1 size: 4710
> Task :runners:google-cloud-dataflow-java:coreSDKJavaRunnerV2IntegrationTest NO-SOURCE
> Task :runners:google-cloud-dataflow-java:examplesJavaRunnerV2IntegrationTest
***********************************************************
***********************************************************
**********************Set Up Pubsub************************
The Pub/Sub topic has been set up for this example: projects/apache-beam-testing/topics/testpipeline-jenkins-0409215916-2fc0e2b8
The Pub/Sub subscription has been set up for this example: projects/apache-beam-testing/subscriptions/testpipeline-jenkins-0409215916-2fc0e2b8
*************************Tear Down*************************
The Pub/Sub topic has been deleted: projects/apache-beam-testing/topics/testpipeline-jenkins-0409215916-2fc0e2b8
The Pub/Sub subscription has been deleted: projects/apache-beam-testing/subscriptions/testpipeline-jenkins-0409215916-2fc0e2b8
***********************************************************
***********************************************************
***********************************************************
***********************************************************
**********************Set Up Pubsub************************
The Pub/Sub topic has been set up for this example: projects/apache-beam-testing/topics/testpipeline-jenkins-0409215916-d54ad9d0
The Pub/Sub subscription has been set up for this example: projects/apache-beam-testing/subscriptions/testpipeline-jenkins-0409215916-d54ad9d0
*************************Tear Down*************************
The Pub/Sub topic has been deleted: projects/apache-beam-testing/topics/testpipeline-jenkins-0409215916-d54ad9d0
The Pub/Sub subscription has been deleted: projects/apache-beam-testing/subscriptions/testpipeline-jenkins-0409215916-d54ad9d0
***********************************************************
***********************************************************
> Task :runners:google-cloud-dataflow-java:googleCloudPlatformRunnerV2IntegrationTest
org.apache.beam.sdk.io.gcp.spanner.SpannerReadIT > testReadWithDataBoost FAILED
java.lang.RuntimeException at SpannerReadIT.java:214
87 tests completed, 1 failed, 2 skipped
> Task :runners:google-cloud-dataflow-java:googleCloudPlatformRunnerV2IntegrationTest FAILED
> Task :runners:google-cloud-dataflow-java:cleanUpDockerJavaImages
Untagged: us.gcr.io/apache-beam-testing/java-postcommit-it/java:20230409215738
Untagged: us.gcr.io/apache-beam-testing/java-postcommit-it/java@sha256:f901bb0a90fccd3de55d1c7c0105ee479dbcee79ee694f9e59364b073246d9e1
WARNING: Successfully resolved tag to sha256, but it is recommended to use sha256 directly.
Tag: [us.gcr.io/apache-beam-testing/java-postcommit-it/java:20230409215738]
- referencing digest: [us.gcr.io/apache-beam-testing/java-postcommit-it/java@sha256:f901bb0a90fccd3de55d1c7c0105ee479dbcee79ee694f9e59364b073246d9e1]
Deleted [[us.gcr.io/apache-beam-testing/java-postcommit-it/java:20230409215738] (referencing [us.gcr.io/apache-beam-testing/java-postcommit-it/java@sha256:f901bb0a90fccd3de55d1c7c0105ee479dbcee79ee694f9e59364b073246d9e1])].
Removing untagged image us.gcr.io/apache-beam-testing/java-postcommit-it/java@sha256:f901bb0a90fccd3de55d1c7c0105ee479dbcee79ee694f9e59364b073246d9e1
Digests:
- us.gcr.io/apache-beam-testing/java-postcommit-it/java@sha256:f901bb0a90fccd3de55d1c7c0105ee479dbcee79ee694f9e59364b073246d9e1
Deleted [us.gcr.io/apache-beam-testing/java-postcommit-it/java@sha256:f901bb0a90fccd3de55d1c7c0105ee479dbcee79ee694f9e59364b073246d9e1].
FAILURE: Build failed with an exception.
* What went wrong:
Execution failed for task ':runners:google-cloud-dataflow-java:googleCloudPlatformRunnerV2IntegrationTest'.
> There were failing tests. See the report at: file://<https://ci-beam.apache.org/job/beam_PostCommit_Java_DataflowV2/ws/src/runners/google-cloud-dataflow-java/build/reports/tests/googleCloudPlatformRunnerV2IntegrationTest/index.html>
* Try:
> Run with --stacktrace option to get the stack trace.
> Run with --info or --debug option to get more log output.
* Get more help at https://help.gradle.org
Deprecated Gradle features were used in this build, making it incompatible with Gradle 8.0.
You can use '--warning-mode all' to show the individual deprecation warnings and determine if they come from your own scripts or plugins.
See https://docs.gradle.org/7.5.1/userguide/command_line_interface.html#sec:command_line_warnings
Execution optimizations have been disabled for 1 invalid unit(s) of work during this build to ensure correctness.
Please consult deprecation warnings for more details.
BUILD FAILED in 3h 24m 40s
152 actionable tasks: 98 executed, 50 from cache, 4 up-to-date
Publishing build scan...
https://gradle.com/s/cb46p4g2k5z54
Build step 'Invoke Gradle script' changed build result to FAILURE
Build step 'Invoke Gradle script' marked build as failure
---------------------------------------------------------------------
To unsubscribe, e-mail: builds-unsubscribe@beam.apache.org
For additional commands, e-mail: builds-help@beam.apache.org
Build failed in Jenkins: beam_PostCommit_Java_DataflowV2 #2899
Posted by Apache Jenkins Server <je...@builds.apache.org>.
See <https://ci-beam.apache.org/job/beam_PostCommit_Java_DataflowV2/2899/display/redirect>
Changes:
------------------------------------------
[...truncated 64.19 KB...]
go: added golang.org/x/text v0.7.0
go: added google.golang.org/genproto v0.0.0-20230110181048-76db0878b65f
go: added google.golang.org/grpc v1.52.3
go: added google.golang.org/protobuf v1.28.1
+ go-licenses save github.com/apache/beam/sdks/v2/java/container --save_path=/output/licenses
W0409 09:58:48.864790 36 library.go:101] "golang.org/x/sys/unix" contains non-Go code that can't be inspected for further dependencies:
/go/pkg/mod/golang.org/x/sys@v0.5.0/unix/asm_linux_amd64.s
+ go-licenses csv github.com/apache/beam/sdks/v2/java/container
+ tee /output/licenses/list.csv
W0409 09:58:52.917130 81 library.go:101] "golang.org/x/sys/unix" contains non-Go code that can't be inspected for further dependencies:
/go/pkg/mod/golang.org/x/sys@v0.5.0/unix/asm_linux_amd64.s
github.com/apache/beam/sdks/v2/go/pkg/beam,https://github.com/apache/beam/blob/sdks/v2.46.0/sdks/go/README.md,Apache-2.0
github.com/apache/beam/sdks/v2/java/container,https://github.com/apache/beam/blob/sdks/v2.46.0/sdks/LICENSE,Apache-2.0
github.com/golang/protobuf,https://github.com/golang/protobuf/blob/v1.5.2/LICENSE,BSD-3-Clause
golang.org/x/net,https://cs.opensource.google/go/x/net/+/v0.5.0:LICENSE,BSD-3-Clause
golang.org/x/sys/unix,https://cs.opensource.google/go/x/sys/+/v0.5.0:LICENSE,BSD-3-Clause
golang.org/x/text,https://cs.opensource.google/go/x/text/+/v0.7.0:LICENSE,BSD-3-Clause
google.golang.org/genproto/googleapis/rpc/status,https://github.com/googleapis/go-genproto/blob/76db0878b65f/LICENSE,Apache-2.0
google.golang.org/grpc,https://github.com/grpc/grpc-go/blob/v1.52.3/LICENSE,Apache-2.0
google.golang.org/protobuf,https://github.com/protocolbuffers/protobuf-go/blob/v1.28.1/LICENSE,BSD-3-Clause
+ chmod -R a+w /output/licenses
> Task :release:go-licenses:java:createLicenses
> Task :sdks:java:container:java8:copyGolangLicenses
> Task :sdks:java:container:java8:dockerPrepare
> Task :sdks:java:container:java8:docker
#1 [internal] load .dockerignore
#1 transferring context: 2B done
#1 DONE 0.0s
#2 [internal] load build definition from Dockerfile
#2 transferring dockerfile: 2.85kB 0.0s done
#2 DONE 0.0s
#3 [internal] load metadata for docker.io/library/eclipse-temurin:8
#3 DONE 0.4s
#4 [ 1/18] FROM docker.io/library/eclipse-temurin:8@sha256:005d3189b2ec1612c3ade6eadabd1935c312f03aa7905cf0528e9d71980ad512
#4 resolve docker.io/library/eclipse-temurin:8@sha256:005d3189b2ec1612c3ade6eadabd1935c312f03aa7905cf0528e9d71980ad512 0.0s done
#4 CACHED
#5 [internal] load build context
#5 transferring context: 46.73MB 0.4s done
#5 DONE 0.4s
#6 [ 2/18] ADD target/slf4j-api.jar /opt/apache/beam/jars/
#6 DONE 1.1s
#7 [ 3/18] ADD target/slf4j-jdk14.jar /opt/apache/beam/jars/
#7 DONE 0.1s
#8 [ 4/18] ADD target/jcl-over-slf4j.jar /opt/apache/beam/jars/
#8 DONE 0.1s
#9 [ 5/18] ADD target/log4j-over-slf4j.jar /opt/apache/beam/jars/
#9 DONE 0.1s
#10 [ 6/18] ADD target/log4j-to-slf4j.jar /opt/apache/beam/jars/
#10 DONE 0.1s
#11 [ 7/18] ADD target/beam-sdks-java-harness.jar /opt/apache/beam/jars/
#11 DONE 0.1s
#12 [ 8/18] COPY target/jamm.jar target/open-module-agent*.jar /opt/apache/beam/jars/
#12 DONE 0.1s
#13 [ 9/18] COPY target/linux_amd64/boot /opt/apache/beam/
#13 DONE 0.2s
#14 [10/18] COPY target/LICENSE /opt/apache/beam/
#14 DONE 0.1s
#15 [11/18] COPY target/NOTICE /opt/apache/beam/
#15 DONE 0.1s
#16 [12/18] ADD target/third_party_licenses /opt/apache/beam/third_party_licenses/
#16 DONE 0.2s
#17 [13/18] COPY target/LICENSE target/options/* /opt/apache/beam/options/
#17 DONE 0.1s
#18 [14/18] RUN rm /opt/apache/beam/options/LICENSE
#18 DONE 0.8s
#19 [15/18] COPY target/LICENSE target/go-licenses/* /opt/apache/beam/third_party_licenses/golang/
#19 DONE 0.1s
#20 [16/18] RUN rm /opt/apache/beam/third_party_licenses/golang/LICENSE
#20 DONE 0.4s
#21 [17/18] RUN if [ "true" = "false" ] ; then rm -rf /opt/apache/beam/third_party_licenses ; fi
#21 DONE 0.4s
#22 [18/18] COPY target/profiler/* /opt/google_cloud_profiler/
#22 DONE 0.1s
#23 exporting to image
#23 exporting layers
#23 exporting layers 0.3s done
#23 writing image sha256:65057a6031b0551ed3d52b30e72e45c0ed185f21395fc3fa14585f2f20cea5c9 done
#23 naming to docker.io/apache/beam_java8_sdk:2.48.0.dev done
#23 DONE 0.3s
> Task :runners:google-cloud-dataflow-java:buildAndPushDockerJavaContainer
WARNING: `gcloud docker` will not be supported for Docker client versions above 18.03.
As an alternative, use `gcloud auth configure-docker` to configure `docker` to
use `gcloud` as a credential helper, then use `docker` as you would for non-GCR
registries, e.g. `docker pull gcr.io/project-id/my-image`. Add
`--verbosity=error` to silence this warning: `gcloud docker
--verbosity=error -- pull gcr.io/project-id/my-image`.
See: https://cloud.google.com/container-registry/docs/support/deprecation-notices#gcloud-docker
The push refers to repository [us.gcr.io/apache-beam-testing/java-postcommit-it/java]
51154e2c1ed5: Preparing
5f70bf18a086: Preparing
e83bd08e8d8f: Preparing
b1b89ca3c248: Preparing
54663525bdf1: Preparing
4dc8711449dd: Preparing
bbe0448b3ca4: Preparing
ef7fc7bbae37: Preparing
a9123b8e5759: Preparing
cec3a4263886: Preparing
57fa52052b9e: Preparing
7029eb0572a8: Preparing
4e1ca387fd12: Preparing
03ec5ddeb1cc: Preparing
254ced869d70: Preparing
3cc7f202697a: Preparing
c7a6eae42cb7: Preparing
533af4d05d89: Preparing
d09fdd9ad3ef: Preparing
04d1dcab20cb: Preparing
b93c1bd012ab: Preparing
57fa52052b9e: Waiting
7029eb0572a8: Waiting
4dc8711449dd: Waiting
03ec5ddeb1cc: Waiting
4e1ca387fd12: Waiting
254ced869d70: Waiting
bbe0448b3ca4: Waiting
3cc7f202697a: Waiting
a9123b8e5759: Waiting
ef7fc7bbae37: Waiting
c7a6eae42cb7: Waiting
cec3a4263886: Waiting
533af4d05d89: Waiting
5f70bf18a086: Layer already exists
e83bd08e8d8f: Pushed
b1b89ca3c248: Pushed
54663525bdf1: Pushed
4dc8711449dd: Pushed
51154e2c1ed5: Pushed
a9123b8e5759: Pushed
ef7fc7bbae37: Pushed
bbe0448b3ca4: Pushed
57fa52052b9e: Pushed
cec3a4263886: Pushed
4e1ca387fd12: Pushed
7029eb0572a8: Pushed
533af4d05d89: Layer already exists
d09fdd9ad3ef: Layer already exists
04d1dcab20cb: Layer already exists
b93c1bd012ab: Layer already exists
03ec5ddeb1cc: Pushed
254ced869d70: Pushed
3cc7f202697a: Pushed
c7a6eae42cb7: Pushed
20230409095737: digest: sha256:fe0c7fe41806ab3d1b291ef3d603be8bb73c2f6a0066e17e76cddda079a5bc7c size: 4710
> Task :runners:google-cloud-dataflow-java:coreSDKJavaRunnerV2IntegrationTest NO-SOURCE
> Task :runners:google-cloud-dataflow-java:examplesJavaRunnerV2IntegrationTest
***********************************************************
***********************************************************
**********************Set Up Pubsub************************
The Pub/Sub topic has been set up for this example: projects/apache-beam-testing/topics/testpipeline-jenkins-0409095917-e93f92b7
The Pub/Sub subscription has been set up for this example: projects/apache-beam-testing/subscriptions/testpipeline-jenkins-0409095917-e93f92b7
*************************Tear Down*************************
The Pub/Sub topic has been deleted: projects/apache-beam-testing/topics/testpipeline-jenkins-0409095917-e93f92b7
The Pub/Sub subscription has been deleted: projects/apache-beam-testing/subscriptions/testpipeline-jenkins-0409095917-e93f92b7
***********************************************************
***********************************************************
***********************************************************
***********************************************************
**********************Set Up Pubsub************************
The Pub/Sub topic has been set up for this example: projects/apache-beam-testing/topics/testpipeline-jenkins-0409095917-68e11653
The Pub/Sub subscription has been set up for this example: projects/apache-beam-testing/subscriptions/testpipeline-jenkins-0409095917-68e11653
*************************Tear Down*************************
The Pub/Sub topic has been deleted: projects/apache-beam-testing/topics/testpipeline-jenkins-0409095917-68e11653
The Pub/Sub subscription has been deleted: projects/apache-beam-testing/subscriptions/testpipeline-jenkins-0409095917-68e11653
***********************************************************
***********************************************************
> Task :runners:google-cloud-dataflow-java:googleCloudPlatformRunnerV2IntegrationTest
org.apache.beam.sdk.io.gcp.spanner.SpannerReadIT > testReadWithDataBoost FAILED
java.lang.RuntimeException at SpannerReadIT.java:214
87 tests completed, 1 failed, 2 skipped
> Task :runners:google-cloud-dataflow-java:googleCloudPlatformRunnerV2IntegrationTest FAILED
> Task :runners:google-cloud-dataflow-java:cleanUpDockerJavaImages
Untagged: us.gcr.io/apache-beam-testing/java-postcommit-it/java:20230409095737
Untagged: us.gcr.io/apache-beam-testing/java-postcommit-it/java@sha256:fe0c7fe41806ab3d1b291ef3d603be8bb73c2f6a0066e17e76cddda079a5bc7c
WARNING: Successfully resolved tag to sha256, but it is recommended to use sha256 directly.
Tag: [us.gcr.io/apache-beam-testing/java-postcommit-it/java:20230409095737]
- referencing digest: [us.gcr.io/apache-beam-testing/java-postcommit-it/java@sha256:fe0c7fe41806ab3d1b291ef3d603be8bb73c2f6a0066e17e76cddda079a5bc7c]
Deleted [[us.gcr.io/apache-beam-testing/java-postcommit-it/java:20230409095737] (referencing [us.gcr.io/apache-beam-testing/java-postcommit-it/java@sha256:fe0c7fe41806ab3d1b291ef3d603be8bb73c2f6a0066e17e76cddda079a5bc7c])].
Removing untagged image us.gcr.io/apache-beam-testing/java-postcommit-it/java@sha256:fe0c7fe41806ab3d1b291ef3d603be8bb73c2f6a0066e17e76cddda079a5bc7c
Digests:
- us.gcr.io/apache-beam-testing/java-postcommit-it/java@sha256:fe0c7fe41806ab3d1b291ef3d603be8bb73c2f6a0066e17e76cddda079a5bc7c
Deleted [us.gcr.io/apache-beam-testing/java-postcommit-it/java@sha256:fe0c7fe41806ab3d1b291ef3d603be8bb73c2f6a0066e17e76cddda079a5bc7c].
FAILURE: Build failed with an exception.
* What went wrong:
Execution failed for task ':runners:google-cloud-dataflow-java:googleCloudPlatformRunnerV2IntegrationTest'.
> There were failing tests. See the report at: file://<https://ci-beam.apache.org/job/beam_PostCommit_Java_DataflowV2/ws/src/runners/google-cloud-dataflow-java/build/reports/tests/googleCloudPlatformRunnerV2IntegrationTest/index.html>
* Try:
> Run with --stacktrace option to get the stack trace.
> Run with --info or --debug option to get more log output.
* Get more help at https://help.gradle.org
Deprecated Gradle features were used in this build, making it incompatible with Gradle 8.0.
You can use '--warning-mode all' to show the individual deprecation warnings and determine if they come from your own scripts or plugins.
See https://docs.gradle.org/7.5.1/userguide/command_line_interface.html#sec:command_line_warnings
Execution optimizations have been disabled for 1 invalid unit(s) of work during this build to ensure correctness.
Please consult deprecation warnings for more details.
BUILD FAILED in 3h 18m 22s
152 actionable tasks: 98 executed, 50 from cache, 4 up-to-date
Publishing build scan...
https://gradle.com/s/mgfehs3l2dcma
Build step 'Invoke Gradle script' changed build result to FAILURE
Build step 'Invoke Gradle script' marked build as failure
---------------------------------------------------------------------
To unsubscribe, e-mail: builds-unsubscribe@beam.apache.org
For additional commands, e-mail: builds-help@beam.apache.org