You are viewing a plain text version of this content. The canonical link for it is here.
Posted to dev@lucene.apache.org by Policeman Jenkins Server <je...@thetaphi.de> on 2015/04/13 22:40:06 UTC
[JENKINS] Lucene-Solr-5.x-MacOSX (64bit/jdk1.7.0) - Build # 2127 -
Still Failing!
Build: http://jenkins.thetaphi.de/job/Lucene-Solr-5.x-MacOSX/2127/
Java: 64bit/jdk1.7.0 -XX:-UseCompressedOops -XX:+UseParallelGC
2 tests failed.
FAILED: org.apache.solr.request.TestWriterPerf.testPerf
Error Message:
Stack Trace:
java.lang.NullPointerException
at __randomizedtesting.SeedInfo.seed([C00773CE20AC5C1F:E13092494822772E]:0)
at org.apache.solr.highlight.DefaultSolrHighlighter.doHighlightingByHighlighter(DefaultSolrHighlighter.java:451)
at org.apache.solr.highlight.DefaultSolrHighlighter.doHighlighting(DefaultSolrHighlighter.java:394)
at org.apache.solr.handler.component.HighlightComponent.process(HighlightComponent.java:143)
at org.apache.solr.handler.component.SearchHandler.handleRequestBody(SearchHandler.java:253)
at org.apache.solr.handler.RequestHandlerBase.handleRequest(RequestHandlerBase.java:143)
at org.apache.solr.core.SolrCore.execute(SolrCore.java:1988)
at org.apache.solr.request.TestWriterPerf.getResponse(TestWriterPerf.java:96)
at org.apache.solr.request.TestWriterPerf.doPerf(TestWriterPerf.java:105)
at org.apache.solr.request.TestWriterPerf.testPerf(TestWriterPerf.java:178)
at sun.reflect.NativeMethodAccessorImpl.invoke0(Native Method)
at sun.reflect.NativeMethodAccessorImpl.invoke(NativeMethodAccessorImpl.java:57)
at sun.reflect.DelegatingMethodAccessorImpl.invoke(DelegatingMethodAccessorImpl.java:43)
at java.lang.reflect.Method.invoke(Method.java:606)
at com.carrotsearch.randomizedtesting.RandomizedRunner.invoke(RandomizedRunner.java:1627)
at com.carrotsearch.randomizedtesting.RandomizedRunner$6.evaluate(RandomizedRunner.java:836)
at com.carrotsearch.randomizedtesting.RandomizedRunner$7.evaluate(RandomizedRunner.java:872)
at com.carrotsearch.randomizedtesting.RandomizedRunner$8.evaluate(RandomizedRunner.java:886)
at com.carrotsearch.randomizedtesting.rules.SystemPropertiesRestoreRule$1.evaluate(SystemPropertiesRestoreRule.java:57)
at org.apache.lucene.util.TestRuleSetupTeardownChained$1.evaluate(TestRuleSetupTeardownChained.java:50)
at org.apache.lucene.util.AbstractBeforeAfterRule$1.evaluate(AbstractBeforeAfterRule.java:46)
at org.apache.lucene.util.TestRuleThreadAndTestName$1.evaluate(TestRuleThreadAndTestName.java:49)
at org.apache.lucene.util.TestRuleIgnoreAfterMaxFailures$1.evaluate(TestRuleIgnoreAfterMaxFailures.java:65)
at org.apache.lucene.util.TestRuleMarkFailure$1.evaluate(TestRuleMarkFailure.java:48)
at com.carrotsearch.randomizedtesting.rules.StatementAdapter.evaluate(StatementAdapter.java:36)
at com.carrotsearch.randomizedtesting.ThreadLeakControl$StatementRunner.run(ThreadLeakControl.java:365)
at com.carrotsearch.randomizedtesting.ThreadLeakControl.forkTimeoutingTask(ThreadLeakControl.java:798)
at com.carrotsearch.randomizedtesting.ThreadLeakControl$3.evaluate(ThreadLeakControl.java:458)
at com.carrotsearch.randomizedtesting.RandomizedRunner.runSingleTest(RandomizedRunner.java:845)
at com.carrotsearch.randomizedtesting.RandomizedRunner$3.evaluate(RandomizedRunner.java:747)
at com.carrotsearch.randomizedtesting.RandomizedRunner$4.evaluate(RandomizedRunner.java:781)
at com.carrotsearch.randomizedtesting.RandomizedRunner$5.evaluate(RandomizedRunner.java:792)
at com.carrotsearch.randomizedtesting.rules.StatementAdapter.evaluate(StatementAdapter.java:36)
at com.carrotsearch.randomizedtesting.rules.SystemPropertiesRestoreRule$1.evaluate(SystemPropertiesRestoreRule.java:57)
at org.apache.lucene.util.AbstractBeforeAfterRule$1.evaluate(AbstractBeforeAfterRule.java:46)
at com.carrotsearch.randomizedtesting.rules.StatementAdapter.evaluate(StatementAdapter.java:36)
at org.apache.lucene.util.TestRuleStoreClassName$1.evaluate(TestRuleStoreClassName.java:42)
at com.carrotsearch.randomizedtesting.rules.NoShadowingOrOverridesOnMethodsRule$1.evaluate(NoShadowingOrOverridesOnMethodsRule.java:39)
at com.carrotsearch.randomizedtesting.rules.NoShadowingOrOverridesOnMethodsRule$1.evaluate(NoShadowingOrOverridesOnMethodsRule.java:39)
at com.carrotsearch.randomizedtesting.rules.StatementAdapter.evaluate(StatementAdapter.java:36)
at com.carrotsearch.randomizedtesting.rules.StatementAdapter.evaluate(StatementAdapter.java:36)
at com.carrotsearch.randomizedtesting.rules.StatementAdapter.evaluate(StatementAdapter.java:36)
at org.apache.lucene.util.TestRuleAssertionsRequired$1.evaluate(TestRuleAssertionsRequired.java:54)
at org.apache.lucene.util.TestRuleMarkFailure$1.evaluate(TestRuleMarkFailure.java:48)
at org.apache.lucene.util.TestRuleIgnoreAfterMaxFailures$1.evaluate(TestRuleIgnoreAfterMaxFailures.java:65)
at org.apache.lucene.util.TestRuleIgnoreTestSuites$1.evaluate(TestRuleIgnoreTestSuites.java:55)
at com.carrotsearch.randomizedtesting.rules.StatementAdapter.evaluate(StatementAdapter.java:36)
at com.carrotsearch.randomizedtesting.ThreadLeakControl$StatementRunner.run(ThreadLeakControl.java:365)
at java.lang.Thread.run(Thread.java:745)
FAILED: junit.framework.TestSuite.org.apache.solr.request.TestWriterPerf
Error Message:
1
Stack Trace:
java.lang.AssertionError: 1
at __randomizedtesting.SeedInfo.seed([C00773CE20AC5C1F]:0)
at org.apache.solr.core.CachingDirectoryFactory.close(CachingDirectoryFactory.java:201)
at org.apache.solr.core.SolrCore.close(SolrCore.java:1176)
at org.apache.solr.core.SolrCores.close(SolrCores.java:117)
at org.apache.solr.core.CoreContainer.shutdown(CoreContainer.java:378)
at org.apache.solr.util.TestHarness.close(TestHarness.java:359)
at org.apache.solr.SolrTestCaseJ4.deleteCore(SolrTestCaseJ4.java:704)
at org.apache.solr.SolrTestCaseJ4.afterClass(SolrTestCaseJ4.java:230)
at sun.reflect.GeneratedMethodAccessor36.invoke(Unknown Source)
at sun.reflect.DelegatingMethodAccessorImpl.invoke(DelegatingMethodAccessorImpl.java:43)
at java.lang.reflect.Method.invoke(Method.java:606)
at com.carrotsearch.randomizedtesting.RandomizedRunner.invoke(RandomizedRunner.java:1627)
at com.carrotsearch.randomizedtesting.RandomizedRunner$5.evaluate(RandomizedRunner.java:799)
at com.carrotsearch.randomizedtesting.rules.StatementAdapter.evaluate(StatementAdapter.java:36)
at com.carrotsearch.randomizedtesting.rules.SystemPropertiesRestoreRule$1.evaluate(SystemPropertiesRestoreRule.java:57)
at org.apache.lucene.util.AbstractBeforeAfterRule$1.evaluate(AbstractBeforeAfterRule.java:46)
at com.carrotsearch.randomizedtesting.rules.StatementAdapter.evaluate(StatementAdapter.java:36)
at org.apache.lucene.util.TestRuleStoreClassName$1.evaluate(TestRuleStoreClassName.java:42)
at com.carrotsearch.randomizedtesting.rules.NoShadowingOrOverridesOnMethodsRule$1.evaluate(NoShadowingOrOverridesOnMethodsRule.java:39)
at com.carrotsearch.randomizedtesting.rules.NoShadowingOrOverridesOnMethodsRule$1.evaluate(NoShadowingOrOverridesOnMethodsRule.java:39)
at com.carrotsearch.randomizedtesting.rules.StatementAdapter.evaluate(StatementAdapter.java:36)
at com.carrotsearch.randomizedtesting.rules.StatementAdapter.evaluate(StatementAdapter.java:36)
at com.carrotsearch.randomizedtesting.rules.StatementAdapter.evaluate(StatementAdapter.java:36)
at org.apache.lucene.util.TestRuleAssertionsRequired$1.evaluate(TestRuleAssertionsRequired.java:54)
at org.apache.lucene.util.TestRuleMarkFailure$1.evaluate(TestRuleMarkFailure.java:48)
at org.apache.lucene.util.TestRuleIgnoreAfterMaxFailures$1.evaluate(TestRuleIgnoreAfterMaxFailures.java:65)
at org.apache.lucene.util.TestRuleIgnoreTestSuites$1.evaluate(TestRuleIgnoreTestSuites.java:55)
at com.carrotsearch.randomizedtesting.rules.StatementAdapter.evaluate(StatementAdapter.java:36)
at com.carrotsearch.randomizedtesting.ThreadLeakControl$StatementRunner.run(ThreadLeakControl.java:365)
at java.lang.Thread.run(Thread.java:745)
Build Log:
[...truncated 9935 lines...]
[junit4] Suite: org.apache.solr.request.TestWriterPerf
[junit4] 2> Creating dataDir: /Users/jenkins/workspace/Lucene-Solr-5.x-MacOSX/solr/build/solr-core/test/J0/temp/solr.request.TestWriterPerf C00773CE20AC5C1F-001/init-core-data-001
[junit4] 2> 1368143 T5186 oas.SolrTestCaseJ4.buildSSLConfig Randomized ssl (false) and clientAuth (false)
[junit4] 2> 1368146 T5186 oas.SolrTestCaseJ4.initCore ####initCore
[junit4] 2> 1368146 T5186 oasc.SolrResourceLoader.<init> new SolrResourceLoader for directory: '/Users/jenkins/workspace/Lucene-Solr-5.x-MacOSX/solr/core/src/test-files/solr/collection1/'
[junit4] 2> 1368148 T5186 oasc.SolrResourceLoader.replaceClassLoader Adding 'file:/Users/jenkins/workspace/Lucene-Solr-5.x-MacOSX/solr/core/src/test-files/solr/collection1/lib/classes/' to classloader
[junit4] 2> 1368148 T5186 oasc.SolrResourceLoader.replaceClassLoader Adding 'file:/Users/jenkins/workspace/Lucene-Solr-5.x-MacOSX/solr/core/src/test-files/solr/collection1/lib/README' to classloader
[junit4] 2> 1368255 T5186 oasc.SolrConfig.refreshRequestParams current version of requestparams : -1
[junit4] 2> 1368279 T5186 oasc.SolrConfig.<init> Using Lucene MatchVersion: 5.2.0
[junit4] 2> 1368321 T5186 oasc.SolrConfig.<init> Loaded SolrConfig: solrconfig-functionquery.xml
[junit4] 2> 1368322 T5186 oass.IndexSchema.readSchema Reading Solr Schema from /Users/jenkins/workspace/Lucene-Solr-5.x-MacOSX/solr/core/src/test-files/solr/collection1/conf/schema11.xml
[junit4] 2> 1368332 T5186 oass.IndexSchema.readSchema [null] Schema name=example
[junit4] 2> 1368490 T5186 oass.IndexSchema.readSchema default search field in schema is text
[junit4] 2> 1368491 T5186 oass.IndexSchema.readSchema unique key field: id
[junit4] 2> 1368498 T5186 oasc.SolrResourceLoader.locateSolrHome JNDI not configured for solr (NoInitialContextEx)
[junit4] 2> 1368498 T5186 oasc.SolrResourceLoader.locateSolrHome using system property solr.solr.home: /Users/jenkins/workspace/Lucene-Solr-5.x-MacOSX/solr/core/src/test-files/solr
[junit4] 2> 1368498 T5186 oasc.SolrResourceLoader.<init> new SolrResourceLoader for directory: '/Users/jenkins/workspace/Lucene-Solr-5.x-MacOSX/solr/core/src/test-files/solr/'
[junit4] 2> 1368518 T5186 oasc.CoreContainer.<init> New CoreContainer 107235072
[junit4] 2> 1368518 T5186 oasc.CoreContainer.load Loading cores into CoreContainer [instanceDir=/Users/jenkins/workspace/Lucene-Solr-5.x-MacOSX/solr/core/src/test-files/solr/]
[junit4] 2> 1368518 T5186 oasc.CoreContainer.load loading shared library: /Users/jenkins/workspace/Lucene-Solr-5.x-MacOSX/solr/core/src/test-files/solr/lib
[junit4] 2> 1368519 T5186 oasc.SolrResourceLoader.addToClassLoader WARN Can't find (or read) directory to add to classloader: lib (resolved as: /Users/jenkins/workspace/Lucene-Solr-5.x-MacOSX/solr/core/src/test-files/solr/lib).
[junit4] 2> 1368531 T5186 oashc.HttpShardHandlerFactory.getParameter Setting socketTimeout to: 600000
[junit4] 2> 1368531 T5186 oashc.HttpShardHandlerFactory.getParameter Setting urlScheme to: null
[junit4] 2> 1368531 T5186 oashc.HttpShardHandlerFactory.getParameter Setting connTimeout to: 60000
[junit4] 2> 1368532 T5186 oashc.HttpShardHandlerFactory.getParameter Setting maxConnectionsPerHost to: 20
[junit4] 2> 1368532 T5186 oashc.HttpShardHandlerFactory.getParameter Setting maxConnections to: 10000
[junit4] 2> 1368532 T5186 oashc.HttpShardHandlerFactory.getParameter Setting corePoolSize to: 0
[junit4] 2> 1368532 T5186 oashc.HttpShardHandlerFactory.getParameter Setting maximumPoolSize to: 2147483647
[junit4] 2> 1368532 T5186 oashc.HttpShardHandlerFactory.getParameter Setting maxThreadIdleTime to: 5
[junit4] 2> 1368533 T5186 oashc.HttpShardHandlerFactory.getParameter Setting sizeOfQueue to: -1
[junit4] 2> 1368533 T5186 oashc.HttpShardHandlerFactory.getParameter Setting fairnessPolicy to: false
[junit4] 2> 1368533 T5186 oashc.HttpShardHandlerFactory.getParameter Setting useRetries to: false
[junit4] 2> 1368537 T5186 oasu.UpdateShardHandler.<init> Creating UpdateShardHandler HTTP client with params: socketTimeout=30000&connTimeout=30000&retry=true
[junit4] 2> 1368538 T5186 oasl.LogWatcher.createWatcher SLF4J impl is org.slf4j.impl.Log4jLoggerFactory
[junit4] 2> 1368538 T5186 oasl.LogWatcher.newRegisteredLogWatcher Registering Log Listener [Log4j (org.slf4j.impl.Log4jLoggerFactory)]
[junit4] 2> 1368538 T5186 oasc.CoreContainer.load Node Name: testNode
[junit4] 2> 1368546 T5186 oasc.CoreDescriptor.<init> CORE DESCRIPTOR: {transient=false, dataDir=/Users/jenkins/workspace/Lucene-Solr-5.x-MacOSX/solr/build/solr-core/test/J0/temp/solr.request.TestWriterPerf C00773CE20AC5C1F-001/init-core-data-001, name=collection1, collection=collection1, loadOnStartup=true, instanceDir=collection1, absoluteInstDir=/Users/jenkins/workspace/Lucene-Solr-5.x-MacOSX/solr/core/src/test-files/solr/collection1/, schema=schema11.xml, shard=shard1, config=solrconfig-functionquery.xml}
[junit4] 2> 1368547 T5187 oasc.SolrResourceLoader.<init> new SolrResourceLoader for directory: '/Users/jenkins/workspace/Lucene-Solr-5.x-MacOSX/solr/core/src/test-files/solr/collection1/'
[junit4] 2> 1368547 T5187 oasc.SolrResourceLoader.replaceClassLoader Adding 'file:/Users/jenkins/workspace/Lucene-Solr-5.x-MacOSX/solr/core/src/test-files/solr/collection1/lib/classes/' to classloader
[junit4] 2> 1368548 T5187 oasc.SolrResourceLoader.replaceClassLoader Adding 'file:/Users/jenkins/workspace/Lucene-Solr-5.x-MacOSX/solr/core/src/test-files/solr/collection1/lib/README' to classloader
[junit4] 2> 1368581 T5187 oasc.SolrConfig.refreshRequestParams current version of requestparams : -1
[junit4] 2> 1368598 T5187 oasc.SolrConfig.<init> Using Lucene MatchVersion: 5.2.0
[junit4] 2> 1368634 T5187 oasc.SolrConfig.<init> Loaded SolrConfig: solrconfig-functionquery.xml
[junit4] 2> 1368635 T5187 oass.IndexSchema.readSchema Reading Solr Schema from /Users/jenkins/workspace/Lucene-Solr-5.x-MacOSX/solr/core/src/test-files/solr/collection1/conf/schema11.xml
[junit4] 2> 1368642 T5187 oass.IndexSchema.readSchema [collection1] Schema name=example
[junit4] 2> 1368768 T5187 oass.IndexSchema.readSchema default search field in schema is text
[junit4] 2> 1368770 T5187 oass.IndexSchema.readSchema unique key field: id
[junit4] 2> 1368775 T5187 oasc.CoreContainer.create Creating SolrCore 'collection1' using configuration from instancedir /Users/jenkins/workspace/Lucene-Solr-5.x-MacOSX/solr/core/src/test-files/solr/collection1/
[junit4] 2> 1368775 T5187 c:collection1 oasc.SolrCore.initDirectoryFactory org.apache.solr.core.MockDirectoryFactory
[junit4] 2> 1368775 T5187 c:collection1 oasc.SolrCore.<init> [collection1] Opening new SolrCore at /Users/jenkins/workspace/Lucene-Solr-5.x-MacOSX/solr/core/src/test-files/solr/collection1/, dataDir=/Users/jenkins/workspace/Lucene-Solr-5.x-MacOSX/solr/build/solr-core/test/J0/temp/solr.request.TestWriterPerf C00773CE20AC5C1F-001/init-core-data-001/
[junit4] 2> 1368776 T5187 c:collection1 oasc.SolrCore.<init> JMX monitoring not detected for core: collection1
[junit4] 2> 1368776 T5187 c:collection1 oasc.CachingDirectoryFactory.get return new directory for /Users/jenkins/workspace/Lucene-Solr-5.x-MacOSX/solr/build/solr-core/test/J0/temp/solr.request.TestWriterPerf C00773CE20AC5C1F-001/init-core-data-001
[junit4] 2> 1368776 T5187 c:collection1 oasc.SolrCore.getNewIndexDir New index directory detected: old=null new=/Users/jenkins/workspace/Lucene-Solr-5.x-MacOSX/solr/build/solr-core/test/J0/temp/solr.request.TestWriterPerf C00773CE20AC5C1F-001/init-core-data-001/index/
[junit4] 2> 1368776 T5187 c:collection1 oasc.SolrCore.initIndex WARN [collection1] Solr index directory '/Users/jenkins/workspace/Lucene-Solr-5.x-MacOSX/solr/build/solr-core/test/J0/temp/solr.request.TestWriterPerf C00773CE20AC5C1F-001/init-core-data-001/index' doesn't exist. Creating new index...
[junit4] 2> 1368777 T5187 c:collection1 oasc.CachingDirectoryFactory.get return new directory for /Users/jenkins/workspace/Lucene-Solr-5.x-MacOSX/solr/build/solr-core/test/J0/temp/solr.request.TestWriterPerf C00773CE20AC5C1F-001/init-core-data-001/index
[junit4] 2> 1368777 T5187 c:collection1 oasu.RandomMergePolicy.<init> RandomMergePolicy wrapping class org.apache.lucene.index.AlcoholicMergePolicy: [AlcoholicMergePolicy: minMergeSize=0, mergeFactor=10, maxMergeSize=1257921665, maxMergeSizeForForcedMerge=9223372036854775807, calibrateSizeByDeletes=true, maxMergeDocs=2147483647, maxCFSSegmentSizeMB=8.796093022207999E12, noCFSRatio=0.1]
[junit4] 2> 1368778 T5187 c:collection1 oasc.SolrDeletionPolicy.onCommit SolrDeletionPolicy.onCommit: commits: num=1
[junit4] 2> commit{dir=MockDirectoryWrapper(RAMDirectory@710635a7 lockFactory=org.apache.lucene.store.SingleInstanceLockFactory@4eaca0e9),segFN=segments_1,generation=1}
[junit4] 2> 1368778 T5187 c:collection1 oasc.SolrDeletionPolicy.updateCommits newest commit generation = 1
[junit4] 2> 1368786 T5187 c:collection1 oasc.SolrCore.loadUpdateProcessorChains no updateRequestProcessorChain defined as default, creating implicit default
[junit4] 2> 1368797 T5187 c:collection1 oashl.XMLLoader.init xsltCacheLifetimeSeconds=60
[junit4] 2> 1368799 T5187 c:collection1 oashl.XMLLoader.init xsltCacheLifetimeSeconds=60
[junit4] 2> 1368801 T5187 c:collection1 oashl.XMLLoader.init xsltCacheLifetimeSeconds=60
[junit4] 2> 1368802 T5187 c:collection1 oashl.XMLLoader.init xsltCacheLifetimeSeconds=60
[junit4] 2> 1368810 T5187 c:collection1 oasc.RequestHandlers.initHandlersFromConfig Registered paths: /replication,/admin/luke,standard,/get,/update/csv,/reloadCache,/admin/logging,/config,/admin/mbeans,/admin/ping,/admin/threads,/admin/file,/schema,/update/json/docs,/admin/system,/update/json,/admin/plugins,/admin/properties,/update,/admin/segments
[junit4] 2> 1368812 T5187 c:collection1 oasc.SolrCore.initStatsCache Using default statsCache cache: org.apache.solr.search.stats.LocalStatsCache
[junit4] 2> 1368812 T5187 c:collection1 oasu.CommitTracker.<init> Hard AutoCommit: disabled
[junit4] 2> 1368813 T5187 c:collection1 oasu.CommitTracker.<init> Soft AutoCommit: disabled
[junit4] 2> 1368813 T5187 c:collection1 oasu.RandomMergePolicy.<init> RandomMergePolicy wrapping class org.apache.lucene.index.LogDocMergePolicy: [LogDocMergePolicy: minMergeSize=1000, mergeFactor=18, maxMergeSize=9223372036854775807, maxMergeSizeForForcedMerge=9223372036854775807, calibrateSizeByDeletes=false, maxMergeDocs=2147483647, maxCFSSegmentSizeMB=8.796093022207999E12, noCFSRatio=0.4210506868532722]
[junit4] 2> 1368813 T5187 c:collection1 oasc.SolrDeletionPolicy.onInit SolrDeletionPolicy.onInit: commits: num=1
[junit4] 2> commit{dir=MockDirectoryWrapper(RAMDirectory@710635a7 lockFactory=org.apache.lucene.store.SingleInstanceLockFactory@4eaca0e9),segFN=segments_1,generation=1}
[junit4] 2> 1368813 T5187 c:collection1 oasc.SolrDeletionPolicy.updateCommits newest commit generation = 1
[junit4] 2> 1368814 T5187 c:collection1 oass.SolrIndexSearcher.<init> Opening Searcher@65f8e067[collection1] main
[junit4] 2> 1368814 T5187 c:collection1 oasr.ManagedResourceStorage.newStorageIO WARN Cannot write to config directory /Users/jenkins/workspace/Lucene-Solr-5.x-MacOSX/solr/core/src/test-files/solr/collection1/conf; switching to use InMemory storage instead.
[junit4] 2> 1368814 T5187 c:collection1 oasr.RestManager.init Initializing RestManager with initArgs: {}
[junit4] 2> 1368814 T5187 c:collection1 oasr.ManagedResourceStorage.load Reading _rest_managed.json using InMemoryStorage
[junit4] 2> 1368814 T5187 c:collection1 oasr.RestManager.init Initializing 0 registered ManagedResources
[junit4] 2> 1368815 T5187 c:collection1 oash.ReplicationHandler.inform Commits will be reserved for 10000
[junit4] 2> 1368815 T5187 c:collection1 oasc.CoreContainer.registerCore registering core: collection1
[junit4] 2> 1368815 T5188 c:collection1 oasc.SolrCore.registerSearcher [collection1] Registered new searcher Searcher@65f8e067[collection1] main{ExitableDirectoryReader(UninvertingDirectoryReader())}
[junit4] 2> 1368818 T5186 oas.SolrTestCaseJ4.initCore ####initCore end
[junit4] 2> 1368822 T5186 oas.SolrTestCaseJ4.setUp ###Starting testPerf
[junit4] 2> ASYNC NEW_CORE C2583 name=collection1 org.apache.solr.core.SolrCore@440935c3
[junit4] 2> 1368824 T5186 C2583 oasup.LogUpdateProcessor.finish [collection1] webapp=null path=null params={} {add=[1]} 0 2
[junit4] 2> 1368827 T5186 C2583 oasup.LogUpdateProcessor.finish [collection1] webapp=null path=null params={} {add=[2]} 0 0
[junit4] 2> 1368829 T5186 C2583 oasup.LogUpdateProcessor.finish [collection1] webapp=null path=null params={} {add=[3]} 0 0
[junit4] 2> 1368830 T5186 C2583 oasup.LogUpdateProcessor.finish [collection1] webapp=null path=null params={} {add=[4]} 0 0
[junit4] 2> 1368832 T5186 C2583 oasup.LogUpdateProcessor.finish [collection1] webapp=null path=null params={} {add=[5]} 0 1
[junit4] 2> 1368835 T5186 C2583 oasup.LogUpdateProcessor.finish [collection1] webapp=null path=null params={} {add=[6]} 0 1
[junit4] 2> 1368837 T5186 C2583 oasup.LogUpdateProcessor.finish [collection1] webapp=null path=null params={} {add=[7]} 0 1
[junit4] 2> 1368838 T5186 C2583 oasup.LogUpdateProcessor.finish [collection1] webapp=null path=null params={} {add=[8]} 0 0
[junit4] 2> 1368839 T5186 C2583 oasup.LogUpdateProcessor.finish [collection1] webapp=null path=null params={} {add=[9]} 0 0
[junit4] 2> 1368841 T5186 C2583 oasup.LogUpdateProcessor.finish [collection1] webapp=null path=null params={} {add=[10]} 0 1
[junit4] 2> 1368842 T5186 C2583 oasup.LogUpdateProcessor.finish [collection1] webapp=null path=null params={} {add=[11]} 0 0
[junit4] 2> 1368843 T5186 C2583 oasup.LogUpdateProcessor.finish [collection1] webapp=null path=null params={} {add=[12]} 0 0
[junit4] 2> 1368845 T5186 C2583 oasu.DirectUpdateHandler2.commit start commit{,optimize=true,openSearcher=true,waitSearcher=true,expungeDeletes=false,softCommit=false,prepareCommit=false}
[junit4] 2> 1368850 T5186 C2583 oasc.SolrDeletionPolicy.onCommit SolrDeletionPolicy.onCommit: commits: num=2
[junit4] 2> commit{dir=MockDirectoryWrapper(RAMDirectory@710635a7 lockFactory=org.apache.lucene.store.SingleInstanceLockFactory@4eaca0e9),segFN=segments_1,generation=1}
[junit4] 2> commit{dir=MockDirectoryWrapper(RAMDirectory@710635a7 lockFactory=org.apache.lucene.store.SingleInstanceLockFactory@4eaca0e9),segFN=segments_2,generation=2}
[junit4] 2> 1368850 T5186 C2583 oasc.SolrDeletionPolicy.updateCommits newest commit generation = 2
[junit4] 2> 1368852 T5186 C2583 oass.SolrIndexSearcher.<init> Opening Searcher@4bbcb407[collection1] main
[junit4] 2> 1368853 T5186 C2583 oasu.DirectUpdateHandler2.commit end_commit_flush
[junit4] 2> 1368853 T5188 oasc.SolrCore.registerSearcher [collection1] Registered new searcher Searcher@4bbcb407[collection1] main{ExitableDirectoryReader(UninvertingDirectoryReader(Uninverting(_0(5.2.0):C12)))}
[junit4] 2> 1368853 T5186 C2583 oasup.LogUpdateProcessor.finish [collection1] webapp=null path=null params={} {optimize=} 0 8
[junit4] 2> 1368863 T5186 oasc.SolrException.log ERROR java.lang.NullPointerException
[junit4] 2> at org.apache.solr.highlight.DefaultSolrHighlighter.doHighlightingByHighlighter(DefaultSolrHighlighter.java:451)
[junit4] 2> at org.apache.solr.highlight.DefaultSolrHighlighter.doHighlighting(DefaultSolrHighlighter.java:394)
[junit4] 2> at org.apache.solr.handler.component.HighlightComponent.process(HighlightComponent.java:143)
[junit4] 2> at org.apache.solr.handler.component.SearchHandler.handleRequestBody(SearchHandler.java:253)
[junit4] 2> at org.apache.solr.handler.RequestHandlerBase.handleRequest(RequestHandlerBase.java:143)
[junit4] 2> at org.apache.solr.core.SolrCore.execute(SolrCore.java:1988)
[junit4] 2> at org.apache.solr.request.TestWriterPerf.getResponse(TestWriterPerf.java:96)
[junit4] 2> at org.apache.solr.request.TestWriterPerf.doPerf(TestWriterPerf.java:105)
[junit4] 2> at org.apache.solr.request.TestWriterPerf.testPerf(TestWriterPerf.java:178)
[junit4] 2> at sun.reflect.NativeMethodAccessorImpl.invoke0(Native Method)
[junit4] 2> at sun.reflect.NativeMethodAccessorImpl.invoke(NativeMethodAccessorImpl.java:57)
[junit4] 2> at sun.reflect.DelegatingMethodAccessorImpl.invoke(DelegatingMethodAccessorImpl.java:43)
[junit4] 2> at java.lang.reflect.Method.invoke(Method.java:606)
[junit4] 2> at com.carrotsearch.randomizedtesting.RandomizedRunner.invoke(RandomizedRunner.java:1627)
[junit4] 2> at com.carrotsearch.randomizedtesting.RandomizedRunner$6.evaluate(RandomizedRunner.java:836)
[junit4] 2> at com.carrotsearch.randomizedtesting.RandomizedRunner$7.evaluate(RandomizedRunner.java:872)
[junit4] 2> at com.carrotsearch.randomizedtesting.RandomizedRunner$8.evaluate(RandomizedRunner.java:886)
[junit4] 2> at com.carrotsearch.randomizedtesting.rules.SystemPropertiesRestoreRule$1.evaluate(SystemPropertiesRestoreRule.java:57)
[junit4] 2> at org.apache.lucene.util.TestRuleSetupTeardownChained$1.evaluate(TestRuleSetupTeardownChained.java:50)
[junit4] 2> at org.apache.lucene.util.AbstractBeforeAfterRule$1.evaluate(AbstractBeforeAfterRule.java:46)
[junit4] 2> at org.apache.lucene.util.TestRuleThreadAndTestName$1.evaluate(TestRuleThreadAndTestName.java:49)
[junit4] 2> at org.apache.lucene.util.TestRuleIgnoreAfterMaxFailures$1.evaluate(TestRuleIgnoreAfterMaxFailures.java:65)
[junit4] 2> at org.apache.lucene.util.TestRuleMarkFailure$1.evaluate(TestRuleMarkFailure.java:48)
[junit4] 2> at com.carrotsearch.randomizedtesting.rules.StatementAdapter.evaluate(StatementAdapter.java:36)
[junit4] 2> at com.carrotsearch.randomizedtesting.ThreadLeakControl$StatementRunner.run(ThreadLeakControl.java:365)
[junit4] 2> at com.carrotsearch.randomizedtesting.ThreadLeakControl.forkTimeoutingTask(ThreadLeakControl.java:798)
[junit4] 2> at com.carrotsearch.randomizedtesting.ThreadLeakControl$3.evaluate(ThreadLeakControl.java:458)
[junit4] 2> at com.carrotsearch.randomizedtesting.RandomizedRunner.runSingleTest(RandomizedRunner.java:845)
[junit4] 2> at com.carrotsearch.randomizedtesting.RandomizedRunner$3.evaluate(RandomizedRunner.java:747)
[junit4] 2> at com.carrotsearch.randomizedtesting.RandomizedRunner$4.evaluate(RandomizedRunner.java:781)
[junit4] 2> at com.carrotsearch.randomizedtesting.RandomizedRunner$5.evaluate(RandomizedRunner.java:792)
[junit4] 2> at com.carrotsearch.randomizedtesting.rules.StatementAdapter.evaluate(StatementAdapter.java:36)
[junit4] 2> at com.carrotsearch.randomizedtesting.rules.SystemPropertiesRestoreRule$1.evaluate(SystemPropertiesRestoreRule.java:57)
[junit4] 2> at org.apache.lucene.util.AbstractBeforeAfterRule$1.evaluate(AbstractBeforeAfterRule.java:46)
[junit4] 2> at com.carrotsearch.randomizedtesting.rules.StatementAdapter.evaluate(StatementAdapter.java:36)
[junit4] 2> at org.apache.lucene.util.TestRuleStoreClassName$1.evaluate(TestRuleStoreClassName.java:42)
[junit4] 2> at com.carrotsearch.randomizedtesting.rules.NoShadowingOrOverridesOnMethodsRule$1.evaluate(NoShadowingOrOverridesOnMethodsRule.java:39)
[junit4] 2> at com.carrotsearch.randomizedtesting.rules.NoShadowingOrOverridesOnMethodsRule$1.evaluate(NoShadowingOrOverridesOnMethodsRule.java:39)
[junit4] 2> at com.carrotsearch.randomizedtesting.rules.StatementAdapter.evaluate(StatementAdapter.java:36)
[junit4] 2> at com.carrotsearch.randomizedtesting.rules.StatementAdapter.evaluate(StatementAdapter.java:36)
[junit4] 2> at com.carrotsearch.randomizedtesting.rules.StatementAdapter.evaluate(StatementAdapter.java:36)
[junit4] 2> at org.apache.lucene.util.TestRuleAssertionsRequired$1.evaluate(TestRuleAssertionsRequired.java:54)
[junit4] 2> at org.apache.lucene.util.TestRuleMarkFailure$1.evaluate(TestRuleMarkFailure.java:48)
[junit4] 2> at org.apache.lucene.util.TestRuleIgnoreAfterMaxFailures$1.evaluate(TestRuleIgnoreAfterMaxFailures.java:65)
[junit4] 2> at org.apache.lucene.util.TestRuleIgnoreTestSuites$1.evaluate(TestRuleIgnoreTestSuites.java:55)
[junit4] 2> at com.carrotsearch.randomizedtesting.rules.StatementAdapter.evaluate(StatementAdapter.java:36)
[junit4] 2> at com.carrotsearch.randomizedtesting.ThreadLeakControl$StatementRunner.run(ThreadLeakControl.java:365)
[junit4] 2> at java.lang.Thread.run(Thread.java:745)
[junit4] 2>
[junit4] 2> 1368864 T5186 oasc.SolrCore.execute [collection1] webapp=null path=null params={hl.fl=t1&facet.field=f_i&facet.field=f_ss&facet.field=f_t&start=0&facet.sort=count&echoParams=all&hl=true&facet=true&facet.mincount=0&facet.offset=0&q=id:[*+TO+*]+all+country&facet.limit=100&fl=*,score&wt=xml&rows=100&indent=false} hits=12 status=500 QTime=9
[junit4] 2> 1368864 T5186 oas.SolrTestCaseJ4.tearDown ###Ending testPerf
[junit4] 2> NOTE: reproduce with: ant test -Dtestcase=TestWriterPerf -Dtests.method=testPerf -Dtests.seed=C00773CE20AC5C1F -Dtests.slow=true -Dtests.locale=mt_MT -Dtests.timezone=America/Indiana/Vevay -Dtests.asserts=true -Dtests.file.encoding=UTF-8
[junit4] ERROR 0.05s J0 | TestWriterPerf.testPerf <<<
[junit4] > Throwable #1: java.lang.NullPointerException
[junit4] > at __randomizedtesting.SeedInfo.seed([C00773CE20AC5C1F:E13092494822772E]:0)
[junit4] > at org.apache.solr.highlight.DefaultSolrHighlighter.doHighlightingByHighlighter(DefaultSolrHighlighter.java:451)
[junit4] > at org.apache.solr.highlight.DefaultSolrHighlighter.doHighlighting(DefaultSolrHighlighter.java:394)
[junit4] > at org.apache.solr.handler.component.HighlightComponent.process(HighlightComponent.java:143)
[junit4] > at org.apache.solr.handler.component.SearchHandler.handleRequestBody(SearchHandler.java:253)
[junit4] > at org.apache.solr.handler.RequestHandlerBase.handleRequest(RequestHandlerBase.java:143)
[junit4] > at org.apache.solr.core.SolrCore.execute(SolrCore.java:1988)
[junit4] > at org.apache.solr.request.TestWriterPerf.getResponse(TestWriterPerf.java:96)
[junit4] > at org.apache.solr.request.TestWriterPerf.doPerf(TestWriterPerf.java:105)
[junit4] > at org.apache.solr.request.TestWriterPerf.testPerf(TestWriterPerf.java:178)
[junit4] > at java.lang.Thread.run(Thread.java:745)
[junit4] 2> 1368871 T5186 oas.SolrTestCaseJ4.deleteCore ###deleteCore
[junit4] 2> 1368871 T5186 oasc.CoreContainer.shutdown Shutting down CoreContainer instance=107235072
[junit4] 2> 1368872 T5186 oasc.SolrCore.close [collection1] CLOSING SolrCore org.apache.solr.core.SolrCore@440935c3
[junit4] 2> 1368872 T5186 oasu.DirectUpdateHandler2.close closing DirectUpdateHandler2{commits=0,autocommits=0,soft autocommits=0,optimizes=1,rollbacks=0,expungeDeletes=0,docsPending=0,adds=0,deletesById=0,deletesByQuery=0,errors=0,cumulative_adds=12,cumulative_deletesById=0,cumulative_deletesByQuery=0,cumulative_errors=0}
[junit4] 2> 1368873 T5186 oasu.SolrCoreState.decrefSolrCoreState Closing SolrCoreState
[junit4] 2> 1368873 T5186 oasu.DefaultSolrCoreState.closeIndexWriter SolrCoreState ref count has reached 0 - closing IndexWriter
[junit4] 2> 1368873 T5186 oasu.DefaultSolrCoreState.closeIndexWriter closing IndexWriter with IndexWriterCloser
[junit4] 2> 1368874 T5186 oasc.SolrCore.closeSearcher [collection1] Closing main searcher on request.
[junit4] 2> 1368875 T5186 oasc.CachingDirectoryFactory.close Closing MockDirectoryFactory - 2 directories currently being tracked
[junit4] 2> 1381156 T5186 oasc.CachingDirectoryFactory.close ERROR Timeout waiting for all directory ref counts to be released - gave up waiting on CachedDir<<refCount=1;path=/Users/jenkins/workspace/Lucene-Solr-5.x-MacOSX/solr/build/solr-core/test/J0/temp/solr.request.TestWriterPerf C00773CE20AC5C1F-001/init-core-data-001/index;done=false>>
[junit4] 2> 1381157 T5186 oasc.SolrException.log ERROR Error closing directory:org.apache.solr.common.SolrException: Timeout waiting for all directory ref counts to be released - gave up waiting on CachedDir<<refCount=1;path=/Users/jenkins/workspace/Lucene-Solr-5.x-MacOSX/solr/build/solr-core/test/J0/temp/solr.request.TestWriterPerf C00773CE20AC5C1F-001/init-core-data-001/index;done=false>>
[junit4] 2> at org.apache.solr.core.CachingDirectoryFactory.close(CachingDirectoryFactory.java:187)
[junit4] 2> at org.apache.solr.core.SolrCore.close(SolrCore.java:1176)
[junit4] 2> at org.apache.solr.core.SolrCores.close(SolrCores.java:117)
[junit4] 2> at org.apache.solr.core.CoreContainer.shutdown(CoreContainer.java:378)
[junit4] 2> at org.apache.solr.util.TestHarness.close(TestHarness.java:359)
[junit4] 2> at org.apache.solr.SolrTestCaseJ4.deleteCore(SolrTestCaseJ4.java:704)
[junit4] 2> at org.apache.solr.SolrTestCaseJ4.afterClass(SolrTestCaseJ4.java:230)
[junit4] 2> at sun.reflect.GeneratedMethodAccessor36.invoke(Unknown Source)
[junit4] 2> at sun.reflect.DelegatingMethodAccessorImpl.invoke(DelegatingMethodAccessorImpl.java:43)
[junit4] 2> at java.lang.reflect.Method.invoke(Method.java:606)
[junit4] 2> at com.carrotsearch.randomizedtesting.RandomizedRunner.invoke(RandomizedRunner.java:1627)
[junit4] 2> at com.carrotsearch.randomizedtesting.RandomizedRunner$5.evaluate(RandomizedRunner.java:799)
[junit4] 2> at com.carrotsearch.randomizedtesting.rules.StatementAdapter.evaluate(StatementAdapter.java:36)
[junit4] 2> at com.carrotsearch.randomizedtesting.rules.SystemPropertiesRestoreRule$1.evaluate(SystemPropertiesRestoreRule.java:57)
[junit4] 2> at org.apache.lucene.util.AbstractBeforeAfterRule$1.evaluate(AbstractBeforeAfterRule.java:46)
[junit4] 2> at com.carrotsearch.randomizedtesting.rules.StatementAdapter.evaluate(StatementAdapter.java:36)
[junit4] 2> at org.apache.lucene.util.TestRuleStoreClassName$1.evaluate(TestRuleStoreClassName.java:42)
[junit4] 2> at com.carrotsearch.randomizedtesting.rules.NoShadowingOrOverridesOnMethodsRule$1.evaluate(NoShadowingOrOverridesOnMethodsRule.java:39)
[junit4] 2> at com.carrotsearch.randomizedtesting.rules.NoShadowingOrOverridesOnMethodsRule$1.evaluate(NoShadowingOrOverridesOnMethodsRule.java:39)
[junit4] 2> at com.carrotsearch.randomizedtesting.rules.StatementAdapter.evaluate(StatementAdapter.java:36)
[junit4] 2> at com.carrotsearch.randomizedtesting.rules.StatementAdapter.evaluate(StatementAdapter.java:36)
[junit4] 2> at com.carrotsearch.randomizedtesting.rules.StatementAdapter.evaluate(StatementAdapter.java:36)
[junit4] 2> at org.apache.lucene.util.TestRuleAssertionsRequired$1.evaluate(TestRuleAssertionsRequired.java:54)
[junit4] 2> at org.apache.lucene.util.TestRuleMarkFailure$1.evaluate(TestRuleMarkFailure.java:48)
[junit4] 2> at org.apache.lucene.util.TestRuleIgnoreAfterMaxFailures$1.evaluate(TestRuleIgnoreAfterMaxFailures.java:65)
[junit4] 2> at org.apache.lucene.util.TestRuleIgnoreTestSuites$1.evaluate(TestRuleIgnoreTestSuites.java:55)
[junit4] 2> at com.carrotsearch.randomizedtesting.rules.StatementAdapter.evaluate(StatementAdapter.java:36)
[junit4] 2> at com.carrotsearch.randomizedtesting.ThreadLeakControl$StatementRunner.run(ThreadLeakControl.java:365)
[junit4] 2> at java.lang.Thread.run(Thread.java:745)
[junit4] 2>
[junit4] 2> 1381158 T5186 oasc.SolrException.log ERROR java.lang.AssertionError: 1
[junit4] 2> at org.apache.solr.core.CachingDirectoryFactory.close(CachingDirectoryFactory.java:201)
[junit4] 2> at org.apache.solr.core.SolrCore.close(SolrCore.java:1176)
[junit4] 2> at org.apache.solr.core.SolrCores.close(SolrCores.java:117)
[junit4] 2> at org.apache.solr.core.CoreContainer.shutdown(CoreContainer.java:378)
[junit4] 2> at org.apache.solr.util.TestHarness.close(TestHarness.java:359)
[junit4] 2> at org.apache.solr.SolrTestCaseJ4.deleteCore(SolrTestCaseJ4.java:704)
[junit4] 2> at org.apache.solr.SolrTestCaseJ4.afterClass(SolrTestCaseJ4.java:230)
[junit4] 2> at sun.reflect.GeneratedMethodAccessor36.invoke(Unknown Source)
[junit4] 2> at sun.reflect.DelegatingMethodAccessorImpl.invoke(DelegatingMethodAccessorImpl.java:43)
[junit4] 2> at java.lang.reflect.Method.invoke(Method.java:606)
[junit4] 2> at com.carrotsearch.randomizedtesting.RandomizedRunner.invoke(RandomizedRunner.java:1627)
[junit4] 2> at com.carrotsearch.randomizedtesting.RandomizedRunner$5.evaluate(RandomizedRunner.java:799)
[junit4] 2> at com.carrotsearch.randomizedtesting.rules.StatementAdapter.evaluate(StatementAdapter.java:36)
[junit4] 2> at com.carrotsearch.randomizedtesting.rules.SystemPropertiesRestoreRule$1.evaluate(SystemPropertiesRestoreRule.java:57)
[junit4] 2> at org.apache.lucene.util.AbstractBeforeAfterRule$1.evaluate(AbstractBeforeAfterRule.java:46)
[junit4] 2> at com.carrotsearch.randomizedtesting.rules.StatementAdapter.evaluate(StatementAdapter.java:36)
[junit4] 2> at org.apache.lucene.util.TestRuleStoreClassName$1.evaluate(TestRuleStoreClassName.java:42)
[junit4] 2> at com.carrotsearch.randomizedtesting.rules.NoShadowingOrOverridesOnMethodsRule$1.evaluate(NoShadowingOrOverridesOnMethodsRule.java:39)
[junit4] 2> at com.carrotsearch.randomizedtesting.rules.NoShadowingOrOverridesOnMethodsRule$1.evaluate(NoShadowingOrOverridesOnMethodsRule.java:39)
[junit4] 2> at com.carrotsearch.randomizedtesting.rules.StatementAdapter.evaluate(StatementAdapter.java:36)
[junit4] 2> at com.carrotsearch.randomizedtesting.rules.StatementAdapter.evaluate(StatementAdapter.java:36)
[junit4] 2> at com.carrotsearch.randomizedtesting.rules.StatementAdapter.evaluate(StatementAdapter.java:36)
[junit4] 2> at org.apache.lucene.util.TestRuleAssertionsRequired$1.evaluate(TestRuleAssertionsRequired.java:54)
[junit4] 2> at org.apache.lucene.util.TestRuleMarkFailure$1.evaluate(TestRuleMarkFailure.java:48)
[junit4] 2> at org.apache.lucene.util.TestRuleIgnoreAfterMaxFailures$1.evaluate(TestRuleIgnoreAfterMaxFailures.java:65)
[junit4] 2> at org.apache.lucene.util.TestRuleIgnoreTestSuites$1.evaluate(TestRuleIgnoreTestSuites.java:55)
[junit4] 2> at com.carrotsearch.randomizedtesting.rules.StatementAdapter.evaluate(StatementAdapter.java:36)
[junit4] 2> at com.carrotsearch.randomizedtesting.ThreadLeakControl$StatementRunner.run(ThreadLeakControl.java:365)
[junit4] 2> at java.lang.Thread.run(Thread.java:745)
[junit4] 2>
[junit4] 2> 1381158 T5186 oasc.SolrException.log ERROR Error shutting down core:java.lang.AssertionError: 1
[junit4] 2> at org.apache.solr.core.CachingDirectoryFactory.close(CachingDirectoryFactory.java:201)
[junit4] 2> at org.apache.solr.core.SolrCore.close(SolrCore.java:1176)
[junit4] 2> at org.apache.solr.core.SolrCores.close(SolrCores.java:117)
[junit4] 2> at org.apache.solr.core.CoreContainer.shutdown(CoreContainer.java:378)
[junit4] 2> at org.apache.solr.util.TestHarness.close(TestHarness.java:359)
[junit4] 2> at org.apache.solr.SolrTestCaseJ4.deleteCore(SolrTestCaseJ4.java:704)
[junit4] 2> at org.apache.solr.SolrTestCaseJ4.afterClass(SolrTestCaseJ4.java:230)
[junit4] 2> at sun.reflect.GeneratedMethodAccessor36.invoke(Unknown Source)
[junit4] 2> at sun.reflect.DelegatingMethodAccessorImpl.invoke(DelegatingMethodAccessorImpl.java:43)
[junit4] 2> at java.lang.reflect.Method.invoke(Method.java:606)
[junit4] 2> at com.carrotsearch.randomizedtesting.RandomizedRunner.invoke(RandomizedRunner.java:1627)
[junit4] 2> at com.carrotsearch.randomizedtesting.RandomizedRunner$5.evaluate(RandomizedRunner.java:799)
[junit4] 2> at com.carrotsearch.randomizedtesting.rules.StatementAdapter.evaluate(StatementAdapter.java:36)
[junit4] 2> at com.carrotsearch.randomizedtesting.rules.SystemPropertiesRestoreRule$1.evaluate(SystemPropertiesRestoreRule.java:57)
[junit4] 2> at org.apache.lucene.util.AbstractBeforeAfterRule$1.evaluate(AbstractBeforeAfterRule.java:46)
[junit4] 2> at com.carrotsearch.randomizedtesting.rules.StatementAdapter.evaluate(StatementAdapter.java:36)
[junit4] 2> at org.apache.lucene.util.TestRuleStoreClassName$1.evaluate(TestRuleStoreClassName.java:42)
[junit4] 2> at com.carrotsearch.randomizedtesting.rules.NoShadowingOrOverridesOnMethodsRule$1.evaluate(NoShadowingOrOverridesOnMethodsRule.java:39)
[junit4] 2> at com.carrotsearch.randomizedtesting.rules.NoShadowingOrOverridesOnMethodsRule$1.evaluate(NoShadowingOrOverridesOnMethodsRule.java:39)
[junit4] 2> at com.carrotsearch.randomizedtesting.rules.StatementAdapter.evaluate(StatementAdapter.java:36)
[junit4] 2> at com.carrotsearch.randomizedtesting.rules.StatementAdapter.evaluate(StatementAdapter.java:36)
[junit4] 2> at com.carrotsearch.randomizedtesting.rules.StatementAdapter.evaluate(StatementAdapter.java:36)
[junit4] 2> at org.apache.lucene.util.TestRuleAssertionsRequired$1.evaluate(TestRuleAssertionsRequired.java:54)
[junit4] 2> at org.apache.lucene.util.TestRuleMarkFailure$1.evaluate(TestRuleMarkFailure.java:48)
[junit4] 2> at org.apache.lucene.util.TestRuleIgnoreAfterMaxFailures$1.evaluate(TestRuleIgnoreAfterMaxFailures.java:65)
[junit4] 2> at org.apache.lucene.util.TestRuleIgnoreTestSuites$1.evaluate(TestRuleIgnoreTestSuites.java:55)
[junit4] 2> at com.carrotsearch.randomizedtesting.rules.StatementAdapter.evaluate(StatementAdapter.java:36)
[junit4] 2> at com.carrotsearch.randomizedtesting.ThreadLeakControl$StatementRunner.run(ThreadLeakControl.java:365)
[junit4] 2> at java.lang.Thread.run(Thread.java:745)
[junit4] 2>
[junit4] 2> NOTE: leaving temporary files on disk at: /Users/jenkins/workspace/Lucene-Solr-5.x-MacOSX/solr/build/solr-core/test/J0/temp/solr.request.TestWriterPerf C00773CE20AC5C1F-001
[junit4] 2> NOTE: test params are: codec=Asserting(Lucene50): {id=PostingsFormat(name=LuceneVarGapDocFreqInterval), f_t=PostingsFormat(name=LuceneVarGapDocFreqInterval), f_ss=PostingsFormat(name=Memory doPackFST= true), f_i=TestBloomFilteredLucenePostings(BloomFilteringPostingsFormat(Lucene50(blocksize=128)))}, docValues:{}, sim=DefaultSimilarity, locale=mt_MT, timezone=America/Indiana/Vevay
[junit4] 2> NOTE: Mac OS X 10.8.5 x86_64/Oracle Corporation 1.7.0_76 (64-bit)/cpus=3,threads=1,free=76330080,total=414187520
[junit4] 2> NOTE: All tests run in this JVM: [ParsingFieldUpdateProcessorsTest, HdfsDirectoryFactoryTest, TestSurroundQueryParser, TestChildDocTransformer, TestPartialUpdateDeduplication, TestSolr4Spatial2, SolrPluginUtilsTest, TestCSVResponseWriter, MultiTermTest, RemoteQueryErrorTest, DocValuesTest, RequiredFieldsTest, SynonymTokenizerTest, HardAutoCommitTest, DeleteInactiveReplicaTest, TestLFUCache, LeaderElectionTest, TestFieldCollectionResource, TestSearcherReuse, TestMaxScoreQueryParser, DistributedFacetPivotWhiteBoxTest, ChaosMonkeyNothingIsSafeTest, RequestHandlersTest, TestCollationField, CollectionReloadTest, TestCloudSchemaless, TestClusterStateMutator, CacheHeaderTest, TestHashPartitioner, TestSolrIndexConfig, TriLevelCompositeIdRoutingTest, AddBlockUpdateTest, TestWordDelimiterFilterFactory, TestInitParams, AnalysisAfterCoreReloadTest, TestBM25SimilarityFactory, SpatialRPTFieldTypeTest, TestComponentsName, EnumFieldTest, TestIBSimilarityFactory, TestGroupingSearch, TestNamedUpdateProcessors, TestStressRecovery, SuggesterFSTTest, SoftAutoCommitTest, TestIndexingPerformance, SolrCoreCheckLockOnStartupTest, TestIndexSearcher, TestMissingGroups, ExternalCollectionsTest, TestConfigOverlay, TestCharFilters, NumericFieldsTest, TestManagedResourceStorage, HdfsRecoveryZkTest, TestCollapseQParserPlugin, TestDynamicLoading, TestFieldTypeResource, DocValuesMissingTest, RollingRestartTest, UniqFieldsUpdateProcessorFactoryTest, TestSweetSpotSimilarityFactory, DistributedIntervalFacetingTest, IndexSchemaRuntimeFieldTest, StressHdfsTest, TestPerFieldSimilarity, SystemInfoHandlerTest, TestConfigReload, TestPhraseSuggestions, TestDocumentBuilder, TestFaceting, TestDistributedSearch, TestSchemaResource, TestDistribDocBasedVersion, UUIDFieldTest, DateRangeFieldTest, TestJmxMonitoredMap, TestFieldSortValues, CoreAdminRequestStatusTest, TestManagedSynonymFilterFactory, PeerSyncTest, DistanceFunctionTest, AlternateDirectoryTest, TestReqParamsAPI, HdfsBasicDistributedZk2Test, ReplicationFactorTest, CustomCollectionTest, TestManagedSchemaFieldTypeResource, MigrateRouteKeyTest, TestCursorMarkWithoutUniqueKey, HdfsWriteToMultipleCollectionsTest, ZkControllerTest, TestWriterPerf]
[junit4] 2> NOTE: reproduce with: ant test -Dtestcase=TestWriterPerf -Dtests.seed=C00773CE20AC5C1F -Dtests.slow=true -Dtests.locale=mt_MT -Dtests.timezone=America/Indiana/Vevay -Dtests.asserts=true -Dtests.file.encoding=UTF-8
[junit4] ERROR 0.00s J0 | TestWriterPerf (suite) <<<
[junit4] > Throwable #1: java.lang.AssertionError: 1
[junit4] > at __randomizedtesting.SeedInfo.seed([C00773CE20AC5C1F]:0)
[junit4] > at org.apache.solr.core.CachingDirectoryFactory.close(CachingDirectoryFactory.java:201)
[junit4] > at org.apache.solr.core.SolrCore.close(SolrCore.java:1176)
[junit4] > at org.apache.solr.core.SolrCores.close(SolrCores.java:117)
[junit4] > at org.apache.solr.core.CoreContainer.shutdown(CoreContainer.java:378)
[junit4] > at org.apache.solr.util.TestHarness.close(TestHarness.java:359)
[junit4] > at org.apache.solr.SolrTestCaseJ4.deleteCore(SolrTestCaseJ4.java:704)
[junit4] > at org.apache.solr.SolrTestCaseJ4.afterClass(SolrTestCaseJ4.java:230)
[junit4] > at java.lang.Thread.run(Thread.java:745)
[junit4] Completed [205/482] on J0 in 13.63s, 1 test, 1 failure, 1 error <<< FAILURES!
[...truncated 862 lines...]
BUILD FAILED
/Users/jenkins/workspace/Lucene-Solr-5.x-MacOSX/build.xml:536: The following error occurred while executing this line:
/Users/jenkins/workspace/Lucene-Solr-5.x-MacOSX/build.xml:484: The following error occurred while executing this line:
/Users/jenkins/workspace/Lucene-Solr-5.x-MacOSX/build.xml:61: The following error occurred while executing this line:
/Users/jenkins/workspace/Lucene-Solr-5.x-MacOSX/extra-targets.xml:39: The following error occurred while executing this line:
/Users/jenkins/workspace/Lucene-Solr-5.x-MacOSX/solr/build.xml:229: The following error occurred while executing this line:
/Users/jenkins/workspace/Lucene-Solr-5.x-MacOSX/solr/common-build.xml:511: The following error occurred while executing this line:
/Users/jenkins/workspace/Lucene-Solr-5.x-MacOSX/lucene/common-build.xml:1434: The following error occurred while executing this line:
/Users/jenkins/workspace/Lucene-Solr-5.x-MacOSX/lucene/common-build.xml:991: There were test failures: 482 suites, 1915 tests, 1 suite-level error, 1 error, 55 ignored (21 assumptions)
Total time: 83 minutes 34 seconds
Build step 'Invoke Ant' marked build as failure
[description-setter] Description set: Java: 64bit/jdk1.7.0 -XX:-UseCompressedOops -XX:+UseParallelGC
Archiving artifacts
Recording test results
Email was triggered for: Failure - Any
Sending email for trigger: Failure - Any