You are viewing a plain text version of this content. The canonical link for it is here.
Posted to builds@lucene.apache.org by Apache Jenkins Server <je...@builds.apache.org> on 2019/11/19 10:51:03 UTC
[JENKINS] Lucene-Solr-Tests-8.x - Build # 764 - Unstable
Build: https://builds.apache.org/job/Lucene-Solr-Tests-8.x/764/
1 tests failed.
FAILED: org.apache.solr.search.TestSolrCachePerf.testGetPutCompute
Error Message:
Compute ratio should be higher or equal to get/put ratio: 0.9975999999999999 >= 0.9986000000000004
Stack Trace:
java.lang.AssertionError: Compute ratio should be higher or equal to get/put ratio: 0.9975999999999999 >= 0.9986000000000004
at __randomizedtesting.SeedInfo.seed([7FAFA6ED78D287C5:FF0721E5A05B9F5A]:0)
at org.junit.Assert.fail(Assert.java:88)
at org.apache.solr.search.TestSolrCachePerf.assertGreaterThanOrEqual(TestSolrCachePerf.java:84)
at org.apache.solr.search.TestSolrCachePerf.lambda$testGetPutCompute$0(TestSolrCachePerf.java:75)
at java.util.HashMap.forEach(HashMap.java:1289)
at org.apache.solr.search.TestSolrCachePerf.testGetPutCompute(TestSolrCachePerf.java:73)
at sun.reflect.NativeMethodAccessorImpl.invoke0(Native Method)
at sun.reflect.NativeMethodAccessorImpl.invoke(NativeMethodAccessorImpl.java:62)
at sun.reflect.DelegatingMethodAccessorImpl.invoke(DelegatingMethodAccessorImpl.java:43)
at java.lang.reflect.Method.invoke(Method.java:498)
at com.carrotsearch.randomizedtesting.RandomizedRunner.invoke(RandomizedRunner.java:1750)
at com.carrotsearch.randomizedtesting.RandomizedRunner$8.evaluate(RandomizedRunner.java:938)
at com.carrotsearch.randomizedtesting.RandomizedRunner$9.evaluate(RandomizedRunner.java:974)
at com.carrotsearch.randomizedtesting.RandomizedRunner$10.evaluate(RandomizedRunner.java:988)
at com.carrotsearch.randomizedtesting.rules.SystemPropertiesRestoreRule$1.evaluate(SystemPropertiesRestoreRule.java:57)
at org.apache.lucene.util.TestRuleSetupTeardownChained$1.evaluate(TestRuleSetupTeardownChained.java:49)
at org.apache.lucene.util.AbstractBeforeAfterRule$1.evaluate(AbstractBeforeAfterRule.java:45)
at org.apache.lucene.util.TestRuleThreadAndTestName$1.evaluate(TestRuleThreadAndTestName.java:48)
at org.apache.lucene.util.TestRuleIgnoreAfterMaxFailures$1.evaluate(TestRuleIgnoreAfterMaxFailures.java:64)
at org.apache.lucene.util.TestRuleMarkFailure$1.evaluate(TestRuleMarkFailure.java:47)
at com.carrotsearch.randomizedtesting.rules.StatementAdapter.evaluate(StatementAdapter.java:36)
at com.carrotsearch.randomizedtesting.ThreadLeakControl$StatementRunner.run(ThreadLeakControl.java:368)
at com.carrotsearch.randomizedtesting.ThreadLeakControl.forkTimeoutingTask(ThreadLeakControl.java:817)
at com.carrotsearch.randomizedtesting.ThreadLeakControl$3.evaluate(ThreadLeakControl.java:468)
at com.carrotsearch.randomizedtesting.RandomizedRunner.runSingleTest(RandomizedRunner.java:947)
at com.carrotsearch.randomizedtesting.RandomizedRunner$5.evaluate(RandomizedRunner.java:832)
at com.carrotsearch.randomizedtesting.RandomizedRunner$6.evaluate(RandomizedRunner.java:883)
at com.carrotsearch.randomizedtesting.RandomizedRunner$7.evaluate(RandomizedRunner.java:894)
at com.carrotsearch.randomizedtesting.rules.StatementAdapter.evaluate(StatementAdapter.java:36)
at com.carrotsearch.randomizedtesting.rules.SystemPropertiesRestoreRule$1.evaluate(SystemPropertiesRestoreRule.java:57)
at org.apache.lucene.util.AbstractBeforeAfterRule$1.evaluate(AbstractBeforeAfterRule.java:45)
at com.carrotsearch.randomizedtesting.rules.StatementAdapter.evaluate(StatementAdapter.java:36)
at org.apache.lucene.util.TestRuleStoreClassName$1.evaluate(TestRuleStoreClassName.java:41)
at com.carrotsearch.randomizedtesting.rules.NoShadowingOrOverridesOnMethodsRule$1.evaluate(NoShadowingOrOverridesOnMethodsRule.java:40)
at com.carrotsearch.randomizedtesting.rules.NoShadowingOrOverridesOnMethodsRule$1.evaluate(NoShadowingOrOverridesOnMethodsRule.java:40)
at com.carrotsearch.randomizedtesting.rules.StatementAdapter.evaluate(StatementAdapter.java:36)
at com.carrotsearch.randomizedtesting.rules.StatementAdapter.evaluate(StatementAdapter.java:36)
at com.carrotsearch.randomizedtesting.rules.StatementAdapter.evaluate(StatementAdapter.java:36)
at org.apache.lucene.util.TestRuleAssertionsRequired$1.evaluate(TestRuleAssertionsRequired.java:53)
at org.apache.lucene.util.TestRuleMarkFailure$1.evaluate(TestRuleMarkFailure.java:47)
at org.apache.lucene.util.TestRuleIgnoreAfterMaxFailures$1.evaluate(TestRuleIgnoreAfterMaxFailures.java:64)
at org.apache.lucene.util.TestRuleIgnoreTestSuites$1.evaluate(TestRuleIgnoreTestSuites.java:54)
at com.carrotsearch.randomizedtesting.rules.StatementAdapter.evaluate(StatementAdapter.java:36)
at com.carrotsearch.randomizedtesting.ThreadLeakControl$StatementRunner.run(ThreadLeakControl.java:368)
at java.lang.Thread.run(Thread.java:748)
Build Log:
[...truncated 13836 lines...]
[junit4] Suite: org.apache.solr.search.TestSolrCachePerf
[junit4] 2> 875231 INFO (SUITE-TestSolrCachePerf-seed#[7FAFA6ED78D287C5]-worker) [ ] o.a.s.SolrTestCaseJ4 SecureRandom sanity checks: test.solr.allowed.securerandom=null & java.security.egd=file:/dev/./urandom
[junit4] 2> 875231 INFO (SUITE-TestSolrCachePerf-seed#[7FAFA6ED78D287C5]-worker) [ ] o.a.s.SolrTestCaseJ4 Created dataDir: /home/jenkins/jenkins-slave/workspace/Lucene-Solr-Tests-8.x/solr/build/solr-core/test/J2/temp/solr.search.TestSolrCachePerf_7FAFA6ED78D287C5-001/data-dir-56-001
[junit4] 2> 875231 WARN (SUITE-TestSolrCachePerf-seed#[7FAFA6ED78D287C5]-worker) [ ] o.a.s.SolrTestCaseJ4 startTrackingSearchers: numOpens=46 numCloses=46
[junit4] 2> 875232 INFO (SUITE-TestSolrCachePerf-seed#[7FAFA6ED78D287C5]-worker) [ ] o.a.s.SolrTestCaseJ4 Using PointFields (NUMERIC_POINTS_SYSPROP=true) w/NUMERIC_DOCVALUES_SYSPROP=true
[junit4] 2> 875233 INFO (SUITE-TestSolrCachePerf-seed#[7FAFA6ED78D287C5]-worker) [ ] o.a.s.SolrTestCaseJ4 Randomized ssl (true) and clientAuth (false) via: @org.apache.solr.util.RandomizeSSL(reason=, value=NaN, ssl=NaN, clientAuth=NaN)
[junit4] 2> 875244 INFO (TEST-TestSolrCachePerf.testGetPutCompute-seed#[7FAFA6ED78D287C5]) [ ] o.a.s.SolrTestCaseJ4 ###Starting testGetPutCompute
[junit4] 2> 905995 INFO (TEST-TestSolrCachePerf.testGetPutCompute-seed#[7FAFA6ED78D287C5]) [ ] o.a.s.SolrTestCaseJ4 ###Ending testGetPutCompute
[junit4] 2> NOTE: reproduce with: ant test -Dtestcase=TestSolrCachePerf -Dtests.method=testGetPutCompute -Dtests.seed=7FAFA6ED78D287C5 -Dtests.multiplier=2 -Dtests.slow=true -Dtests.locale=it -Dtests.timezone=America/Dawson -Dtests.asserts=true -Dtests.file.encoding=UTF-8
[junit4] FAILURE 30.8s J2 | TestSolrCachePerf.testGetPutCompute <<<
[junit4] > Throwable #1: java.lang.AssertionError: Compute ratio should be higher or equal to get/put ratio: 0.9975999999999999 >= 0.9986000000000004
[junit4] > at __randomizedtesting.SeedInfo.seed([7FAFA6ED78D287C5:FF0721E5A05B9F5A]:0)
[junit4] > at org.apache.solr.search.TestSolrCachePerf.assertGreaterThanOrEqual(TestSolrCachePerf.java:84)
[junit4] > at org.apache.solr.search.TestSolrCachePerf.lambda$testGetPutCompute$0(TestSolrCachePerf.java:75)
[junit4] > at java.util.HashMap.forEach(HashMap.java:1289)
[junit4] > at org.apache.solr.search.TestSolrCachePerf.testGetPutCompute(TestSolrCachePerf.java:73)
[junit4] > at java.lang.Thread.run(Thread.java:748)
[junit4] 2> NOTE: leaving temporary files on disk at: /home/jenkins/jenkins-slave/workspace/Lucene-Solr-Tests-8.x/solr/build/solr-core/test/J2/temp/solr.search.TestSolrCachePerf_7FAFA6ED78D287C5-001
[junit4] 2> NOTE: test params are: codec=Asserting(Lucene80): {}, docValues:{}, maxPointsInLeafNode=1759, maxMBSortInHeap=6.232661277195518, sim=Asserting(org.apache.lucene.search.similarities.AssertingSimilarity@2defb12), locale=it, timezone=America/Dawson
[junit4] 2> NOTE: Linux 4.4.0-112-generic amd64/Oracle Corporation 1.8.0_191 (64-bit)/cpus=4,threads=1,free=335737040,total=531628032
[junit4] 2> NOTE: All tests run in this JVM: [SegmentsInfoRequestHandlerTest, URLClassifyProcessorTest, TestExceedMaxTermLength, HdfsBasicDistributedZk2Test, TestCoreDiscovery, TestApiFramework, TestQuerySenderNoQuery, TestSolrCloudWithHadoopAuthPlugin, DirectSolrConnectionTest, SharedFSAutoReplicaFailoverTest, TestFieldResource, TestSimScenario, TestNumericRangeQuery64, LukeRequestHandlerTest, BadCopyFieldTest, TestScoreJoinQPNoScore, SaslZkACLProviderTest, HdfsWriteToMultipleCollectionsTest, DistributedIntervalFacetingTest, SuggesterWFSTTest, DocValuesNotIndexedTest, TestXIncludeConfig, TestPostingsSolrHighlighter, TriggerSetPropertiesIntegrationTest, TestBackupRepositoryFactory, TestTolerantSearch, SolrRrdBackendFactoryTest, SplitHandlerTest, PeerSyncReplicationTest, RandomizedTaggerTest, CoreAdminRequestStatusTest, ImplicitSnitchTest, CSVRequestHandlerTest, TestSmileRequest, JvmMetricsTest, TestCloudRecovery, TestSQLHandler, DocValuesMultiTest, NodeAddedTriggerTest, TestStandardQParsers, DistribJoinFromCollectionTest, TestDFRSimilarityFactory, TestDynamicURP, BasicAuthOnSingleNodeTest, FacetPivotSmallTest, TokenizerChainTest, TestExactSharedStatsCache, SimpleFacetsTest, CloneFieldUpdateProcessorFactoryTest, ByteBuffersDirectoryFactoryTest, TestCloudPhrasesIdentificationComponent, SOLR749Test, ManagedSchemaRoundRobinCloudTest, BlockCacheTest, RAMDirectoryFactoryTest, TestMacroExpander, TestSolrCachePerf]
[junit4] Completed [184/885 (1!)] on J2 in 31.04s, 1 test, 1 failure <<< FAILURES!
[...truncated 55307 lines...]