You are viewing a plain text version of this content. The canonical link for it is here.
Posted to dev@zookeeper.apache.org by Apache Jenkins Server <je...@builds.apache.org> on 2018/02/21 00:56:41 UTC
ZooKeeper_branch34_jdk8 - Build # 1301 - Failure
See https://builds.apache.org/job/ZooKeeper_branch34_jdk8/1301/
###################################################################################
########################## LAST 60 LINES OF THE CONSOLE ###########################
[...truncated 38.84 KB...]
[junit] Running org.apache.zookeeper.test.RecoveryTest
[junit] Tests run: 1, Failures: 0, Errors: 0, Skipped: 0, Time elapsed: 25.967 sec
[junit] Running org.apache.zookeeper.test.RepeatStartupTest
[junit] Tests run: 1, Failures: 0, Errors: 0, Skipped: 0, Time elapsed: 6.386 sec
[junit] Running org.apache.zookeeper.test.RestoreCommittedLogTest
[junit] Tests run: 1, Failures: 0, Errors: 0, Skipped: 0, Time elapsed: 20.723 sec
[junit] Running org.apache.zookeeper.test.SaslAuthDesignatedClientTest
[junit] Tests run: 2, Failures: 0, Errors: 0, Skipped: 0, Time elapsed: 3.361 sec
[junit] Running org.apache.zookeeper.test.SaslAuthDesignatedServerTest
[junit] Tests run: 1, Failures: 0, Errors: 0, Skipped: 0, Time elapsed: 1.232 sec
[junit] Running org.apache.zookeeper.test.SaslAuthFailDesignatedClientTest
[junit] Tests run: 1, Failures: 0, Errors: 0, Skipped: 0, Time elapsed: 2.333 sec
[junit] Running org.apache.zookeeper.test.SaslAuthFailNotifyTest
[junit] Tests run: 1, Failures: 0, Errors: 0, Skipped: 0, Time elapsed: 0.632 sec
[junit] Running org.apache.zookeeper.test.SaslAuthFailTest
[junit] Tests run: 1, Failures: 0, Errors: 0, Skipped: 0, Time elapsed: 0.863 sec
[junit] Running org.apache.zookeeper.test.SaslAuthMissingClientConfigTest
[junit] Tests run: 1, Failures: 0, Errors: 0, Skipped: 0, Time elapsed: 1.259 sec
[junit] Running org.apache.zookeeper.test.SaslClientTest
[junit] Tests run: 1, Failures: 0, Errors: 0, Skipped: 0, Time elapsed: 0.109 sec
[junit] Running org.apache.zookeeper.test.SessionInvalidationTest
[junit] Tests run: 1, Failures: 0, Errors: 0, Skipped: 0, Time elapsed: 1.521 sec
[junit] Running org.apache.zookeeper.test.SessionTest
[junit] Tests run: 6, Failures: 0, Errors: 0, Skipped: 0, Time elapsed: 35.325 sec
[junit] Running org.apache.zookeeper.test.StandaloneTest
[junit] Tests run: 1, Failures: 0, Errors: 0, Skipped: 0, Time elapsed: 1.016 sec
[junit] Running org.apache.zookeeper.test.StatTest
[junit] Tests run: 4, Failures: 0, Errors: 0, Skipped: 0, Time elapsed: 3.93 sec
[junit] Running org.apache.zookeeper.test.StaticHostProviderTest
[junit] Tests run: 7, Failures: 0, Errors: 0, Skipped: 0, Time elapsed: 1.316 sec
[junit] Running org.apache.zookeeper.test.SyncCallTest
[junit] Tests run: 1, Failures: 0, Errors: 0, Skipped: 0, Time elapsed: 1.615 sec
[junit] Running org.apache.zookeeper.test.TruncateTest
[junit] Tests run: 3, Failures: 0, Errors: 0, Skipped: 0, Time elapsed: 11.817 sec
[junit] Running org.apache.zookeeper.test.UpgradeTest
[junit] Tests run: 1, Failures: 0, Errors: 0, Skipped: 0, Time elapsed: 0.96 sec
[junit] Running org.apache.zookeeper.test.WatchedEventTest
[junit] Tests run: 4, Failures: 0, Errors: 0, Skipped: 0, Time elapsed: 0.079 sec
[junit] Running org.apache.zookeeper.test.WatcherFuncTest
[junit] Tests run: 6, Failures: 0, Errors: 0, Skipped: 0, Time elapsed: 1.609 sec
[junit] Running org.apache.zookeeper.test.WatcherTest
[junit] Tests run: 7, Failures: 0, Errors: 0, Skipped: 0, Time elapsed: 31.134 sec
[junit] Running org.apache.zookeeper.test.ZkDatabaseCorruptionTest
[junit] Tests run: 1, Failures: 0, Errors: 0, Skipped: 0, Time elapsed: 16.372 sec
[junit] Running org.apache.zookeeper.test.ZooKeeperQuotaTest
[junit] Tests run: 1, Failures: 0, Errors: 0, Skipped: 0, Time elapsed: 2.913 sec
fail.build.on.test.failure:
BUILD FAILED
/home/jenkins/jenkins-slave/workspace/ZooKeeper_branch34_jdk8/build.xml:1382: The following error occurred while executing this line:
/home/jenkins/jenkins-slave/workspace/ZooKeeper_branch34_jdk8/build.xml:1385: Tests failed!
Total time: 48 minutes 53 seconds
Build step 'Invoke Ant' marked build as failure
Archiving artifacts
Recording test results
Email was triggered for: Failure - Any
Sending email for trigger: Failure - Any
###################################################################################
############################## FAILED TESTS (if any) ##############################
1 tests failed.
FAILED: org.apache.zookeeper.server.quorum.Zab1_0Test.testNormalFollowerRunWithDiff
Error Message:
expected:<4294967298> but was:<0>
Stack Trace:
junit.framework.AssertionFailedError: expected:<4294967298> but was:<0>
at org.apache.zookeeper.server.quorum.Zab1_0Test$5.converseWithFollower(Zab1_0Test.java:861)
at org.apache.zookeeper.server.quorum.Zab1_0Test.testFollowerConversation(Zab1_0Test.java:507)
at org.apache.zookeeper.server.quorum.Zab1_0Test.testNormalFollowerRunWithDiff(Zab1_0Test.java:777)