You are viewing a plain text version of this content. The canonical link for it is here.
Posted to commits@jena.apache.org by Apache Jenkins Server <je...@builds.apache.org> on 2014/10/21 10:46:36 UTC

Build failed in Jenkins: Jena_Development_Test_Windows #452

See <https://builds.apache.org/job/Jena_Development_Test_Windows/452/changes>

Changes:

[andy] Scale then convert to int.

[andy] jena-parent snapshot version

------------------------------------------
Started by an SCM change
Building remotely on windows1 (Windows) in workspace <https://builds.apache.org/job/Jena_Development_Test_Windows/ws/>
 > git rev-parse --is-inside-work-tree
Fetching changes from the remote Git repository
 > git config remote.origin.url git://git.apache.org/jena.git
Fetching upstream changes from git://git.apache.org/jena.git
 > git --version
 > git fetch --tags --progress git://git.apache.org/jena.git +refs/heads/*:refs/remotes/origin/*
 > git rev-parse "origin/master^{commit}"
Checking out Revision ec0d19cc7f9345d8acbef59110083c54d9055a8b (origin/master)
 > git config core.sparsecheckout
 > git checkout -f ec0d19cc7f9345d8acbef59110083c54d9055a8b
 > git rev-list c737fc2cad897cfce931d2e51863a585083f25fc
Parsing POMs
Failed to transfer Could not find metadata org.apache.jena:jena-parent:11-SNAPSHOT/maven-metadata.xml in Nexus (http://repository.apache.org/snapshots)
Failed to transfer Could not find artifact org.apache.jena:jena-parent:pom:11-SNAPSHOT in Nexus (http://repository.apache.org/snapshots)
ERROR: Failed to parse POMs
java.io.IOException: remote file operation failed: <https://builds.apache.org/job/Jena_Development_Test_Windows/ws/> at hudson.remoting.Channel@6f62bea8:windows1
	at hudson.FilePath.act(FilePath.java:910)
	at hudson.FilePath.act(FilePath.java:887)
	at hudson.maven.MavenModuleSetBuild$MavenModuleSetBuildExecution.parsePoms(MavenModuleSetBuild.java:953)
	at hudson.maven.MavenModuleSetBuild$MavenModuleSetBuildExecution.doRun(MavenModuleSetBuild.java:681)
	at hudson.model.AbstractBuild$AbstractBuildExecution.run(AbstractBuild.java:585)
	at hudson.model.Run.execute(Run.java:1676)
	at hudson.maven.MavenModuleSetBuild.run(MavenModuleSetBuild.java:529)
	at hudson.model.ResourceController.execute(ResourceController.java:88)
	at hudson.model.Executor.run(Executor.java:231)
Caused by: hudson.remoting.ProxyException: hudson.maven.MavenModuleSetBuild$MavenExecutionException: org.apache.maven.project.ProjectBuildingException: Some problems were encountered while processing the POMs:
[FATAL] Non-resolvable parent POM: Could not find artifact org.apache.jena:jena-parent:pom:11-SNAPSHOT in Nexus (http://repository.apache.org/snapshots) and 'parent.relativePath' points at no local POM @ line 26, column 11

	at hudson.maven.MavenModuleSetBuild$PomParser.invoke(MavenModuleSetBuild.java:1357)
	at hudson.maven.MavenModuleSetBuild$PomParser.invoke(MavenModuleSetBuild.java:1091)
	at hudson.FilePath$FileCallableWrapper.call(FilePath.java:2462)
	at hudson.remoting.UserRequest.perform(UserRequest.java:118)
	at hudson.remoting.UserRequest.perform(UserRequest.java:48)
	at hudson.remoting.Request$2.run(Request.java:328)
	at hudson.remoting.InterceptingExecutorService$1.call(InterceptingExecutorService.java:72)
	at java.util.concurrent.FutureTask$Sync.innerRun(Unknown Source)
	at java.util.concurrent.FutureTask.run(Unknown Source)
	at java.util.concurrent.ThreadPoolExecutor.runWorker(Unknown Source)
	at java.util.concurrent.ThreadPoolExecutor$Worker.run(Unknown Source)
	at hudson.remoting.Engine$1$1.run(Engine.java:63)
	at java.lang.Thread.run(Unknown Source)
Caused by: hudson.remoting.ProxyException: org.apache.maven.project.ProjectBuildingException: Some problems were encountered while processing the POMs:
[FATAL] Non-resolvable parent POM: Could not find artifact org.apache.jena:jena-parent:pom:11-SNAPSHOT in Nexus (http://repository.apache.org/snapshots) and 'parent.relativePath' points at no local POM @ line 26, column 11

	at org.apache.maven.project.DefaultProjectBuilder.build(DefaultProjectBuilder.java:364)
	at hudson.maven.MavenEmbedder.buildProjects(MavenEmbedder.java:361)
	at hudson.maven.MavenEmbedder.readProjects(MavenEmbedder.java:331)
	at hudson.maven.MavenModuleSetBuild$PomParser.invoke(MavenModuleSetBuild.java:1294)
	... 12 more

Jenkins build is back to normal : Jena_Development_Test_Windows #455

Posted by Apache Jenkins Server <je...@builds.apache.org>.
See <https://builds.apache.org/job/Jena_Development_Test_Windows/455/changes>


Build failed in Jenkins: Jena_Development_Test_Windows #454

Posted by Apache Jenkins Server <je...@builds.apache.org>.
See <https://builds.apache.org/job/Jena_Development_Test_Windows/454/changes>

Changes:

[rvesse] Work towards enabling automatic RAT checks

[rvesse] Work on getting rat:check to pass

[rvesse] RAT checks passing for Jena Core

[rvesse] Get remaining modules to pass RAT checks

[andy] Add license

[andy] Add license headers

[andy] Add license headers

[andy] Remove old stuff

[andy] Remove exclusions that no longer need excluding

[andy] Clarift position of 'testing' files

------------------------------------------
Started by user rvesse
Building remotely on windows1 (Windows) in workspace <https://builds.apache.org/job/Jena_Development_Test_Windows/ws/>
 > git rev-parse --is-inside-work-tree
Fetching changes from the remote Git repository
 > git config remote.origin.url git://git.apache.org/jena.git
Fetching upstream changes from git://git.apache.org/jena.git
 > git --version
 > git fetch --tags --progress git://git.apache.org/jena.git +refs/heads/*:refs/remotes/origin/*
 > git rev-parse "origin/master^{commit}"
Checking out Revision 6252acede5822d8ffacec141d20c88028c25836c (origin/master)
 > git config core.sparsecheckout
 > git checkout -f 6252acede5822d8ffacec141d20c88028c25836c
 > git rev-list 17a2537bbe5fe7858e1d854c690e72a0108bd532
Parsing POMs
Failed to transfer Could not find metadata org.apache.jena:jena-parent:11-SNAPSHOT/maven-metadata.xml in Nexus (http://repository.apache.org/snapshots)
Failed to transfer Could not find artifact org.apache.jena:jena-parent:pom:11-SNAPSHOT in Nexus (http://repository.apache.org/snapshots)
ERROR: Failed to parse POMs
java.io.IOException: remote file operation failed: <https://builds.apache.org/job/Jena_Development_Test_Windows/ws/> at hudson.remoting.Channel@6f62bea8:windows1
	at hudson.FilePath.act(FilePath.java:910)
	at hudson.FilePath.act(FilePath.java:887)
	at hudson.maven.MavenModuleSetBuild$MavenModuleSetBuildExecution.parsePoms(MavenModuleSetBuild.java:953)
	at hudson.maven.MavenModuleSetBuild$MavenModuleSetBuildExecution.doRun(MavenModuleSetBuild.java:681)
	at hudson.model.AbstractBuild$AbstractBuildExecution.run(AbstractBuild.java:585)
	at hudson.model.Run.execute(Run.java:1676)
	at hudson.maven.MavenModuleSetBuild.run(MavenModuleSetBuild.java:529)
	at hudson.model.ResourceController.execute(ResourceController.java:88)
	at hudson.model.Executor.run(Executor.java:231)
Caused by: hudson.remoting.ProxyException: hudson.maven.MavenModuleSetBuild$MavenExecutionException: org.apache.maven.project.ProjectBuildingException: Some problems were encountered while processing the POMs:
[FATAL] Non-resolvable parent POM: Could not find artifact org.apache.jena:jena-parent:pom:11-SNAPSHOT in Nexus (http://repository.apache.org/snapshots) and 'parent.relativePath' points at no local POM @ line 26, column 11

	at hudson.maven.MavenModuleSetBuild$PomParser.invoke(MavenModuleSetBuild.java:1357)
	at hudson.maven.MavenModuleSetBuild$PomParser.invoke(MavenModuleSetBuild.java:1091)
	at hudson.FilePath$FileCallableWrapper.call(FilePath.java:2462)
	at hudson.remoting.UserRequest.perform(UserRequest.java:118)
	at hudson.remoting.UserRequest.perform(UserRequest.java:48)
	at hudson.remoting.Request$2.run(Request.java:328)
	at hudson.remoting.InterceptingExecutorService$1.call(InterceptingExecutorService.java:72)
	at java.util.concurrent.FutureTask$Sync.innerRun(Unknown Source)
	at java.util.concurrent.FutureTask.run(Unknown Source)
	at java.util.concurrent.ThreadPoolExecutor.runWorker(Unknown Source)
	at java.util.concurrent.ThreadPoolExecutor$Worker.run(Unknown Source)
	at hudson.remoting.Engine$1$1.run(Engine.java:63)
	at java.lang.Thread.run(Unknown Source)
Caused by: hudson.remoting.ProxyException: org.apache.maven.project.ProjectBuildingException: Some problems were encountered while processing the POMs:
[FATAL] Non-resolvable parent POM: Could not find artifact org.apache.jena:jena-parent:pom:11-SNAPSHOT in Nexus (http://repository.apache.org/snapshots) and 'parent.relativePath' points at no local POM @ line 26, column 11

	at org.apache.maven.project.DefaultProjectBuilder.build(DefaultProjectBuilder.java:364)
	at hudson.maven.MavenEmbedder.buildProjects(MavenEmbedder.java:361)
	at hudson.maven.MavenEmbedder.readProjects(MavenEmbedder.java:331)
	at hudson.maven.MavenModuleSetBuild$PomParser.invoke(MavenModuleSetBuild.java:1294)
	... 12 more

Build failed in Jenkins: Jena_Development_Test_Windows #453

Posted by Apache Jenkins Server <je...@builds.apache.org>.
See <https://builds.apache.org/job/Jena_Development_Test_Windows/453/changes>

Changes:

[andy] JENA-802 : Handle blank nodes in the same way that jena-text does

------------------------------------------
Started by an SCM change
Building remotely on windows1 (Windows) in workspace <https://builds.apache.org/job/Jena_Development_Test_Windows/ws/>
 > git rev-parse --is-inside-work-tree
Fetching changes from the remote Git repository
 > git config remote.origin.url git://git.apache.org/jena.git
Fetching upstream changes from git://git.apache.org/jena.git
 > git --version
 > git fetch --tags --progress git://git.apache.org/jena.git +refs/heads/*:refs/remotes/origin/*
 > git rev-parse "origin/master^{commit}"
Checking out Revision 17a2537bbe5fe7858e1d854c690e72a0108bd532 (origin/master)
 > git config core.sparsecheckout
 > git checkout -f 17a2537bbe5fe7858e1d854c690e72a0108bd532
 > git rev-list ec0d19cc7f9345d8acbef59110083c54d9055a8b
Parsing POMs
Failed to transfer Could not find metadata org.apache.jena:jena-parent:11-SNAPSHOT/maven-metadata.xml in Nexus (http://repository.apache.org/snapshots)
Failed to transfer Could not find artifact org.apache.jena:jena-parent:pom:11-SNAPSHOT in Nexus (http://repository.apache.org/snapshots)
ERROR: Failed to parse POMs
java.io.IOException: remote file operation failed: <https://builds.apache.org/job/Jena_Development_Test_Windows/ws/> at hudson.remoting.Channel@6f62bea8:windows1
	at hudson.FilePath.act(FilePath.java:910)
	at hudson.FilePath.act(FilePath.java:887)
	at hudson.maven.MavenModuleSetBuild$MavenModuleSetBuildExecution.parsePoms(MavenModuleSetBuild.java:953)
	at hudson.maven.MavenModuleSetBuild$MavenModuleSetBuildExecution.doRun(MavenModuleSetBuild.java:681)
	at hudson.model.AbstractBuild$AbstractBuildExecution.run(AbstractBuild.java:585)
	at hudson.model.Run.execute(Run.java:1676)
	at hudson.maven.MavenModuleSetBuild.run(MavenModuleSetBuild.java:529)
	at hudson.model.ResourceController.execute(ResourceController.java:88)
	at hudson.model.Executor.run(Executor.java:231)
Caused by: hudson.remoting.ProxyException: hudson.maven.MavenModuleSetBuild$MavenExecutionException: org.apache.maven.project.ProjectBuildingException: Some problems were encountered while processing the POMs:
[FATAL] Non-resolvable parent POM: Could not find artifact org.apache.jena:jena-parent:pom:11-SNAPSHOT in Nexus (http://repository.apache.org/snapshots) and 'parent.relativePath' points at no local POM @ line 26, column 11

	at hudson.maven.MavenModuleSetBuild$PomParser.invoke(MavenModuleSetBuild.java:1357)
	at hudson.maven.MavenModuleSetBuild$PomParser.invoke(MavenModuleSetBuild.java:1091)
	at hudson.FilePath$FileCallableWrapper.call(FilePath.java:2462)
	at hudson.remoting.UserRequest.perform(UserRequest.java:118)
	at hudson.remoting.UserRequest.perform(UserRequest.java:48)
	at hudson.remoting.Request$2.run(Request.java:328)
	at hudson.remoting.InterceptingExecutorService$1.call(InterceptingExecutorService.java:72)
	at java.util.concurrent.FutureTask$Sync.innerRun(Unknown Source)
	at java.util.concurrent.FutureTask.run(Unknown Source)
	at java.util.concurrent.ThreadPoolExecutor.runWorker(Unknown Source)
	at java.util.concurrent.ThreadPoolExecutor$Worker.run(Unknown Source)
	at hudson.remoting.Engine$1$1.run(Engine.java:63)
	at java.lang.Thread.run(Unknown Source)
Caused by: hudson.remoting.ProxyException: org.apache.maven.project.ProjectBuildingException: Some problems were encountered while processing the POMs:
[FATAL] Non-resolvable parent POM: Could not find artifact org.apache.jena:jena-parent:pom:11-SNAPSHOT in Nexus (http://repository.apache.org/snapshots) and 'parent.relativePath' points at no local POM @ line 26, column 11

	at org.apache.maven.project.DefaultProjectBuilder.build(DefaultProjectBuilder.java:364)
	at hudson.maven.MavenEmbedder.buildProjects(MavenEmbedder.java:361)
	at hudson.maven.MavenEmbedder.readProjects(MavenEmbedder.java:331)
	at hudson.maven.MavenModuleSetBuild$PomParser.invoke(MavenModuleSetBuild.java:1294)
	... 12 more