You are viewing a plain text version of this content. The canonical link for it is here.
Posted to dev@lucene.apache.org by Apache Hudson Server <hu...@hudson.apache.org> on 2011/03/08 23:04:44 UTC
[HUDSON] Lucene-Solr-tests-only-trunk - Build # 5711 - Failure
Build: https://hudson.apache.org/hudson/job/Lucene-Solr-tests-only-trunk/5711/
No tests ran.
Build Log (for compile errors):
[...truncated 100 lines...]
---------------------------------------------------------------------
To unsubscribe, e-mail: dev-unsubscribe@lucene.apache.org
For additional commands, e-mail: dev-help@lucene.apache.org
[HUDSON] Lucene-Solr-tests-only-trunk - Build # 5717 - Still
Failing
Posted by Apache Hudson Server <hu...@hudson.apache.org>.
Build: https://hudson.apache.org/hudson/job/Lucene-Solr-tests-only-trunk/5717/
No tests ran.
Build Log (for compile errors):
[...truncated 34 lines...]
---------------------------------------------------------------------
To unsubscribe, e-mail: dev-unsubscribe@lucene.apache.org
For additional commands, e-mail: dev-help@lucene.apache.org
[HUDSON] Lucene-Solr-tests-only-trunk - Build # 5716 - Still
Failing
Posted by Apache Hudson Server <hu...@hudson.apache.org>.
Build: https://hudson.apache.org/hudson/job/Lucene-Solr-tests-only-trunk/5716/
2 tests failed.
FAILED: org.apache.solr.update.DirectUpdateHandlerOptimizeTest.testWatchChildren
Error Message:
Forked Java VM exited abnormally. Please note the time in the report does not reflect the time until the VM exit.
Stack Trace:
junit.framework.AssertionFailedError: Forked Java VM exited abnormally. Please note the time in the report does not reflect the time until the VM exit.
at java.lang.Thread.run(Thread.java:679)
FAILED: TEST-org.apache.solr.cloud.ZkSolrClientTest.xml.<init>
Error Message:
Stack Trace:
Test report file /home/hudson/hudson-slave/workspace/Lucene-Solr-tests-only-trunk/checkout/solr/build/test-results/TEST-org.apache.solr.cloud.ZkSolrClientTest.xml was length 0
Build Log (for compile errors):
[...truncated 8462 lines...]
---------------------------------------------------------------------
To unsubscribe, e-mail: dev-unsubscribe@lucene.apache.org
For additional commands, e-mail: dev-help@lucene.apache.org
[HUDSON] Lucene-Solr-tests-only-trunk - Build # 5715 - Still
Failing
Posted by Apache Hudson Server <hu...@hudson.apache.org>.
Build: https://hudson.apache.org/hudson/job/Lucene-Solr-tests-only-trunk/5715/
No tests ran.
Build Log (for compile errors):
[...truncated 36 lines...]
---------------------------------------------------------------------
To unsubscribe, e-mail: dev-unsubscribe@lucene.apache.org
For additional commands, e-mail: dev-help@lucene.apache.org
[HUDSON] Lucene-Solr-tests-only-trunk - Build # 5714 - Still
Failing
Posted by Apache Hudson Server <hu...@hudson.apache.org>.
Build: https://hudson.apache.org/hudson/job/Lucene-Solr-tests-only-trunk/5714/
No tests ran.
Build Log (for compile errors):
[...truncated 36 lines...]
---------------------------------------------------------------------
To unsubscribe, e-mail: dev-unsubscribe@lucene.apache.org
For additional commands, e-mail: dev-help@lucene.apache.org
[HUDSON] Lucene-Solr-tests-only-trunk - Build # 5713 - Still
Failing
Posted by Apache Hudson Server <hu...@hudson.apache.org>.
Build: https://hudson.apache.org/hudson/job/Lucene-Solr-tests-only-trunk/5713/
No tests ran.
Build Log (for compile errors):
[...truncated 36 lines...]
---------------------------------------------------------------------
To unsubscribe, e-mail: dev-unsubscribe@lucene.apache.org
For additional commands, e-mail: dev-help@lucene.apache.org
[HUDSON] Lucene-Solr-tests-only-trunk - Build # 5712 - Still
Failing
Posted by Apache Hudson Server <hu...@hudson.apache.org>.
Build: https://hudson.apache.org/hudson/job/Lucene-Solr-tests-only-trunk/5712/
No tests ran.
Build Log (for compile errors):
[...truncated 36 lines...]
---------------------------------------------------------------------
To unsubscribe, e-mail: dev-unsubscribe@lucene.apache.org
For additional commands, e-mail: dev-help@lucene.apache.org
[HUDSON] Lucene-Solr-tests-only-trunk - Build # 5730 - Still
Failing
Posted by Apache Hudson Server <hu...@hudson.apache.org>.
Build: https://hudson.apache.org/hudson/job/Lucene-Solr-tests-only-trunk/5730/
2 tests failed.
FAILED: org.apache.solr.update.DirectUpdateHandlerOptimizeTest.testWatchChildren
Error Message:
Forked Java VM exited abnormally. Please note the time in the report does not reflect the time until the VM exit.
Stack Trace:
junit.framework.AssertionFailedError: Forked Java VM exited abnormally. Please note the time in the report does not reflect the time until the VM exit.
at java.lang.Thread.run(Thread.java:636)
FAILED: TEST-org.apache.solr.cloud.ZkSolrClientTest.xml.<init>
Error Message:
Stack Trace:
Test report file /home/hudson/hudson-slave/workspace/Lucene-Solr-tests-only-trunk/checkout/solr/build/test-results/TEST-org.apache.solr.cloud.ZkSolrClientTest.xml was length 0
Build Log (for compile errors):
[...truncated 8498 lines...]
---------------------------------------------------------------------
To unsubscribe, e-mail: dev-unsubscribe@lucene.apache.org
For additional commands, e-mail: dev-help@lucene.apache.org
[HUDSON] Lucene-Solr-tests-only-trunk - Build # 5729 - Still
Failing
Posted by Apache Hudson Server <hu...@hudson.apache.org>.
Build: https://hudson.apache.org/hudson/job/Lucene-Solr-tests-only-trunk/5729/
No tests ran.
Build Log (for compile errors):
[...truncated 43 lines...]
clean:
[echo] Building analyzers-icu...
clean:
[echo] Building analyzers-phonetic...
clean:
[echo] Building analyzers-smartcn...
clean:
[echo] Building analyzers-stempel...
clean:
[echo] Building benchmark...
clean:
clean-contrib:
clean:
clean:
clean:
clean:
clean:
clean:
BUILD SUCCESSFUL
Total time: 1 second
+ cd /home/hudson/hudson-slave/workspace/Lucene-Solr-tests-only-trunk/checkout/lucene
+ JAVA_HOME=/home/hudson/tools/java/latest1.5 /home/hudson/tools/ant/latest1.7/bin/ant compile compile-test build-contrib
Buildfile: build.xml
jflex-uptodate-check:
jflex-notice:
javacc-uptodate-check:
javacc-notice:
init:
clover.setup:
clover.info:
[echo]
[echo] Clover not found. Code coverage reports disabled.
[echo]
clover:
common.compile-core:
[mkdir] Created dir: /usr/home/hudson/hudson-slave/workspace/Lucene-Solr-tests-only-trunk/checkout/lucene/build/classes/java
[javac] Compiling 508 source files to /usr/home/hudson/hudson-slave/workspace/Lucene-Solr-tests-only-trunk/checkout/lucene/build/classes/java
[javac] /usr/home/hudson/hudson-slave/workspace/Lucene-Solr-tests-only-trunk/checkout/lucene/src/java/org/apache/lucene/util/Version.java:80: warning: [dep-ann] deprecated name isnt annotated with @Deprecated
[javac] public boolean onOrAfter(Version other) {
[javac] ^
[javac] /usr/home/hudson/hudson-slave/workspace/Lucene-Solr-tests-only-trunk/checkout/lucene/src/java/org/apache/lucene/search/SortField.java:415: inconvertible types
[javac] found : org.apache.lucene.search.cache.CachedArrayCreator<capture of ?>
[javac] required: org.apache.lucene.search.cache.IntValuesCreator
[javac] return new FieldComparator.IntComparator(numHits, (IntValuesCreator)creator, (Integer)missingValue );
[javac] ^
[javac] /usr/home/hudson/hudson-slave/workspace/Lucene-Solr-tests-only-trunk/checkout/lucene/src/java/org/apache/lucene/search/SortField.java:418: inconvertible types
[javac] found : org.apache.lucene.search.cache.CachedArrayCreator<capture of ?>
[javac] required: org.apache.lucene.search.cache.FloatValuesCreator
[javac] return new FieldComparator.FloatComparator(numHits, (FloatValuesCreator)creator, (Float)missingValue );
[javac] ^
[javac] /usr/home/hudson/hudson-slave/workspace/Lucene-Solr-tests-only-trunk/checkout/lucene/src/java/org/apache/lucene/search/SortField.java:421: inconvertible types
[javac] found : org.apache.lucene.search.cache.CachedArrayCreator<capture of ?>
[javac] required: org.apache.lucene.search.cache.LongValuesCreator
[javac] return new FieldComparator.LongComparator(numHits, (LongValuesCreator)creator, (Long)missingValue );
[javac] ^
[javac] /usr/home/hudson/hudson-slave/workspace/Lucene-Solr-tests-only-trunk/checkout/lucene/src/java/org/apache/lucene/search/SortField.java:424: inconvertible types
[javac] found : org.apache.lucene.search.cache.CachedArrayCreator<capture of ?>
[javac] required: org.apache.lucene.search.cache.DoubleValuesCreator
[javac] return new FieldComparator.DoubleComparator(numHits, (DoubleValuesCreator)creator, (Double)missingValue );
[javac] ^
[javac] /usr/home/hudson/hudson-slave/workspace/Lucene-Solr-tests-only-trunk/checkout/lucene/src/java/org/apache/lucene/search/SortField.java:427: inconvertible types
[javac] found : org.apache.lucene.search.cache.CachedArrayCreator<capture of ?>
[javac] required: org.apache.lucene.search.cache.ByteValuesCreator
[javac] return new FieldComparator.ByteComparator(numHits, (ByteValuesCreator)creator, (Byte)missingValue );
[javac] ^
[javac] /usr/home/hudson/hudson-slave/workspace/Lucene-Solr-tests-only-trunk/checkout/lucene/src/java/org/apache/lucene/search/SortField.java:430: inconvertible types
[javac] found : org.apache.lucene.search.cache.CachedArrayCreator<capture of ?>
[javac] required: org.apache.lucene.search.cache.ShortValuesCreator
[javac] return new FieldComparator.ShortComparator(numHits, (ShortValuesCreator)creator, (Short)missingValue );
[javac] ^
[javac] /usr/home/hudson/hudson-slave/workspace/Lucene-Solr-tests-only-trunk/checkout/lucene/src/java/org/apache/lucene/queryParser/CharStream.java:34: warning: [dep-ann] deprecated name isnt annotated with @Deprecated
[javac] int getColumn();
[javac] ^
[javac] /usr/home/hudson/hudson-slave/workspace/Lucene-Solr-tests-only-trunk/checkout/lucene/src/java/org/apache/lucene/queryParser/CharStream.java:41: warning: [dep-ann] deprecated name isnt annotated with @Deprecated
[javac] int getLine();
[javac] ^
[javac] Note: Some input files use or override a deprecated API.
[javac] Note: Recompile with -Xlint:deprecation for details.
[javac] 6 errors
[...truncated 10 lines...]
---------------------------------------------------------------------
To unsubscribe, e-mail: dev-unsubscribe@lucene.apache.org
For additional commands, e-mail: dev-help@lucene.apache.org
Re: [HUDSON] Lucene-Solr-tests-only-trunk - Build # 5728 - Still Failing
Posted by Robert Muir <rc...@gmail.com>.
On Wed, Mar 9, 2011 at 5:03 AM, Uwe Schindler <uw...@thetaphi.de> wrote:
> All problems seem to be solved now:
> - Clover's use of X/freetype works (broken openjdk installation fixed)
> - Compile error in those antique JDK 1.5 (because of ugly casts) resolved by removing some generics in SortField.java (added comment in source code why I did this, not that some Eclipse user "repairs" it again)
>
> We still have to wait until all Hudson/Jenkins tasks were run at least one time, but it looks good now.
>
Thanks for all your hard efforts Uwe! (I know you were working for a
long time to fix these issues).
Are there any steps we can take to avoid this whole situation from
happening again?
---------------------------------------------------------------------
To unsubscribe, e-mail: dev-unsubscribe@lucene.apache.org
For additional commands, e-mail: dev-help@lucene.apache.org
RE: [HUDSON] Lucene-Solr-tests-only-trunk - Build # 5728 - Still Failing
Posted by Uwe Schindler <uw...@thetaphi.de>.
All problems seem to be solved now:
- Clover's use of X/freetype works (broken openjdk installation fixed)
- Compile error in those antique JDK 1.5 (because of ugly casts) resolved by removing some generics in SortField.java (added comment in source code why I did this, not that some Eclipse user "repairs" it again)
We still have to wait until all Hudson/Jenkins tasks were run at least one time, but it looks good now.
-----
Uwe Schindler
H.-H.-Meier-Allee 63, D-28213 Bremen
http://www.thetaphi.de
eMail: uwe@thetaphi.de
> -----Original Message-----
> From: Uwe Schindler [mailto:uwe@thetaphi.de]
> Sent: Wednesday, March 09, 2011 9:57 AM
> To: dev@lucene.apache.org
> Subject: RE: [HUDSON] Lucene-Solr-tests-only-trunk - Build # 5728 - Still
> Failing
>
> > The Clover problems with libfreetype.so.9 are caused by Openjdk and
> > Clover (which seems to access swing/awt/X????). I will try to add missing
> libs.
>
> This should be solved now, packages now all available and working.
>
> Left over is the FieldCache compile error, I would like to fix this in trunk's
> source code.
>
> Uwe
>
>
> ---------------------------------------------------------------------
> To unsubscribe, e-mail: dev-unsubscribe@lucene.apache.org For additional
> commands, e-mail: dev-help@lucene.apache.org
---------------------------------------------------------------------
To unsubscribe, e-mail: dev-unsubscribe@lucene.apache.org
For additional commands, e-mail: dev-help@lucene.apache.org
RE: [HUDSON] Lucene-Solr-tests-only-trunk - Build # 5728 - Still Failing
Posted by Uwe Schindler <uw...@thetaphi.de>.
> The Clover problems with libfreetype.so.9 are caused by Openjdk and Clover
> (which seems to access swing/awt/X????). I will try to add missing libs.
This should be solved now, packages now all available and working.
Left over is the FieldCache compile error, I would like to fix this in trunk's source code.
Uwe
---------------------------------------------------------------------
To unsubscribe, e-mail: dev-unsubscribe@lucene.apache.org
For additional commands, e-mail: dev-help@lucene.apache.org
RE: [HUDSON] Lucene-Solr-tests-only-trunk - Build # 5728 - Still Failing
Posted by Uwe Schindler <uw...@thetaphi.de>.
Hi,
I am sorry, I woke up shortly ago. The problem here is (as told yesterday), that our 1.5 compilation is done using a very old JDK 1.5.0_07 and it seems that this version is more strict on the really broken unchecked casts in the new FieldCache code.
The Clover problems with libfreetype.so.9 are caused by Openjdk and Clover (which seems to access swing/awt/X????). I will try to add missing libs.
I have no idea, when this will be fixed, so don't hurt me because of Hudson/Jenkins spam and broken builds. There is nothing I can do except fighting against this horrible FreeBSD Jail with very poor Java support - for the ASF with having more than 50% of Java Projects, choosing FreeBSD as O/S of a development/build/project virtual machine is in my opinion a very bad idea (and infra stuff is unfriendly and unhelpful - just my personal opinion).
Uwe
-----
Uwe Schindler
H.-H.-Meier-Allee 63, D-28213 Bremen
http://www.thetaphi.de
eMail: uwe@thetaphi.de
> -----Original Message-----
> From: Apache Hudson Server [mailto:hudson@hudson.apache.org]
> Sent: Wednesday, March 09, 2011 8:55 AM
> To: dev@lucene.apache.org
> Subject: [HUDSON] Lucene-Solr-tests-only-trunk - Build # 5728 - Still Failing
>
> Build: https://hudson.apache.org/hudson/job/Lucene-Solr-tests-only-
> trunk/5728/
>
> No tests ran.
>
> Build Log (for compile errors):
> [...truncated 43 lines...]
> clean:
> [echo] Building analyzers-icu...
>
> clean:
> [echo] Building analyzers-phonetic...
>
> clean:
> [echo] Building analyzers-smartcn...
>
> clean:
> [echo] Building analyzers-stempel...
>
> clean:
> [echo] Building benchmark...
>
> clean:
>
> clean-contrib:
>
> clean:
>
> clean:
>
> clean:
>
> clean:
>
> clean:
>
> clean:
>
> BUILD SUCCESSFUL
> Total time: 1 second
> + cd
> + /home/hudson/hudson-slave/workspace/Lucene-Solr-tests-only-
> trunk/check
> + out/lucene
> + JAVA_HOME=/home/hudson/tools/java/latest1.5
> + /home/hudson/tools/ant/latest1.7/bin/ant compile compile-test
> + build-contrib
> Buildfile: build.xml
>
> jflex-uptodate-check:
>
> jflex-notice:
>
> javacc-uptodate-check:
>
> javacc-notice:
>
> init:
>
> clover.setup:
>
> clover.info:
> [echo]
> [echo] Clover not found. Code coverage reports disabled.
> [echo]
>
> clover:
>
> common.compile-core:
> [mkdir] Created dir: /usr/home/hudson/hudson-slave/workspace/Lucene-
> Solr-tests-only-trunk/checkout/lucene/build/classes/java
> [javac] Compiling 508 source files to /usr/home/hudson/hudson-
> slave/workspace/Lucene-Solr-tests-only-
> trunk/checkout/lucene/build/classes/java
> [javac] /usr/home/hudson/hudson-slave/workspace/Lucene-Solr-tests-
> only-
> trunk/checkout/lucene/src/java/org/apache/lucene/util/Version.java:80:
> warning: [dep-ann] deprecated name isnt annotated with @Deprecated
> [javac] public boolean onOrAfter(Version other) {
> [javac] ^
> [javac] /usr/home/hudson/hudson-slave/workspace/Lucene-Solr-tests-
> only-
> trunk/checkout/lucene/src/java/org/apache/lucene/search/SortField.java:4
> 15: inconvertible types
> [javac] found :
> org.apache.lucene.search.cache.CachedArrayCreator<capture of ?>
> [javac] required: org.apache.lucene.search.cache.IntValuesCreator
> [javac] return new FieldComparator.IntComparator(numHits,
> (IntValuesCreator)creator, (Integer)missingValue );
> [javac] ^
> [javac] /usr/home/hudson/hudson-slave/workspace/Lucene-Solr-tests-
> only-
> trunk/checkout/lucene/src/java/org/apache/lucene/search/SortField.java:4
> 18: inconvertible types
> [javac] found :
> org.apache.lucene.search.cache.CachedArrayCreator<capture of ?>
> [javac] required: org.apache.lucene.search.cache.FloatValuesCreator
> [javac] return new FieldComparator.FloatComparator(numHits,
> (FloatValuesCreator)creator, (Float)missingValue );
> [javac] ^
> [javac] /usr/home/hudson/hudson-slave/workspace/Lucene-Solr-tests-
> only-
> trunk/checkout/lucene/src/java/org/apache/lucene/search/SortField.java:4
> 21: inconvertible types
> [javac] found :
> org.apache.lucene.search.cache.CachedArrayCreator<capture of ?>
> [javac] required: org.apache.lucene.search.cache.LongValuesCreator
> [javac] return new FieldComparator.LongComparator(numHits,
> (LongValuesCreator)creator, (Long)missingValue );
> [javac] ^
> [javac] /usr/home/hudson/hudson-slave/workspace/Lucene-Solr-tests-
> only-
> trunk/checkout/lucene/src/java/org/apache/lucene/search/SortField.java:4
> 24: inconvertible types
> [javac] found :
> org.apache.lucene.search.cache.CachedArrayCreator<capture of ?>
> [javac] required: org.apache.lucene.search.cache.DoubleValuesCreator
> [javac] return new FieldComparator.DoubleComparator(numHits,
> (DoubleValuesCreator)creator, (Double)missingValue );
> [javac] ^
> [javac] /usr/home/hudson/hudson-slave/workspace/Lucene-Solr-tests-
> only-
> trunk/checkout/lucene/src/java/org/apache/lucene/search/SortField.java:4
> 27: inconvertible types
> [javac] found :
> org.apache.lucene.search.cache.CachedArrayCreator<capture of ?>
> [javac] required: org.apache.lucene.search.cache.ByteValuesCreator
> [javac] return new FieldComparator.ByteComparator(numHits,
> (ByteValuesCreator)creator, (Byte)missingValue );
> [javac] ^
> [javac] /usr/home/hudson/hudson-slave/workspace/Lucene-Solr-tests-
> only-
> trunk/checkout/lucene/src/java/org/apache/lucene/search/SortField.java:4
> 30: inconvertible types
> [javac] found :
> org.apache.lucene.search.cache.CachedArrayCreator<capture of ?>
> [javac] required: org.apache.lucene.search.cache.ShortValuesCreator
> [javac] return new FieldComparator.ShortComparator(numHits,
> (ShortValuesCreator)creator, (Short)missingValue );
> [javac] ^
> [javac] /usr/home/hudson/hudson-slave/workspace/Lucene-Solr-tests-
> only-
> trunk/checkout/lucene/src/java/org/apache/lucene/queryParser/CharStrea
> m.java:34: warning: [dep-ann] deprecated name isnt annotated with
> @Deprecated
> [javac] int getColumn();
> [javac] ^
> [javac] /usr/home/hudson/hudson-slave/workspace/Lucene-Solr-tests-
> only-
> trunk/checkout/lucene/src/java/org/apache/lucene/queryParser/CharStrea
> m.java:41: warning: [dep-ann] deprecated name isnt annotated with
> @Deprecated
> [javac] int getLine();
> [javac] ^
> [javac] Note: Some input files use or override a deprecated API.
> [javac] Note: Recompile with -Xlint:deprecation for details.
> [javac] 6 errors
> [...truncated 10 lines...]
>
>
>
> ---------------------------------------------------------------------
> To unsubscribe, e-mail: dev-unsubscribe@lucene.apache.org For additional
> commands, e-mail: dev-help@lucene.apache.org
---------------------------------------------------------------------
To unsubscribe, e-mail: dev-unsubscribe@lucene.apache.org
For additional commands, e-mail: dev-help@lucene.apache.org
[HUDSON] Lucene-Solr-tests-only-trunk - Build # 5728 - Still
Failing
Posted by Apache Hudson Server <hu...@hudson.apache.org>.
Build: https://hudson.apache.org/hudson/job/Lucene-Solr-tests-only-trunk/5728/
No tests ran.
Build Log (for compile errors):
[...truncated 43 lines...]
clean:
[echo] Building analyzers-icu...
clean:
[echo] Building analyzers-phonetic...
clean:
[echo] Building analyzers-smartcn...
clean:
[echo] Building analyzers-stempel...
clean:
[echo] Building benchmark...
clean:
clean-contrib:
clean:
clean:
clean:
clean:
clean:
clean:
BUILD SUCCESSFUL
Total time: 1 second
+ cd /home/hudson/hudson-slave/workspace/Lucene-Solr-tests-only-trunk/checkout/lucene
+ JAVA_HOME=/home/hudson/tools/java/latest1.5 /home/hudson/tools/ant/latest1.7/bin/ant compile compile-test build-contrib
Buildfile: build.xml
jflex-uptodate-check:
jflex-notice:
javacc-uptodate-check:
javacc-notice:
init:
clover.setup:
clover.info:
[echo]
[echo] Clover not found. Code coverage reports disabled.
[echo]
clover:
common.compile-core:
[mkdir] Created dir: /usr/home/hudson/hudson-slave/workspace/Lucene-Solr-tests-only-trunk/checkout/lucene/build/classes/java
[javac] Compiling 508 source files to /usr/home/hudson/hudson-slave/workspace/Lucene-Solr-tests-only-trunk/checkout/lucene/build/classes/java
[javac] /usr/home/hudson/hudson-slave/workspace/Lucene-Solr-tests-only-trunk/checkout/lucene/src/java/org/apache/lucene/util/Version.java:80: warning: [dep-ann] deprecated name isnt annotated with @Deprecated
[javac] public boolean onOrAfter(Version other) {
[javac] ^
[javac] /usr/home/hudson/hudson-slave/workspace/Lucene-Solr-tests-only-trunk/checkout/lucene/src/java/org/apache/lucene/search/SortField.java:415: inconvertible types
[javac] found : org.apache.lucene.search.cache.CachedArrayCreator<capture of ?>
[javac] required: org.apache.lucene.search.cache.IntValuesCreator
[javac] return new FieldComparator.IntComparator(numHits, (IntValuesCreator)creator, (Integer)missingValue );
[javac] ^
[javac] /usr/home/hudson/hudson-slave/workspace/Lucene-Solr-tests-only-trunk/checkout/lucene/src/java/org/apache/lucene/search/SortField.java:418: inconvertible types
[javac] found : org.apache.lucene.search.cache.CachedArrayCreator<capture of ?>
[javac] required: org.apache.lucene.search.cache.FloatValuesCreator
[javac] return new FieldComparator.FloatComparator(numHits, (FloatValuesCreator)creator, (Float)missingValue );
[javac] ^
[javac] /usr/home/hudson/hudson-slave/workspace/Lucene-Solr-tests-only-trunk/checkout/lucene/src/java/org/apache/lucene/search/SortField.java:421: inconvertible types
[javac] found : org.apache.lucene.search.cache.CachedArrayCreator<capture of ?>
[javac] required: org.apache.lucene.search.cache.LongValuesCreator
[javac] return new FieldComparator.LongComparator(numHits, (LongValuesCreator)creator, (Long)missingValue );
[javac] ^
[javac] /usr/home/hudson/hudson-slave/workspace/Lucene-Solr-tests-only-trunk/checkout/lucene/src/java/org/apache/lucene/search/SortField.java:424: inconvertible types
[javac] found : org.apache.lucene.search.cache.CachedArrayCreator<capture of ?>
[javac] required: org.apache.lucene.search.cache.DoubleValuesCreator
[javac] return new FieldComparator.DoubleComparator(numHits, (DoubleValuesCreator)creator, (Double)missingValue );
[javac] ^
[javac] /usr/home/hudson/hudson-slave/workspace/Lucene-Solr-tests-only-trunk/checkout/lucene/src/java/org/apache/lucene/search/SortField.java:427: inconvertible types
[javac] found : org.apache.lucene.search.cache.CachedArrayCreator<capture of ?>
[javac] required: org.apache.lucene.search.cache.ByteValuesCreator
[javac] return new FieldComparator.ByteComparator(numHits, (ByteValuesCreator)creator, (Byte)missingValue );
[javac] ^
[javac] /usr/home/hudson/hudson-slave/workspace/Lucene-Solr-tests-only-trunk/checkout/lucene/src/java/org/apache/lucene/search/SortField.java:430: inconvertible types
[javac] found : org.apache.lucene.search.cache.CachedArrayCreator<capture of ?>
[javac] required: org.apache.lucene.search.cache.ShortValuesCreator
[javac] return new FieldComparator.ShortComparator(numHits, (ShortValuesCreator)creator, (Short)missingValue );
[javac] ^
[javac] /usr/home/hudson/hudson-slave/workspace/Lucene-Solr-tests-only-trunk/checkout/lucene/src/java/org/apache/lucene/queryParser/CharStream.java:34: warning: [dep-ann] deprecated name isnt annotated with @Deprecated
[javac] int getColumn();
[javac] ^
[javac] /usr/home/hudson/hudson-slave/workspace/Lucene-Solr-tests-only-trunk/checkout/lucene/src/java/org/apache/lucene/queryParser/CharStream.java:41: warning: [dep-ann] deprecated name isnt annotated with @Deprecated
[javac] int getLine();
[javac] ^
[javac] Note: Some input files use or override a deprecated API.
[javac] Note: Recompile with -Xlint:deprecation for details.
[javac] 6 errors
[...truncated 10 lines...]
---------------------------------------------------------------------
To unsubscribe, e-mail: dev-unsubscribe@lucene.apache.org
For additional commands, e-mail: dev-help@lucene.apache.org
[HUDSON] Lucene-Solr-tests-only-trunk - Build # 5727 - Still
Failing
Posted by Apache Hudson Server <hu...@hudson.apache.org>.
Build: https://hudson.apache.org/hudson/job/Lucene-Solr-tests-only-trunk/5727/
No tests ran.
Build Log (for compile errors):
[...truncated 43 lines...]
clean:
[echo] Building analyzers-icu...
clean:
[echo] Building analyzers-phonetic...
clean:
[echo] Building analyzers-smartcn...
clean:
[echo] Building analyzers-stempel...
clean:
[echo] Building benchmark...
clean:
clean-contrib:
clean:
clean:
clean:
clean:
clean:
clean:
BUILD SUCCESSFUL
Total time: 1 second
+ cd /home/hudson/hudson-slave/workspace/Lucene-Solr-tests-only-trunk/checkout/lucene
+ JAVA_HOME=/home/hudson/tools/java/latest1.5 /home/hudson/tools/ant/latest1.7/bin/ant compile compile-test build-contrib
Buildfile: build.xml
jflex-uptodate-check:
jflex-notice:
javacc-uptodate-check:
javacc-notice:
init:
clover.setup:
clover.info:
[echo]
[echo] Clover not found. Code coverage reports disabled.
[echo]
clover:
common.compile-core:
[mkdir] Created dir: /usr/home/hudson/hudson-slave/workspace/Lucene-Solr-tests-only-trunk/checkout/lucene/build/classes/java
[javac] Compiling 508 source files to /usr/home/hudson/hudson-slave/workspace/Lucene-Solr-tests-only-trunk/checkout/lucene/build/classes/java
[javac] /usr/home/hudson/hudson-slave/workspace/Lucene-Solr-tests-only-trunk/checkout/lucene/src/java/org/apache/lucene/util/Version.java:80: warning: [dep-ann] deprecated name isnt annotated with @Deprecated
[javac] public boolean onOrAfter(Version other) {
[javac] ^
[javac] /usr/home/hudson/hudson-slave/workspace/Lucene-Solr-tests-only-trunk/checkout/lucene/src/java/org/apache/lucene/search/SortField.java:415: inconvertible types
[javac] found : org.apache.lucene.search.cache.CachedArrayCreator<capture of ?>
[javac] required: org.apache.lucene.search.cache.IntValuesCreator
[javac] return new FieldComparator.IntComparator(numHits, (IntValuesCreator)creator, (Integer)missingValue );
[javac] ^
[javac] /usr/home/hudson/hudson-slave/workspace/Lucene-Solr-tests-only-trunk/checkout/lucene/src/java/org/apache/lucene/search/SortField.java:418: inconvertible types
[javac] found : org.apache.lucene.search.cache.CachedArrayCreator<capture of ?>
[javac] required: org.apache.lucene.search.cache.FloatValuesCreator
[javac] return new FieldComparator.FloatComparator(numHits, (FloatValuesCreator)creator, (Float)missingValue );
[javac] ^
[javac] /usr/home/hudson/hudson-slave/workspace/Lucene-Solr-tests-only-trunk/checkout/lucene/src/java/org/apache/lucene/search/SortField.java:421: inconvertible types
[javac] found : org.apache.lucene.search.cache.CachedArrayCreator<capture of ?>
[javac] required: org.apache.lucene.search.cache.LongValuesCreator
[javac] return new FieldComparator.LongComparator(numHits, (LongValuesCreator)creator, (Long)missingValue );
[javac] ^
[javac] /usr/home/hudson/hudson-slave/workspace/Lucene-Solr-tests-only-trunk/checkout/lucene/src/java/org/apache/lucene/search/SortField.java:424: inconvertible types
[javac] found : org.apache.lucene.search.cache.CachedArrayCreator<capture of ?>
[javac] required: org.apache.lucene.search.cache.DoubleValuesCreator
[javac] return new FieldComparator.DoubleComparator(numHits, (DoubleValuesCreator)creator, (Double)missingValue );
[javac] ^
[javac] /usr/home/hudson/hudson-slave/workspace/Lucene-Solr-tests-only-trunk/checkout/lucene/src/java/org/apache/lucene/search/SortField.java:427: inconvertible types
[javac] found : org.apache.lucene.search.cache.CachedArrayCreator<capture of ?>
[javac] required: org.apache.lucene.search.cache.ByteValuesCreator
[javac] return new FieldComparator.ByteComparator(numHits, (ByteValuesCreator)creator, (Byte)missingValue );
[javac] ^
[javac] /usr/home/hudson/hudson-slave/workspace/Lucene-Solr-tests-only-trunk/checkout/lucene/src/java/org/apache/lucene/search/SortField.java:430: inconvertible types
[javac] found : org.apache.lucene.search.cache.CachedArrayCreator<capture of ?>
[javac] required: org.apache.lucene.search.cache.ShortValuesCreator
[javac] return new FieldComparator.ShortComparator(numHits, (ShortValuesCreator)creator, (Short)missingValue );
[javac] ^
[javac] /usr/home/hudson/hudson-slave/workspace/Lucene-Solr-tests-only-trunk/checkout/lucene/src/java/org/apache/lucene/queryParser/CharStream.java:34: warning: [dep-ann] deprecated name isnt annotated with @Deprecated
[javac] int getColumn();
[javac] ^
[javac] /usr/home/hudson/hudson-slave/workspace/Lucene-Solr-tests-only-trunk/checkout/lucene/src/java/org/apache/lucene/queryParser/CharStream.java:41: warning: [dep-ann] deprecated name isnt annotated with @Deprecated
[javac] int getLine();
[javac] ^
[javac] Note: Some input files use or override a deprecated API.
[javac] Note: Recompile with -Xlint:deprecation for details.
[javac] 6 errors
[...truncated 10 lines...]
---------------------------------------------------------------------
To unsubscribe, e-mail: dev-unsubscribe@lucene.apache.org
For additional commands, e-mail: dev-help@lucene.apache.org
[HUDSON] Lucene-Solr-tests-only-trunk - Build # 5726 - Still
Failing
Posted by Apache Hudson Server <hu...@hudson.apache.org>.
Build: https://hudson.apache.org/hudson/job/Lucene-Solr-tests-only-trunk/5726/
No tests ran.
Build Log (for compile errors):
[...truncated 43 lines...]
clean:
[echo] Building analyzers-icu...
clean:
[echo] Building analyzers-phonetic...
clean:
[echo] Building analyzers-smartcn...
clean:
[echo] Building analyzers-stempel...
clean:
[echo] Building benchmark...
clean:
clean-contrib:
clean:
clean:
clean:
clean:
clean:
clean:
BUILD SUCCESSFUL
Total time: 1 second
+ cd /home/hudson/hudson-slave/workspace/Lucene-Solr-tests-only-trunk/checkout/lucene
+ JAVA_HOME=/home/hudson/tools/java/latest1.5 /home/hudson/tools/ant/latest1.7/bin/ant compile compile-test build-contrib
Buildfile: build.xml
jflex-uptodate-check:
jflex-notice:
javacc-uptodate-check:
javacc-notice:
init:
clover.setup:
clover.info:
[echo]
[echo] Clover not found. Code coverage reports disabled.
[echo]
clover:
common.compile-core:
[mkdir] Created dir: /usr/home/hudson/hudson-slave/workspace/Lucene-Solr-tests-only-trunk/checkout/lucene/build/classes/java
[javac] Compiling 508 source files to /usr/home/hudson/hudson-slave/workspace/Lucene-Solr-tests-only-trunk/checkout/lucene/build/classes/java
[javac] /usr/home/hudson/hudson-slave/workspace/Lucene-Solr-tests-only-trunk/checkout/lucene/src/java/org/apache/lucene/util/Version.java:80: warning: [dep-ann] deprecated name isnt annotated with @Deprecated
[javac] public boolean onOrAfter(Version other) {
[javac] ^
[javac] /usr/home/hudson/hudson-slave/workspace/Lucene-Solr-tests-only-trunk/checkout/lucene/src/java/org/apache/lucene/search/SortField.java:415: inconvertible types
[javac] found : org.apache.lucene.search.cache.CachedArrayCreator<capture of ?>
[javac] required: org.apache.lucene.search.cache.IntValuesCreator
[javac] return new FieldComparator.IntComparator(numHits, (IntValuesCreator)creator, (Integer)missingValue );
[javac] ^
[javac] /usr/home/hudson/hudson-slave/workspace/Lucene-Solr-tests-only-trunk/checkout/lucene/src/java/org/apache/lucene/search/SortField.java:418: inconvertible types
[javac] found : org.apache.lucene.search.cache.CachedArrayCreator<capture of ?>
[javac] required: org.apache.lucene.search.cache.FloatValuesCreator
[javac] return new FieldComparator.FloatComparator(numHits, (FloatValuesCreator)creator, (Float)missingValue );
[javac] ^
[javac] /usr/home/hudson/hudson-slave/workspace/Lucene-Solr-tests-only-trunk/checkout/lucene/src/java/org/apache/lucene/search/SortField.java:421: inconvertible types
[javac] found : org.apache.lucene.search.cache.CachedArrayCreator<capture of ?>
[javac] required: org.apache.lucene.search.cache.LongValuesCreator
[javac] return new FieldComparator.LongComparator(numHits, (LongValuesCreator)creator, (Long)missingValue );
[javac] ^
[javac] /usr/home/hudson/hudson-slave/workspace/Lucene-Solr-tests-only-trunk/checkout/lucene/src/java/org/apache/lucene/search/SortField.java:424: inconvertible types
[javac] found : org.apache.lucene.search.cache.CachedArrayCreator<capture of ?>
[javac] required: org.apache.lucene.search.cache.DoubleValuesCreator
[javac] return new FieldComparator.DoubleComparator(numHits, (DoubleValuesCreator)creator, (Double)missingValue );
[javac] ^
[javac] /usr/home/hudson/hudson-slave/workspace/Lucene-Solr-tests-only-trunk/checkout/lucene/src/java/org/apache/lucene/search/SortField.java:427: inconvertible types
[javac] found : org.apache.lucene.search.cache.CachedArrayCreator<capture of ?>
[javac] required: org.apache.lucene.search.cache.ByteValuesCreator
[javac] return new FieldComparator.ByteComparator(numHits, (ByteValuesCreator)creator, (Byte)missingValue );
[javac] ^
[javac] /usr/home/hudson/hudson-slave/workspace/Lucene-Solr-tests-only-trunk/checkout/lucene/src/java/org/apache/lucene/search/SortField.java:430: inconvertible types
[javac] found : org.apache.lucene.search.cache.CachedArrayCreator<capture of ?>
[javac] required: org.apache.lucene.search.cache.ShortValuesCreator
[javac] return new FieldComparator.ShortComparator(numHits, (ShortValuesCreator)creator, (Short)missingValue );
[javac] ^
[javac] /usr/home/hudson/hudson-slave/workspace/Lucene-Solr-tests-only-trunk/checkout/lucene/src/java/org/apache/lucene/queryParser/CharStream.java:34: warning: [dep-ann] deprecated name isnt annotated with @Deprecated
[javac] int getColumn();
[javac] ^
[javac] /usr/home/hudson/hudson-slave/workspace/Lucene-Solr-tests-only-trunk/checkout/lucene/src/java/org/apache/lucene/queryParser/CharStream.java:41: warning: [dep-ann] deprecated name isnt annotated with @Deprecated
[javac] int getLine();
[javac] ^
[javac] Note: Some input files use or override a deprecated API.
[javac] Note: Recompile with -Xlint:deprecation for details.
[javac] 6 errors
[...truncated 10 lines...]
---------------------------------------------------------------------
To unsubscribe, e-mail: dev-unsubscribe@lucene.apache.org
For additional commands, e-mail: dev-help@lucene.apache.org
[HUDSON] Lucene-Solr-tests-only-trunk - Build # 5725 - Still
Failing
Posted by Apache Hudson Server <hu...@hudson.apache.org>.
Build: https://hudson.apache.org/hudson/job/Lucene-Solr-tests-only-trunk/5725/
No tests ran.
Build Log (for compile errors):
[...truncated 43 lines...]
clean:
[echo] Building analyzers-icu...
clean:
[echo] Building analyzers-phonetic...
clean:
[echo] Building analyzers-smartcn...
clean:
[echo] Building analyzers-stempel...
clean:
[echo] Building benchmark...
clean:
clean-contrib:
clean:
clean:
clean:
clean:
clean:
clean:
BUILD SUCCESSFUL
Total time: 1 second
+ cd /home/hudson/hudson-slave/workspace/Lucene-Solr-tests-only-trunk/checkout/lucene
+ JAVA_HOME=/home/hudson/tools/java/latest1.5 /home/hudson/tools/ant/latest1.7/bin/ant compile compile-test build-contrib
Buildfile: build.xml
jflex-uptodate-check:
jflex-notice:
javacc-uptodate-check:
javacc-notice:
init:
clover.setup:
clover.info:
[echo]
[echo] Clover not found. Code coverage reports disabled.
[echo]
clover:
common.compile-core:
[mkdir] Created dir: /usr/home/hudson/hudson-slave/workspace/Lucene-Solr-tests-only-trunk/checkout/lucene/build/classes/java
[javac] Compiling 508 source files to /usr/home/hudson/hudson-slave/workspace/Lucene-Solr-tests-only-trunk/checkout/lucene/build/classes/java
[javac] /usr/home/hudson/hudson-slave/workspace/Lucene-Solr-tests-only-trunk/checkout/lucene/src/java/org/apache/lucene/util/Version.java:80: warning: [dep-ann] deprecated name isnt annotated with @Deprecated
[javac] public boolean onOrAfter(Version other) {
[javac] ^
[javac] /usr/home/hudson/hudson-slave/workspace/Lucene-Solr-tests-only-trunk/checkout/lucene/src/java/org/apache/lucene/search/SortField.java:415: inconvertible types
[javac] found : org.apache.lucene.search.cache.CachedArrayCreator<capture of ?>
[javac] required: org.apache.lucene.search.cache.IntValuesCreator
[javac] return new FieldComparator.IntComparator(numHits, (IntValuesCreator)creator, (Integer)missingValue );
[javac] ^
[javac] /usr/home/hudson/hudson-slave/workspace/Lucene-Solr-tests-only-trunk/checkout/lucene/src/java/org/apache/lucene/search/SortField.java:418: inconvertible types
[javac] found : org.apache.lucene.search.cache.CachedArrayCreator<capture of ?>
[javac] required: org.apache.lucene.search.cache.FloatValuesCreator
[javac] return new FieldComparator.FloatComparator(numHits, (FloatValuesCreator)creator, (Float)missingValue );
[javac] ^
[javac] /usr/home/hudson/hudson-slave/workspace/Lucene-Solr-tests-only-trunk/checkout/lucene/src/java/org/apache/lucene/search/SortField.java:421: inconvertible types
[javac] found : org.apache.lucene.search.cache.CachedArrayCreator<capture of ?>
[javac] required: org.apache.lucene.search.cache.LongValuesCreator
[javac] return new FieldComparator.LongComparator(numHits, (LongValuesCreator)creator, (Long)missingValue );
[javac] ^
[javac] /usr/home/hudson/hudson-slave/workspace/Lucene-Solr-tests-only-trunk/checkout/lucene/src/java/org/apache/lucene/search/SortField.java:424: inconvertible types
[javac] found : org.apache.lucene.search.cache.CachedArrayCreator<capture of ?>
[javac] required: org.apache.lucene.search.cache.DoubleValuesCreator
[javac] return new FieldComparator.DoubleComparator(numHits, (DoubleValuesCreator)creator, (Double)missingValue );
[javac] ^
[javac] /usr/home/hudson/hudson-slave/workspace/Lucene-Solr-tests-only-trunk/checkout/lucene/src/java/org/apache/lucene/search/SortField.java:427: inconvertible types
[javac] found : org.apache.lucene.search.cache.CachedArrayCreator<capture of ?>
[javac] required: org.apache.lucene.search.cache.ByteValuesCreator
[javac] return new FieldComparator.ByteComparator(numHits, (ByteValuesCreator)creator, (Byte)missingValue );
[javac] ^
[javac] /usr/home/hudson/hudson-slave/workspace/Lucene-Solr-tests-only-trunk/checkout/lucene/src/java/org/apache/lucene/search/SortField.java:430: inconvertible types
[javac] found : org.apache.lucene.search.cache.CachedArrayCreator<capture of ?>
[javac] required: org.apache.lucene.search.cache.ShortValuesCreator
[javac] return new FieldComparator.ShortComparator(numHits, (ShortValuesCreator)creator, (Short)missingValue );
[javac] ^
[javac] /usr/home/hudson/hudson-slave/workspace/Lucene-Solr-tests-only-trunk/checkout/lucene/src/java/org/apache/lucene/queryParser/CharStream.java:34: warning: [dep-ann] deprecated name isnt annotated with @Deprecated
[javac] int getColumn();
[javac] ^
[javac] /usr/home/hudson/hudson-slave/workspace/Lucene-Solr-tests-only-trunk/checkout/lucene/src/java/org/apache/lucene/queryParser/CharStream.java:41: warning: [dep-ann] deprecated name isnt annotated with @Deprecated
[javac] int getLine();
[javac] ^
[javac] Note: Some input files use or override a deprecated API.
[javac] Note: Recompile with -Xlint:deprecation for details.
[javac] 6 errors
[...truncated 10 lines...]
---------------------------------------------------------------------
To unsubscribe, e-mail: dev-unsubscribe@lucene.apache.org
For additional commands, e-mail: dev-help@lucene.apache.org
[HUDSON] Lucene-Solr-tests-only-trunk - Build # 5724 - Still
Failing
Posted by Apache Hudson Server <hu...@hudson.apache.org>.
Build: https://hudson.apache.org/hudson/job/Lucene-Solr-tests-only-trunk/5724/
No tests ran.
Build Log (for compile errors):
[...truncated 43 lines...]
clean:
[echo] Building analyzers-icu...
clean:
[echo] Building analyzers-phonetic...
clean:
[echo] Building analyzers-smartcn...
clean:
[echo] Building analyzers-stempel...
clean:
[echo] Building benchmark...
clean:
clean-contrib:
clean:
clean:
clean:
clean:
clean:
clean:
BUILD SUCCESSFUL
Total time: 1 second
+ cd /home/hudson/hudson-slave/workspace/Lucene-Solr-tests-only-trunk/checkout/lucene
+ JAVA_HOME=/home/hudson/tools/java/latest1.5 /home/hudson/tools/ant/latest1.7/bin/ant compile compile-test build-contrib
Buildfile: build.xml
jflex-uptodate-check:
jflex-notice:
javacc-uptodate-check:
javacc-notice:
init:
clover.setup:
clover.info:
[echo]
[echo] Clover not found. Code coverage reports disabled.
[echo]
clover:
common.compile-core:
[mkdir] Created dir: /usr/home/hudson/hudson-slave/workspace/Lucene-Solr-tests-only-trunk/checkout/lucene/build/classes/java
[javac] Compiling 508 source files to /usr/home/hudson/hudson-slave/workspace/Lucene-Solr-tests-only-trunk/checkout/lucene/build/classes/java
[javac] /usr/home/hudson/hudson-slave/workspace/Lucene-Solr-tests-only-trunk/checkout/lucene/src/java/org/apache/lucene/util/Version.java:80: warning: [dep-ann] deprecated name isnt annotated with @Deprecated
[javac] public boolean onOrAfter(Version other) {
[javac] ^
[javac] /usr/home/hudson/hudson-slave/workspace/Lucene-Solr-tests-only-trunk/checkout/lucene/src/java/org/apache/lucene/search/SortField.java:415: inconvertible types
[javac] found : org.apache.lucene.search.cache.CachedArrayCreator<capture of ?>
[javac] required: org.apache.lucene.search.cache.IntValuesCreator
[javac] return new FieldComparator.IntComparator(numHits, (IntValuesCreator)creator, (Integer)missingValue );
[javac] ^
[javac] /usr/home/hudson/hudson-slave/workspace/Lucene-Solr-tests-only-trunk/checkout/lucene/src/java/org/apache/lucene/search/SortField.java:418: inconvertible types
[javac] found : org.apache.lucene.search.cache.CachedArrayCreator<capture of ?>
[javac] required: org.apache.lucene.search.cache.FloatValuesCreator
[javac] return new FieldComparator.FloatComparator(numHits, (FloatValuesCreator)creator, (Float)missingValue );
[javac] ^
[javac] /usr/home/hudson/hudson-slave/workspace/Lucene-Solr-tests-only-trunk/checkout/lucene/src/java/org/apache/lucene/search/SortField.java:421: inconvertible types
[javac] found : org.apache.lucene.search.cache.CachedArrayCreator<capture of ?>
[javac] required: org.apache.lucene.search.cache.LongValuesCreator
[javac] return new FieldComparator.LongComparator(numHits, (LongValuesCreator)creator, (Long)missingValue );
[javac] ^
[javac] /usr/home/hudson/hudson-slave/workspace/Lucene-Solr-tests-only-trunk/checkout/lucene/src/java/org/apache/lucene/search/SortField.java:424: inconvertible types
[javac] found : org.apache.lucene.search.cache.CachedArrayCreator<capture of ?>
[javac] required: org.apache.lucene.search.cache.DoubleValuesCreator
[javac] return new FieldComparator.DoubleComparator(numHits, (DoubleValuesCreator)creator, (Double)missingValue );
[javac] ^
[javac] /usr/home/hudson/hudson-slave/workspace/Lucene-Solr-tests-only-trunk/checkout/lucene/src/java/org/apache/lucene/search/SortField.java:427: inconvertible types
[javac] found : org.apache.lucene.search.cache.CachedArrayCreator<capture of ?>
[javac] required: org.apache.lucene.search.cache.ByteValuesCreator
[javac] return new FieldComparator.ByteComparator(numHits, (ByteValuesCreator)creator, (Byte)missingValue );
[javac] ^
[javac] /usr/home/hudson/hudson-slave/workspace/Lucene-Solr-tests-only-trunk/checkout/lucene/src/java/org/apache/lucene/search/SortField.java:430: inconvertible types
[javac] found : org.apache.lucene.search.cache.CachedArrayCreator<capture of ?>
[javac] required: org.apache.lucene.search.cache.ShortValuesCreator
[javac] return new FieldComparator.ShortComparator(numHits, (ShortValuesCreator)creator, (Short)missingValue );
[javac] ^
[javac] /usr/home/hudson/hudson-slave/workspace/Lucene-Solr-tests-only-trunk/checkout/lucene/src/java/org/apache/lucene/queryParser/CharStream.java:34: warning: [dep-ann] deprecated name isnt annotated with @Deprecated
[javac] int getColumn();
[javac] ^
[javac] /usr/home/hudson/hudson-slave/workspace/Lucene-Solr-tests-only-trunk/checkout/lucene/src/java/org/apache/lucene/queryParser/CharStream.java:41: warning: [dep-ann] deprecated name isnt annotated with @Deprecated
[javac] int getLine();
[javac] ^
[javac] Note: Some input files use or override a deprecated API.
[javac] Note: Recompile with -Xlint:deprecation for details.
[javac] 6 errors
[...truncated 10 lines...]
---------------------------------------------------------------------
To unsubscribe, e-mail: dev-unsubscribe@lucene.apache.org
For additional commands, e-mail: dev-help@lucene.apache.org
[HUDSON] Lucene-Solr-tests-only-trunk - Build # 5723 - Still
Failing
Posted by Apache Hudson Server <hu...@hudson.apache.org>.
Build: https://hudson.apache.org/hudson/job/Lucene-Solr-tests-only-trunk/5723/
No tests ran.
Build Log (for compile errors):
[...truncated 43 lines...]
clean:
[echo] Building analyzers-icu...
clean:
[echo] Building analyzers-phonetic...
clean:
[echo] Building analyzers-smartcn...
clean:
[echo] Building analyzers-stempel...
clean:
[echo] Building benchmark...
clean:
clean-contrib:
clean:
clean:
clean:
clean:
clean:
clean:
BUILD SUCCESSFUL
Total time: 1 second
+ cd /home/hudson/hudson-slave/workspace/Lucene-Solr-tests-only-trunk/checkout/lucene
+ JAVA_HOME=/home/hudson/tools/java/latest1.5 /home/hudson/tools/ant/latest1.7/bin/ant compile compile-test build-contrib
Buildfile: build.xml
jflex-uptodate-check:
jflex-notice:
javacc-uptodate-check:
javacc-notice:
init:
clover.setup:
clover.info:
[echo]
[echo] Clover not found. Code coverage reports disabled.
[echo]
clover:
common.compile-core:
[mkdir] Created dir: /usr/home/hudson/hudson-slave/workspace/Lucene-Solr-tests-only-trunk/checkout/lucene/build/classes/java
[javac] Compiling 508 source files to /usr/home/hudson/hudson-slave/workspace/Lucene-Solr-tests-only-trunk/checkout/lucene/build/classes/java
[javac] /usr/home/hudson/hudson-slave/workspace/Lucene-Solr-tests-only-trunk/checkout/lucene/src/java/org/apache/lucene/util/Version.java:80: warning: [dep-ann] deprecated name isnt annotated with @Deprecated
[javac] public boolean onOrAfter(Version other) {
[javac] ^
[javac] /usr/home/hudson/hudson-slave/workspace/Lucene-Solr-tests-only-trunk/checkout/lucene/src/java/org/apache/lucene/search/SortField.java:415: inconvertible types
[javac] found : org.apache.lucene.search.cache.CachedArrayCreator<capture of ?>
[javac] required: org.apache.lucene.search.cache.IntValuesCreator
[javac] return new FieldComparator.IntComparator(numHits, (IntValuesCreator)creator, (Integer)missingValue );
[javac] ^
[javac] /usr/home/hudson/hudson-slave/workspace/Lucene-Solr-tests-only-trunk/checkout/lucene/src/java/org/apache/lucene/search/SortField.java:418: inconvertible types
[javac] found : org.apache.lucene.search.cache.CachedArrayCreator<capture of ?>
[javac] required: org.apache.lucene.search.cache.FloatValuesCreator
[javac] return new FieldComparator.FloatComparator(numHits, (FloatValuesCreator)creator, (Float)missingValue );
[javac] ^
[javac] /usr/home/hudson/hudson-slave/workspace/Lucene-Solr-tests-only-trunk/checkout/lucene/src/java/org/apache/lucene/search/SortField.java:421: inconvertible types
[javac] found : org.apache.lucene.search.cache.CachedArrayCreator<capture of ?>
[javac] required: org.apache.lucene.search.cache.LongValuesCreator
[javac] return new FieldComparator.LongComparator(numHits, (LongValuesCreator)creator, (Long)missingValue );
[javac] ^
[javac] /usr/home/hudson/hudson-slave/workspace/Lucene-Solr-tests-only-trunk/checkout/lucene/src/java/org/apache/lucene/search/SortField.java:424: inconvertible types
[javac] found : org.apache.lucene.search.cache.CachedArrayCreator<capture of ?>
[javac] required: org.apache.lucene.search.cache.DoubleValuesCreator
[javac] return new FieldComparator.DoubleComparator(numHits, (DoubleValuesCreator)creator, (Double)missingValue );
[javac] ^
[javac] /usr/home/hudson/hudson-slave/workspace/Lucene-Solr-tests-only-trunk/checkout/lucene/src/java/org/apache/lucene/search/SortField.java:427: inconvertible types
[javac] found : org.apache.lucene.search.cache.CachedArrayCreator<capture of ?>
[javac] required: org.apache.lucene.search.cache.ByteValuesCreator
[javac] return new FieldComparator.ByteComparator(numHits, (ByteValuesCreator)creator, (Byte)missingValue );
[javac] ^
[javac] /usr/home/hudson/hudson-slave/workspace/Lucene-Solr-tests-only-trunk/checkout/lucene/src/java/org/apache/lucene/search/SortField.java:430: inconvertible types
[javac] found : org.apache.lucene.search.cache.CachedArrayCreator<capture of ?>
[javac] required: org.apache.lucene.search.cache.ShortValuesCreator
[javac] return new FieldComparator.ShortComparator(numHits, (ShortValuesCreator)creator, (Short)missingValue );
[javac] ^
[javac] /usr/home/hudson/hudson-slave/workspace/Lucene-Solr-tests-only-trunk/checkout/lucene/src/java/org/apache/lucene/queryParser/CharStream.java:34: warning: [dep-ann] deprecated name isnt annotated with @Deprecated
[javac] int getColumn();
[javac] ^
[javac] /usr/home/hudson/hudson-slave/workspace/Lucene-Solr-tests-only-trunk/checkout/lucene/src/java/org/apache/lucene/queryParser/CharStream.java:41: warning: [dep-ann] deprecated name isnt annotated with @Deprecated
[javac] int getLine();
[javac] ^
[javac] Note: Some input files use or override a deprecated API.
[javac] Note: Recompile with -Xlint:deprecation for details.
[javac] 6 errors
[...truncated 10 lines...]
---------------------------------------------------------------------
To unsubscribe, e-mail: dev-unsubscribe@lucene.apache.org
For additional commands, e-mail: dev-help@lucene.apache.org
[HUDSON] Lucene-Solr-tests-only-trunk - Build # 5722 - Still
Failing
Posted by Apache Hudson Server <hu...@hudson.apache.org>.
Build: https://hudson.apache.org/hudson/job/Lucene-Solr-tests-only-trunk/5722/
No tests ran.
Build Log (for compile errors):
[...truncated 43 lines...]
clean:
[echo] Building analyzers-icu...
clean:
[echo] Building analyzers-phonetic...
clean:
[echo] Building analyzers-smartcn...
clean:
[echo] Building analyzers-stempel...
clean:
[echo] Building benchmark...
clean:
clean-contrib:
clean:
clean:
clean:
clean:
clean:
clean:
BUILD SUCCESSFUL
Total time: 1 second
+ cd /home/hudson/hudson-slave/workspace/Lucene-Solr-tests-only-trunk/checkout/lucene
+ JAVA_HOME=/home/hudson/tools/java/latest1.5 /home/hudson/tools/ant/latest1.7/bin/ant compile compile-test build-contrib
Buildfile: build.xml
jflex-uptodate-check:
jflex-notice:
javacc-uptodate-check:
javacc-notice:
init:
clover.setup:
clover.info:
[echo]
[echo] Clover not found. Code coverage reports disabled.
[echo]
clover:
common.compile-core:
[mkdir] Created dir: /usr/home/hudson/hudson-slave/workspace/Lucene-Solr-tests-only-trunk/checkout/lucene/build/classes/java
[javac] Compiling 508 source files to /usr/home/hudson/hudson-slave/workspace/Lucene-Solr-tests-only-trunk/checkout/lucene/build/classes/java
[javac] /usr/home/hudson/hudson-slave/workspace/Lucene-Solr-tests-only-trunk/checkout/lucene/src/java/org/apache/lucene/util/Version.java:80: warning: [dep-ann] deprecated name isnt annotated with @Deprecated
[javac] public boolean onOrAfter(Version other) {
[javac] ^
[javac] /usr/home/hudson/hudson-slave/workspace/Lucene-Solr-tests-only-trunk/checkout/lucene/src/java/org/apache/lucene/search/SortField.java:415: inconvertible types
[javac] found : org.apache.lucene.search.cache.CachedArrayCreator<capture of ?>
[javac] required: org.apache.lucene.search.cache.IntValuesCreator
[javac] return new FieldComparator.IntComparator(numHits, (IntValuesCreator)creator, (Integer)missingValue );
[javac] ^
[javac] /usr/home/hudson/hudson-slave/workspace/Lucene-Solr-tests-only-trunk/checkout/lucene/src/java/org/apache/lucene/search/SortField.java:418: inconvertible types
[javac] found : org.apache.lucene.search.cache.CachedArrayCreator<capture of ?>
[javac] required: org.apache.lucene.search.cache.FloatValuesCreator
[javac] return new FieldComparator.FloatComparator(numHits, (FloatValuesCreator)creator, (Float)missingValue );
[javac] ^
[javac] /usr/home/hudson/hudson-slave/workspace/Lucene-Solr-tests-only-trunk/checkout/lucene/src/java/org/apache/lucene/search/SortField.java:421: inconvertible types
[javac] found : org.apache.lucene.search.cache.CachedArrayCreator<capture of ?>
[javac] required: org.apache.lucene.search.cache.LongValuesCreator
[javac] return new FieldComparator.LongComparator(numHits, (LongValuesCreator)creator, (Long)missingValue );
[javac] ^
[javac] /usr/home/hudson/hudson-slave/workspace/Lucene-Solr-tests-only-trunk/checkout/lucene/src/java/org/apache/lucene/search/SortField.java:424: inconvertible types
[javac] found : org.apache.lucene.search.cache.CachedArrayCreator<capture of ?>
[javac] required: org.apache.lucene.search.cache.DoubleValuesCreator
[javac] return new FieldComparator.DoubleComparator(numHits, (DoubleValuesCreator)creator, (Double)missingValue );
[javac] ^
[javac] /usr/home/hudson/hudson-slave/workspace/Lucene-Solr-tests-only-trunk/checkout/lucene/src/java/org/apache/lucene/search/SortField.java:427: inconvertible types
[javac] found : org.apache.lucene.search.cache.CachedArrayCreator<capture of ?>
[javac] required: org.apache.lucene.search.cache.ByteValuesCreator
[javac] return new FieldComparator.ByteComparator(numHits, (ByteValuesCreator)creator, (Byte)missingValue );
[javac] ^
[javac] /usr/home/hudson/hudson-slave/workspace/Lucene-Solr-tests-only-trunk/checkout/lucene/src/java/org/apache/lucene/search/SortField.java:430: inconvertible types
[javac] found : org.apache.lucene.search.cache.CachedArrayCreator<capture of ?>
[javac] required: org.apache.lucene.search.cache.ShortValuesCreator
[javac] return new FieldComparator.ShortComparator(numHits, (ShortValuesCreator)creator, (Short)missingValue );
[javac] ^
[javac] /usr/home/hudson/hudson-slave/workspace/Lucene-Solr-tests-only-trunk/checkout/lucene/src/java/org/apache/lucene/queryParser/CharStream.java:34: warning: [dep-ann] deprecated name isnt annotated with @Deprecated
[javac] int getColumn();
[javac] ^
[javac] /usr/home/hudson/hudson-slave/workspace/Lucene-Solr-tests-only-trunk/checkout/lucene/src/java/org/apache/lucene/queryParser/CharStream.java:41: warning: [dep-ann] deprecated name isnt annotated with @Deprecated
[javac] int getLine();
[javac] ^
[javac] Note: Some input files use or override a deprecated API.
[javac] Note: Recompile with -Xlint:deprecation for details.
[javac] 6 errors
[...truncated 10 lines...]
---------------------------------------------------------------------
To unsubscribe, e-mail: dev-unsubscribe@lucene.apache.org
For additional commands, e-mail: dev-help@lucene.apache.org
[HUDSON] Lucene-Solr-tests-only-trunk - Build # 5721 - Still
Failing
Posted by Apache Hudson Server <hu...@hudson.apache.org>.
Build: https://hudson.apache.org/hudson/job/Lucene-Solr-tests-only-trunk/5721/
No tests ran.
Build Log (for compile errors):
[...truncated 43 lines...]
clean:
[echo] Building analyzers-icu...
clean:
[echo] Building analyzers-phonetic...
clean:
[echo] Building analyzers-smartcn...
clean:
[echo] Building analyzers-stempel...
clean:
[echo] Building benchmark...
clean:
clean-contrib:
clean:
clean:
clean:
clean:
clean:
clean:
BUILD SUCCESSFUL
Total time: 2 seconds
+ cd /home/hudson/hudson-slave/workspace/Lucene-Solr-tests-only-trunk/checkout/lucene
+ JAVA_HOME=/home/hudson/tools/java/latest1.5 /home/hudson/tools/ant/latest1.7/bin/ant compile compile-test build-contrib
Buildfile: build.xml
jflex-uptodate-check:
jflex-notice:
javacc-uptodate-check:
javacc-notice:
init:
clover.setup:
clover.info:
[echo]
[echo] Clover not found. Code coverage reports disabled.
[echo]
clover:
common.compile-core:
[mkdir] Created dir: /usr/home/hudson/hudson-slave/workspace/Lucene-Solr-tests-only-trunk/checkout/lucene/build/classes/java
[javac] Compiling 508 source files to /usr/home/hudson/hudson-slave/workspace/Lucene-Solr-tests-only-trunk/checkout/lucene/build/classes/java
[javac] /usr/home/hudson/hudson-slave/workspace/Lucene-Solr-tests-only-trunk/checkout/lucene/src/java/org/apache/lucene/util/Version.java:80: warning: [dep-ann] deprecated name isnt annotated with @Deprecated
[javac] public boolean onOrAfter(Version other) {
[javac] ^
[javac] /usr/home/hudson/hudson-slave/workspace/Lucene-Solr-tests-only-trunk/checkout/lucene/src/java/org/apache/lucene/search/SortField.java:415: inconvertible types
[javac] found : org.apache.lucene.search.cache.CachedArrayCreator<capture of ?>
[javac] required: org.apache.lucene.search.cache.IntValuesCreator
[javac] return new FieldComparator.IntComparator(numHits, (IntValuesCreator)creator, (Integer)missingValue );
[javac] ^
[javac] /usr/home/hudson/hudson-slave/workspace/Lucene-Solr-tests-only-trunk/checkout/lucene/src/java/org/apache/lucene/search/SortField.java:418: inconvertible types
[javac] found : org.apache.lucene.search.cache.CachedArrayCreator<capture of ?>
[javac] required: org.apache.lucene.search.cache.FloatValuesCreator
[javac] return new FieldComparator.FloatComparator(numHits, (FloatValuesCreator)creator, (Float)missingValue );
[javac] ^
[javac] /usr/home/hudson/hudson-slave/workspace/Lucene-Solr-tests-only-trunk/checkout/lucene/src/java/org/apache/lucene/search/SortField.java:421: inconvertible types
[javac] found : org.apache.lucene.search.cache.CachedArrayCreator<capture of ?>
[javac] required: org.apache.lucene.search.cache.LongValuesCreator
[javac] return new FieldComparator.LongComparator(numHits, (LongValuesCreator)creator, (Long)missingValue );
[javac] ^
[javac] /usr/home/hudson/hudson-slave/workspace/Lucene-Solr-tests-only-trunk/checkout/lucene/src/java/org/apache/lucene/search/SortField.java:424: inconvertible types
[javac] found : org.apache.lucene.search.cache.CachedArrayCreator<capture of ?>
[javac] required: org.apache.lucene.search.cache.DoubleValuesCreator
[javac] return new FieldComparator.DoubleComparator(numHits, (DoubleValuesCreator)creator, (Double)missingValue );
[javac] ^
[javac] /usr/home/hudson/hudson-slave/workspace/Lucene-Solr-tests-only-trunk/checkout/lucene/src/java/org/apache/lucene/search/SortField.java:427: inconvertible types
[javac] found : org.apache.lucene.search.cache.CachedArrayCreator<capture of ?>
[javac] required: org.apache.lucene.search.cache.ByteValuesCreator
[javac] return new FieldComparator.ByteComparator(numHits, (ByteValuesCreator)creator, (Byte)missingValue );
[javac] ^
[javac] /usr/home/hudson/hudson-slave/workspace/Lucene-Solr-tests-only-trunk/checkout/lucene/src/java/org/apache/lucene/search/SortField.java:430: inconvertible types
[javac] found : org.apache.lucene.search.cache.CachedArrayCreator<capture of ?>
[javac] required: org.apache.lucene.search.cache.ShortValuesCreator
[javac] return new FieldComparator.ShortComparator(numHits, (ShortValuesCreator)creator, (Short)missingValue );
[javac] ^
[javac] /usr/home/hudson/hudson-slave/workspace/Lucene-Solr-tests-only-trunk/checkout/lucene/src/java/org/apache/lucene/queryParser/CharStream.java:34: warning: [dep-ann] deprecated name isnt annotated with @Deprecated
[javac] int getColumn();
[javac] ^
[javac] /usr/home/hudson/hudson-slave/workspace/Lucene-Solr-tests-only-trunk/checkout/lucene/src/java/org/apache/lucene/queryParser/CharStream.java:41: warning: [dep-ann] deprecated name isnt annotated with @Deprecated
[javac] int getLine();
[javac] ^
[javac] Note: Some input files use or override a deprecated API.
[javac] Note: Recompile with -Xlint:deprecation for details.
[javac] 6 errors
[...truncated 10 lines...]
---------------------------------------------------------------------
To unsubscribe, e-mail: dev-unsubscribe@lucene.apache.org
For additional commands, e-mail: dev-help@lucene.apache.org
[HUDSON] Lucene-Solr-tests-only-trunk - Build # 5720 - Still
Failing
Posted by Apache Hudson Server <hu...@hudson.apache.org>.
Build: https://hudson.apache.org/hudson/job/Lucene-Solr-tests-only-trunk/5720/
No tests ran.
Build Log (for compile errors):
[...truncated 43 lines...]
clean:
[echo] Building analyzers-icu...
clean:
[echo] Building analyzers-phonetic...
clean:
[echo] Building analyzers-smartcn...
clean:
[echo] Building analyzers-stempel...
clean:
[echo] Building benchmark...
clean:
clean-contrib:
clean:
clean:
clean:
clean:
clean:
clean:
BUILD SUCCESSFUL
Total time: 2 seconds
+ cd /home/hudson/hudson-slave/workspace/Lucene-Solr-tests-only-trunk/checkout/lucene
+ JAVA_HOME=/home/hudson/tools/java/latest1.5 /home/hudson/tools/ant/latest1.7/bin/ant compile compile-test build-contrib
Buildfile: build.xml
jflex-uptodate-check:
jflex-notice:
javacc-uptodate-check:
javacc-notice:
init:
clover.setup:
clover.info:
[echo]
[echo] Clover not found. Code coverage reports disabled.
[echo]
clover:
common.compile-core:
[mkdir] Created dir: /usr/home/hudson/hudson-slave/workspace/Lucene-Solr-tests-only-trunk/checkout/lucene/build/classes/java
[javac] Compiling 508 source files to /usr/home/hudson/hudson-slave/workspace/Lucene-Solr-tests-only-trunk/checkout/lucene/build/classes/java
[javac] /usr/home/hudson/hudson-slave/workspace/Lucene-Solr-tests-only-trunk/checkout/lucene/src/java/org/apache/lucene/util/Version.java:80: warning: [dep-ann] deprecated name isnt annotated with @Deprecated
[javac] public boolean onOrAfter(Version other) {
[javac] ^
[javac] /usr/home/hudson/hudson-slave/workspace/Lucene-Solr-tests-only-trunk/checkout/lucene/src/java/org/apache/lucene/search/SortField.java:415: inconvertible types
[javac] found : org.apache.lucene.search.cache.CachedArrayCreator<capture of ?>
[javac] required: org.apache.lucene.search.cache.IntValuesCreator
[javac] return new FieldComparator.IntComparator(numHits, (IntValuesCreator)creator, (Integer)missingValue );
[javac] ^
[javac] /usr/home/hudson/hudson-slave/workspace/Lucene-Solr-tests-only-trunk/checkout/lucene/src/java/org/apache/lucene/search/SortField.java:418: inconvertible types
[javac] found : org.apache.lucene.search.cache.CachedArrayCreator<capture of ?>
[javac] required: org.apache.lucene.search.cache.FloatValuesCreator
[javac] return new FieldComparator.FloatComparator(numHits, (FloatValuesCreator)creator, (Float)missingValue );
[javac] ^
[javac] /usr/home/hudson/hudson-slave/workspace/Lucene-Solr-tests-only-trunk/checkout/lucene/src/java/org/apache/lucene/search/SortField.java:421: inconvertible types
[javac] found : org.apache.lucene.search.cache.CachedArrayCreator<capture of ?>
[javac] required: org.apache.lucene.search.cache.LongValuesCreator
[javac] return new FieldComparator.LongComparator(numHits, (LongValuesCreator)creator, (Long)missingValue );
[javac] ^
[javac] /usr/home/hudson/hudson-slave/workspace/Lucene-Solr-tests-only-trunk/checkout/lucene/src/java/org/apache/lucene/search/SortField.java:424: inconvertible types
[javac] found : org.apache.lucene.search.cache.CachedArrayCreator<capture of ?>
[javac] required: org.apache.lucene.search.cache.DoubleValuesCreator
[javac] return new FieldComparator.DoubleComparator(numHits, (DoubleValuesCreator)creator, (Double)missingValue );
[javac] ^
[javac] /usr/home/hudson/hudson-slave/workspace/Lucene-Solr-tests-only-trunk/checkout/lucene/src/java/org/apache/lucene/search/SortField.java:427: inconvertible types
[javac] found : org.apache.lucene.search.cache.CachedArrayCreator<capture of ?>
[javac] required: org.apache.lucene.search.cache.ByteValuesCreator
[javac] return new FieldComparator.ByteComparator(numHits, (ByteValuesCreator)creator, (Byte)missingValue );
[javac] ^
[javac] /usr/home/hudson/hudson-slave/workspace/Lucene-Solr-tests-only-trunk/checkout/lucene/src/java/org/apache/lucene/search/SortField.java:430: inconvertible types
[javac] found : org.apache.lucene.search.cache.CachedArrayCreator<capture of ?>
[javac] required: org.apache.lucene.search.cache.ShortValuesCreator
[javac] return new FieldComparator.ShortComparator(numHits, (ShortValuesCreator)creator, (Short)missingValue );
[javac] ^
[javac] /usr/home/hudson/hudson-slave/workspace/Lucene-Solr-tests-only-trunk/checkout/lucene/src/java/org/apache/lucene/queryParser/CharStream.java:34: warning: [dep-ann] deprecated name isnt annotated with @Deprecated
[javac] int getColumn();
[javac] ^
[javac] /usr/home/hudson/hudson-slave/workspace/Lucene-Solr-tests-only-trunk/checkout/lucene/src/java/org/apache/lucene/queryParser/CharStream.java:41: warning: [dep-ann] deprecated name isnt annotated with @Deprecated
[javac] int getLine();
[javac] ^
[javac] Note: Some input files use or override a deprecated API.
[javac] Note: Recompile with -Xlint:deprecation for details.
[javac] 6 errors
[...truncated 10 lines...]
---------------------------------------------------------------------
To unsubscribe, e-mail: dev-unsubscribe@lucene.apache.org
For additional commands, e-mail: dev-help@lucene.apache.org
[HUDSON] Lucene-Solr-tests-only-trunk - Build # 5719 - Still
Failing
Posted by Apache Hudson Server <hu...@hudson.apache.org>.
Build: https://hudson.apache.org/hudson/job/Lucene-Solr-tests-only-trunk/5719/
No tests ran.
Build Log (for compile errors):
[...truncated 43 lines...]
clean:
[echo] Building analyzers-icu...
clean:
[echo] Building analyzers-phonetic...
clean:
[echo] Building analyzers-smartcn...
clean:
[echo] Building analyzers-stempel...
clean:
[echo] Building benchmark...
clean:
clean-contrib:
clean:
clean:
clean:
clean:
clean:
clean:
BUILD SUCCESSFUL
Total time: 6 seconds
+ cd /home/hudson/hudson-slave/workspace/Lucene-Solr-tests-only-trunk/checkout/lucene
+ JAVA_HOME=/home/hudson/tools/java/latest1.5 /home/hudson/tools/ant/latest1.7/bin/ant compile compile-test build-contrib
Buildfile: build.xml
jflex-uptodate-check:
jflex-notice:
javacc-uptodate-check:
javacc-notice:
init:
clover.setup:
clover.info:
[echo]
[echo] Clover not found. Code coverage reports disabled.
[echo]
clover:
common.compile-core:
[mkdir] Created dir: /usr/home/hudson/hudson-slave/workspace/Lucene-Solr-tests-only-trunk/checkout/lucene/build/classes/java
[javac] Compiling 508 source files to /usr/home/hudson/hudson-slave/workspace/Lucene-Solr-tests-only-trunk/checkout/lucene/build/classes/java
[javac] /usr/home/hudson/hudson-slave/workspace/Lucene-Solr-tests-only-trunk/checkout/lucene/src/java/org/apache/lucene/util/Version.java:80: warning: [dep-ann] deprecated name isnt annotated with @Deprecated
[javac] public boolean onOrAfter(Version other) {
[javac] ^
[javac] /usr/home/hudson/hudson-slave/workspace/Lucene-Solr-tests-only-trunk/checkout/lucene/src/java/org/apache/lucene/search/SortField.java:415: inconvertible types
[javac] found : org.apache.lucene.search.cache.CachedArrayCreator<capture of ?>
[javac] required: org.apache.lucene.search.cache.IntValuesCreator
[javac] return new FieldComparator.IntComparator(numHits, (IntValuesCreator)creator, (Integer)missingValue );
[javac] ^
[javac] /usr/home/hudson/hudson-slave/workspace/Lucene-Solr-tests-only-trunk/checkout/lucene/src/java/org/apache/lucene/search/SortField.java:418: inconvertible types
[javac] found : org.apache.lucene.search.cache.CachedArrayCreator<capture of ?>
[javac] required: org.apache.lucene.search.cache.FloatValuesCreator
[javac] return new FieldComparator.FloatComparator(numHits, (FloatValuesCreator)creator, (Float)missingValue );
[javac] ^
[javac] /usr/home/hudson/hudson-slave/workspace/Lucene-Solr-tests-only-trunk/checkout/lucene/src/java/org/apache/lucene/search/SortField.java:421: inconvertible types
[javac] found : org.apache.lucene.search.cache.CachedArrayCreator<capture of ?>
[javac] required: org.apache.lucene.search.cache.LongValuesCreator
[javac] return new FieldComparator.LongComparator(numHits, (LongValuesCreator)creator, (Long)missingValue );
[javac] ^
[javac] /usr/home/hudson/hudson-slave/workspace/Lucene-Solr-tests-only-trunk/checkout/lucene/src/java/org/apache/lucene/search/SortField.java:424: inconvertible types
[javac] found : org.apache.lucene.search.cache.CachedArrayCreator<capture of ?>
[javac] required: org.apache.lucene.search.cache.DoubleValuesCreator
[javac] return new FieldComparator.DoubleComparator(numHits, (DoubleValuesCreator)creator, (Double)missingValue );
[javac] ^
[javac] /usr/home/hudson/hudson-slave/workspace/Lucene-Solr-tests-only-trunk/checkout/lucene/src/java/org/apache/lucene/search/SortField.java:427: inconvertible types
[javac] found : org.apache.lucene.search.cache.CachedArrayCreator<capture of ?>
[javac] required: org.apache.lucene.search.cache.ByteValuesCreator
[javac] return new FieldComparator.ByteComparator(numHits, (ByteValuesCreator)creator, (Byte)missingValue );
[javac] ^
[javac] /usr/home/hudson/hudson-slave/workspace/Lucene-Solr-tests-only-trunk/checkout/lucene/src/java/org/apache/lucene/search/SortField.java:430: inconvertible types
[javac] found : org.apache.lucene.search.cache.CachedArrayCreator<capture of ?>
[javac] required: org.apache.lucene.search.cache.ShortValuesCreator
[javac] return new FieldComparator.ShortComparator(numHits, (ShortValuesCreator)creator, (Short)missingValue );
[javac] ^
[javac] /usr/home/hudson/hudson-slave/workspace/Lucene-Solr-tests-only-trunk/checkout/lucene/src/java/org/apache/lucene/queryParser/CharStream.java:34: warning: [dep-ann] deprecated name isnt annotated with @Deprecated
[javac] int getColumn();
[javac] ^
[javac] /usr/home/hudson/hudson-slave/workspace/Lucene-Solr-tests-only-trunk/checkout/lucene/src/java/org/apache/lucene/queryParser/CharStream.java:41: warning: [dep-ann] deprecated name isnt annotated with @Deprecated
[javac] int getLine();
[javac] ^
[javac] Note: Some input files use or override a deprecated API.
[javac] Note: Recompile with -Xlint:deprecation for details.
[javac] 6 errors
[...truncated 10 lines...]
---------------------------------------------------------------------
To unsubscribe, e-mail: dev-unsubscribe@lucene.apache.org
For additional commands, e-mail: dev-help@lucene.apache.org
[HUDSON] Lucene-Solr-tests-only-trunk - Build # 5718 - Still
Failing
Posted by Apache Hudson Server <hu...@hudson.apache.org>.
Build: https://hudson.apache.org/hudson/job/Lucene-Solr-tests-only-trunk/5718/
No tests ran.
Build Log (for compile errors):
[...truncated 54 lines...]
clean:
[delete] Deleting directory /usr/home/hudson/hudson-slave/workspace/Lucene-Solr-tests-only-trunk/checkout/modules/analysis/build/phonetic
[echo] Building analyzers-smartcn...
clean:
[delete] Deleting directory /usr/home/hudson/hudson-slave/workspace/Lucene-Solr-tests-only-trunk/checkout/modules/analysis/build/smartcn
[echo] Building analyzers-stempel...
clean:
[delete] Deleting directory /usr/home/hudson/hudson-slave/workspace/Lucene-Solr-tests-only-trunk/checkout/modules/analysis/build/stempel
[echo] Building benchmark...
clean:
[delete] Deleting directory /usr/home/hudson/hudson-slave/workspace/Lucene-Solr-tests-only-trunk/checkout/modules/benchmark/build
clean-contrib:
clean:
clean:
clean:
clean:
clean:
clean:
[delete] Deleting directory /usr/home/hudson/hudson-slave/workspace/Lucene-Solr-tests-only-trunk/checkout/solr/build
BUILD SUCCESSFUL
Total time: 4 seconds
+ cd /home/hudson/hudson-slave/workspace/Lucene-Solr-tests-only-trunk/checkout/lucene
+ JAVA_HOME=/home/hudson/tools/java/latest1.5 /home/hudson/tools/ant/latest1.7/bin/ant compile compile-test build-contrib
Buildfile: build.xml
jflex-uptodate-check:
jflex-notice:
javacc-uptodate-check:
javacc-notice:
init:
clover.setup:
clover.info:
[echo]
[echo] Clover not found. Code coverage reports disabled.
[echo]
clover:
common.compile-core:
[mkdir] Created dir: /usr/home/hudson/hudson-slave/workspace/Lucene-Solr-tests-only-trunk/checkout/lucene/build/classes/java
[javac] Compiling 508 source files to /usr/home/hudson/hudson-slave/workspace/Lucene-Solr-tests-only-trunk/checkout/lucene/build/classes/java
[javac] /usr/home/hudson/hudson-slave/workspace/Lucene-Solr-tests-only-trunk/checkout/lucene/src/java/org/apache/lucene/util/Version.java:80: warning: [dep-ann] deprecated name isnt annotated with @Deprecated
[javac] public boolean onOrAfter(Version other) {
[javac] ^
[javac] /usr/home/hudson/hudson-slave/workspace/Lucene-Solr-tests-only-trunk/checkout/lucene/src/java/org/apache/lucene/search/SortField.java:415: inconvertible types
[javac] found : org.apache.lucene.search.cache.CachedArrayCreator<capture of ?>
[javac] required: org.apache.lucene.search.cache.IntValuesCreator
[javac] return new FieldComparator.IntComparator(numHits, (IntValuesCreator)creator, (Integer)missingValue );
[javac] ^
[javac] /usr/home/hudson/hudson-slave/workspace/Lucene-Solr-tests-only-trunk/checkout/lucene/src/java/org/apache/lucene/search/SortField.java:418: inconvertible types
[javac] found : org.apache.lucene.search.cache.CachedArrayCreator<capture of ?>
[javac] required: org.apache.lucene.search.cache.FloatValuesCreator
[javac] return new FieldComparator.FloatComparator(numHits, (FloatValuesCreator)creator, (Float)missingValue );
[javac] ^
[javac] /usr/home/hudson/hudson-slave/workspace/Lucene-Solr-tests-only-trunk/checkout/lucene/src/java/org/apache/lucene/search/SortField.java:421: inconvertible types
[javac] found : org.apache.lucene.search.cache.CachedArrayCreator<capture of ?>
[javac] required: org.apache.lucene.search.cache.LongValuesCreator
[javac] return new FieldComparator.LongComparator(numHits, (LongValuesCreator)creator, (Long)missingValue );
[javac] ^
[javac] /usr/home/hudson/hudson-slave/workspace/Lucene-Solr-tests-only-trunk/checkout/lucene/src/java/org/apache/lucene/search/SortField.java:424: inconvertible types
[javac] found : org.apache.lucene.search.cache.CachedArrayCreator<capture of ?>
[javac] required: org.apache.lucene.search.cache.DoubleValuesCreator
[javac] return new FieldComparator.DoubleComparator(numHits, (DoubleValuesCreator)creator, (Double)missingValue );
[javac] ^
[javac] /usr/home/hudson/hudson-slave/workspace/Lucene-Solr-tests-only-trunk/checkout/lucene/src/java/org/apache/lucene/search/SortField.java:427: inconvertible types
[javac] found : org.apache.lucene.search.cache.CachedArrayCreator<capture of ?>
[javac] required: org.apache.lucene.search.cache.ByteValuesCreator
[javac] return new FieldComparator.ByteComparator(numHits, (ByteValuesCreator)creator, (Byte)missingValue );
[javac] ^
[javac] /usr/home/hudson/hudson-slave/workspace/Lucene-Solr-tests-only-trunk/checkout/lucene/src/java/org/apache/lucene/search/SortField.java:430: inconvertible types
[javac] found : org.apache.lucene.search.cache.CachedArrayCreator<capture of ?>
[javac] required: org.apache.lucene.search.cache.ShortValuesCreator
[javac] return new FieldComparator.ShortComparator(numHits, (ShortValuesCreator)creator, (Short)missingValue );
[javac] ^
[javac] /usr/home/hudson/hudson-slave/workspace/Lucene-Solr-tests-only-trunk/checkout/lucene/src/java/org/apache/lucene/queryParser/CharStream.java:34: warning: [dep-ann] deprecated name isnt annotated with @Deprecated
[javac] int getColumn();
[javac] ^
[javac] /usr/home/hudson/hudson-slave/workspace/Lucene-Solr-tests-only-trunk/checkout/lucene/src/java/org/apache/lucene/queryParser/CharStream.java:41: warning: [dep-ann] deprecated name isnt annotated with @Deprecated
[javac] int getLine();
[javac] ^
[javac] Note: Some input files use or override a deprecated API.
[javac] Note: Recompile with -Xlint:deprecation for details.
[javac] 6 errors
[...truncated 10 lines...]
---------------------------------------------------------------------
To unsubscribe, e-mail: dev-unsubscribe@lucene.apache.org
For additional commands, e-mail: dev-help@lucene.apache.org