You are viewing a plain text version of this content. The canonical link for it is here.
Posted to notifications@ctakes.apache.org by Apache Jenkins Server <je...@builds.apache.org> on 2019/12/03 19:00:42 UTC

Build failed in Jenkins: ctakes-trunk-compiletest #1255

See <https://builds.apache.org/job/ctakes-trunk-compiletest/1255/display/redirect?page=changes>

Changes:

[seanfinan] Add Requirements for DTR


------------------------------------------
[...truncated 1.15 MB...]
Downloaded: https://maven.java.net/content/repositories/snapshots/org/glassfish/javax.el/maven-metadata.xml (417 B at 0.6 KB/sec)
Downloaded: https://maven.java.net/content/repositories/releases/org/glassfish/javax.el/maven-metadata.xml (952 B at 1.4 KB/sec)
[WARNING] Could not transfer metadata org.glassfish:javax.el/maven-metadata.xml from/to sonatype-snapshots (http://oss.sonatype.org/content/groups/jetty): Access denied to: http://oss.sonatype.org/content/groups/jetty/org/glassfish/javax.el/maven-metadata.xml
Downloading: http://repo.maven.apache.org/maven2/org/glassfish/javax.el/3.0.1-b01/javax.el-3.0.1-b01.pom
Downloaded: http://repo.maven.apache.org/maven2/org/glassfish/javax.el/3.0.1-b01/javax.el-3.0.1-b01.pom (18 KB at 1561.4 KB/sec)
Downloading: http://repo.maven.apache.org/maven2/org/glassfish/javax.el/3.0.1-b02/javax.el-3.0.1-b02.pom
Downloaded: http://repo.maven.apache.org/maven2/org/glassfish/javax.el/3.0.1-b02/javax.el-3.0.1-b02.pom (18 KB at 1431.3 KB/sec)
Downloading: http://repo.maven.apache.org/maven2/org/glassfish/javax.el/3.0.1-b03/javax.el-3.0.1-b03.pom
Downloaded: http://repo.maven.apache.org/maven2/org/glassfish/javax.el/3.0.1-b03/javax.el-3.0.1-b03.pom (18 KB at 636.1 KB/sec)
Downloading: http://repo.maven.apache.org/maven2/org/glassfish/javax.el/3.0.1-b04/javax.el-3.0.1-b04.pom
Downloaded: http://repo.maven.apache.org/maven2/org/glassfish/javax.el/3.0.1-b04/javax.el-3.0.1-b04.pom (18 KB at 1431.3 KB/sec)
Downloading: http://repo.maven.apache.org/maven2/org/glassfish/javax.el/3.0.1-b05/javax.el-3.0.1-b05.pom
Downloaded: http://repo.maven.apache.org/maven2/org/glassfish/javax.el/3.0.1-b05/javax.el-3.0.1-b05.pom (18 KB at 1431.3 KB/sec)
Downloading: http://repository.apache.org/snapshots/org/glassfish/javax.el/3.0.1-b06-SNAPSHOT/maven-metadata.xml
Downloading: http://oss.sonatype.org/content/groups/jetty/org/glassfish/javax.el/3.0.1-b06-SNAPSHOT/maven-metadata.xml
Downloading: https://maven.java.net/content/repositories/snapshots/org/glassfish/javax.el/3.0.1-b06-SNAPSHOT/maven-metadata.xml
[WARNING] Could not transfer metadata org.glassfish:javax.el:3.0.1-b06-SNAPSHOT/maven-metadata.xml from/to sonatype-snapshots (http://oss.sonatype.org/content/groups/jetty): Access denied to: http://oss.sonatype.org/content/groups/jetty/org/glassfish/javax.el/3.0.1-b06-SNAPSHOT/maven-metadata.xml
[WARNING] Failure to transfer org.glassfish:javax.el:3.0.1-b06-SNAPSHOT/maven-metadata.xml from http://oss.sonatype.org/content/groups/jetty was cached in the local repository, resolution will not be reattempted until the update interval of sonatype-snapshots has elapsed or updates are forced. Original error: Could not transfer metadata org.glassfish:javax.el:3.0.1-b06-SNAPSHOT/maven-metadata.xml from/to sonatype-snapshots (http://oss.sonatype.org/content/groups/jetty): Access denied to: http://oss.sonatype.org/content/groups/jetty/org/glassfish/javax.el/3.0.1-b06-SNAPSHOT/maven-metadata.xml
Downloading: http://repository.apache.org/snapshots/org/glassfish/javax.el/3.0.1-b06-SNAPSHOT/javax.el-3.0.1-b06-SNAPSHOT.pom
Downloading: http://oss.sonatype.org/content/groups/jetty/org/glassfish/javax.el/3.0.1-b06-SNAPSHOT/javax.el-3.0.1-b06-SNAPSHOT.pom
Downloading: https://maven.java.net/content/repositories/snapshots/org/glassfish/javax.el/3.0.1-b06-SNAPSHOT/javax.el-3.0.1-b06-SNAPSHOT.pom
Downloading: http://repo.maven.apache.org/maven2/org/glassfish/javax.el/3.0.1-b06/javax.el-3.0.1-b06.pom
Downloaded: http://repo.maven.apache.org/maven2/org/glassfish/javax.el/3.0.1-b06/javax.el-3.0.1-b06.pom (18 KB at 1561.4 KB/sec)
Downloading: http://repository.apache.org/snapshots/org/glassfish/javax.el/3.0.1-b07-SNAPSHOT/maven-metadata.xml
Downloading: https://maven.java.net/content/repositories/snapshots/org/glassfish/javax.el/3.0.1-b07-SNAPSHOT/maven-metadata.xml
Downloading: http://oss.sonatype.org/content/groups/jetty/org/glassfish/javax.el/3.0.1-b07-SNAPSHOT/maven-metadata.xml
[WARNING] Could not transfer metadata org.glassfish:javax.el:3.0.1-b07-SNAPSHOT/maven-metadata.xml from/to sonatype-snapshots (http://oss.sonatype.org/content/groups/jetty): Access denied to: http://oss.sonatype.org/content/groups/jetty/org/glassfish/javax.el/3.0.1-b07-SNAPSHOT/maven-metadata.xml
[WARNING] Failure to transfer org.glassfish:javax.el:3.0.1-b07-SNAPSHOT/maven-metadata.xml from http://oss.sonatype.org/content/groups/jetty was cached in the local repository, resolution will not be reattempted until the update interval of sonatype-snapshots has elapsed or updates are forced. Original error: Could not transfer metadata org.glassfish:javax.el:3.0.1-b07-SNAPSHOT/maven-metadata.xml from/to sonatype-snapshots (http://oss.sonatype.org/content/groups/jetty): Access denied to: http://oss.sonatype.org/content/groups/jetty/org/glassfish/javax.el/3.0.1-b07-SNAPSHOT/maven-metadata.xml
Downloading: http://repository.apache.org/snapshots/org/glassfish/javax.el/3.0.1-b07-SNAPSHOT/javax.el-3.0.1-b07-SNAPSHOT.pom
Downloading: http://oss.sonatype.org/content/groups/jetty/org/glassfish/javax.el/3.0.1-b07-SNAPSHOT/javax.el-3.0.1-b07-SNAPSHOT.pom
Downloading: https://maven.java.net/content/repositories/snapshots/org/glassfish/javax.el/3.0.1-b07-SNAPSHOT/javax.el-3.0.1-b07-SNAPSHOT.pom
Downloading: http://repo.maven.apache.org/maven2/org/glassfish/javax.el/3.0.1-b07/javax.el-3.0.1-b07.pom
Downloaded: http://repo.maven.apache.org/maven2/org/glassfish/javax.el/3.0.1-b07/javax.el-3.0.1-b07.pom (18 KB at 1431.3 KB/sec)
Downloading: http://repository.apache.org/snapshots/org/glassfish/javax.el/3.0.1-b08-SNAPSHOT/maven-metadata.xml
Downloading: http://oss.sonatype.org/content/groups/jetty/org/glassfish/javax.el/3.0.1-b08-SNAPSHOT/maven-metadata.xml
Downloading: https://maven.java.net/content/repositories/snapshots/org/glassfish/javax.el/3.0.1-b08-SNAPSHOT/maven-metadata.xml
[WARNING] Could not transfer metadata org.glassfish:javax.el:3.0.1-b08-SNAPSHOT/maven-metadata.xml from/to sonatype-snapshots (http://oss.sonatype.org/content/groups/jetty): Access denied to: http://oss.sonatype.org/content/groups/jetty/org/glassfish/javax.el/3.0.1-b08-SNAPSHOT/maven-metadata.xml
[WARNING] Failure to transfer org.glassfish:javax.el:3.0.1-b08-SNAPSHOT/maven-metadata.xml from http://oss.sonatype.org/content/groups/jetty was cached in the local repository, resolution will not be reattempted until the update interval of sonatype-snapshots has elapsed or updates are forced. Original error: Could not transfer metadata org.glassfish:javax.el:3.0.1-b08-SNAPSHOT/maven-metadata.xml from/to sonatype-snapshots (http://oss.sonatype.org/content/groups/jetty): Access denied to: http://oss.sonatype.org/content/groups/jetty/org/glassfish/javax.el/3.0.1-b08-SNAPSHOT/maven-metadata.xml
Downloading: http://repository.apache.org/snapshots/org/glassfish/javax.el/3.0.1-b08-SNAPSHOT/javax.el-3.0.1-b08-SNAPSHOT.pom
Downloading: http://oss.sonatype.org/content/groups/jetty/org/glassfish/javax.el/3.0.1-b08-SNAPSHOT/javax.el-3.0.1-b08-SNAPSHOT.pom
Downloading: https://maven.java.net/content/repositories/snapshots/org/glassfish/javax.el/3.0.1-b08-SNAPSHOT/javax.el-3.0.1-b08-SNAPSHOT.pom
Downloading: http://repo.maven.apache.org/maven2/org/glassfish/javax.el/3.0.1-b08/javax.el-3.0.1-b08.pom
Downloaded: http://repo.maven.apache.org/maven2/org/glassfish/javax.el/3.0.1-b08/javax.el-3.0.1-b08.pom (18 KB at 1321.2 KB/sec)
Downloading: http://repo.maven.apache.org/maven2/org/glassfish/javax.el/3.0.1-b09/javax.el-3.0.1-b09.pom
Downloaded: http://repo.maven.apache.org/maven2/org/glassfish/javax.el/3.0.1-b09/javax.el-3.0.1-b09.pom (18 KB at 1425.4 KB/sec)
Downloading: http://repository.apache.org/snapshots/org/glassfish/javax.el/3.0.1-b11-SNAPSHOT/maven-metadata.xml
Downloading: https://maven.java.net/content/repositories/snapshots/org/glassfish/javax.el/3.0.1-b11-SNAPSHOT/maven-metadata.xml
Downloading: http://oss.sonatype.org/content/groups/jetty/org/glassfish/javax.el/3.0.1-b11-SNAPSHOT/maven-metadata.xml
[WARNING] Could not transfer metadata org.glassfish:javax.el:3.0.1-b11-SNAPSHOT/maven-metadata.xml from/to sonatype-snapshots (http://oss.sonatype.org/content/groups/jetty): Access denied to: http://oss.sonatype.org/content/groups/jetty/org/glassfish/javax.el/3.0.1-b11-SNAPSHOT/maven-metadata.xml
[WARNING] Failure to transfer org.glassfish:javax.el:3.0.1-b11-SNAPSHOT/maven-metadata.xml from http://oss.sonatype.org/content/groups/jetty was cached in the local repository, resolution will not be reattempted until the update interval of sonatype-snapshots has elapsed or updates are forced. Original error: Could not transfer metadata org.glassfish:javax.el:3.0.1-b11-SNAPSHOT/maven-metadata.xml from/to sonatype-snapshots (http://oss.sonatype.org/content/groups/jetty): Access denied to: http://oss.sonatype.org/content/groups/jetty/org/glassfish/javax.el/3.0.1-b11-SNAPSHOT/maven-metadata.xml
Downloading: http://repository.apache.org/snapshots/org/glassfish/javax.el/3.0.1-b11-SNAPSHOT/javax.el-3.0.1-b11-SNAPSHOT.pom
Downloading: http://oss.sonatype.org/content/groups/jetty/org/glassfish/javax.el/3.0.1-b11-SNAPSHOT/javax.el-3.0.1-b11-SNAPSHOT.pom
Downloading: https://maven.java.net/content/repositories/snapshots/org/glassfish/javax.el/3.0.1-b11-SNAPSHOT/javax.el-3.0.1-b11-SNAPSHOT.pom
Downloading: http://repo.maven.apache.org/maven2/org/eclipse/jetty/orbit/org.apache.taglibs.standard.glassfish/1.2.0.v201112081803/org.apache.taglibs.standard.glassfish-1.2.0.v201112081803.pom
Downloaded: http://repo.maven.apache.org/maven2/org/eclipse/jetty/orbit/org.apache.taglibs.standard.glassfish/1.2.0.v201112081803/org.apache.taglibs.standard.glassfish-1.2.0.v201112081803.pom (980 B at 87.0 KB/sec)
Downloading: http://repo.maven.apache.org/maven2/org/eclipse/jetty/orbit/javax.servlet.jsp/2.1.0.v201105211820/javax.servlet.jsp-2.1.0.v201105211820.pom
Downloaded: http://repo.maven.apache.org/maven2/org/eclipse/jetty/orbit/javax.servlet.jsp/2.1.0.v201105211820/javax.servlet.jsp-2.1.0.v201105211820.pom (941 B at 91.9 KB/sec)
[JENKINS] Archiving disabled
[INFO] ------------------------------------------------------------------------
[INFO] Reactor Summary:
[INFO] 
[INFO] Apache cTAKES 4.0.1-SNAPSHOT ....................... SUCCESS [  7.027 s]
[INFO] ctakes-gui-res ..................................... SUCCESS [  5.764 s]
[INFO] Apache cTAKES Resources core ....................... SUCCESS [  2.384 s]
[INFO] Apache cTAKES common type system ................... SUCCESS [  9.930 s]
[INFO] Apache cTAKES utils ................................ SUCCESS [  4.034 s]
[INFO] Apache cTAKES core ................................. SUCCESS [01:13 min]
[INFO] ctakes-gui ......................................... SUCCESS [  5.950 s]
[INFO] Apache cTAKES fhir support ......................... SUCCESS [  4.946 s]
[INFO] Apache cTAKES Resources pos-tagger ................. SUCCESS [  2.552 s]
[INFO] Apache cTAKES part-of-speech tagger ................ SUCCESS [  5.732 s]
[INFO] Apache cTAKES Resources ctakes-chunker-res ......... SUCCESS [  2.412 s]
[INFO] Apache cTAKES chunker .............................. SUCCESS [  4.142 s]
[INFO] Apache cTAKES document preprocessor ................ SUCCESS [  3.692 s]
[INFO] Apache cTAKES Resources dictionary-lookup .......... SUCCESS [ 17.412 s]
[INFO] Apache cTAKES dictionary lookup .................... SUCCESS [  4.433 s]
[INFO] Apache cTAKES context dependent tokenizer .......... SUCCESS [  4.670 s]
[INFO] Apache cTAKES Resources lvg ........................ SUCCESS [ 39.359 s]
[INFO] Apache cTAKES LVG lexical tools .................... SUCCESS [  7.997 s]
[INFO] Apache cTAKES Resources ne-contexts ................ SUCCESS [  2.249 s]
[INFO] Apache cTAKES named entity contexts ................ SUCCESS [  4.466 s]
[INFO] Apache cTAKES Resources constituency-parser ........ SUCCESS [  2.519 s]
[INFO] Apache cTAKES Constituency Parser .................. SUCCESS [  3.366 s]
[INFO] Apache cTAKES Resources coreference ................ SUCCESS [  2.739 s]
[INFO] Apache cTAKES Resources temporal ................... SUCCESS [  2.296 s]
[INFO] Apache cTAKES Resources relation-extractor ......... SUCCESS [  2.299 s]
[INFO] Apache cTAKES Resources dictionary-lookup-fast-res . SUCCESS [  4.381 s]
[INFO] Apache cTAKES dictionary lookup fast ............... SUCCESS [  3.175 s]
[INFO] Apache cTAKES Resources assertion .................. SUCCESS [  2.671 s]
[INFO] Apache cTAKES Resources dependency-parser .......... SUCCESS [  3.531 s]
[INFO] Apache cTAKES Resources dependency-parser clearNLP . SUCCESS [  2.713 s]
[INFO] Apache cTAKES Dependency Parser .................... SUCCESS [ 40.144 s]
[INFO] Apache cTAKES Assertion ............................ SUCCESS [  5.016 s]
[INFO] ctakes-clinical-pipeline-res ....................... SUCCESS [  2.688 s]
[INFO] Apache cTAKES ctakes-clinical-pipeline ............. SUCCESS [  6.093 s]
[INFO] Apache cTAKES Relation Extractor ................... SUCCESS [  8.927 s]
[INFO] Apache cTAKES Temporal Information Extraction ...... SUCCESS [01:44 min]
[INFO] Apache cTAKES CoReference Resolver ................. SUCCESS [  8.429 s]
[INFO] Apache cTAKES Resources drug-ner ................... SUCCESS [  2.376 s]
[INFO] Apache cTAKES Drug NER ............................. SUCCESS [  7.283 s]
[INFO] Apache cTAKES Resources side-effect ................ SUCCESS [  2.491 s]
[INFO] Apache cTAKES Side Effects ......................... SUCCESS [  6.833 s]
[INFO] Apache cTAKES Resources smoking-status ............. SUCCESS [  2.610 s]
[INFO] Apache cTAKES Smoking Status ....................... SUCCESS [  7.426 s]
[INFO] Apache cTAKES Resources assertion-zoner ............ SUCCESS [  2.459 s]
[INFO] Apache cTAKES Assertion's zoner .................... SUCCESS [  3.192 s]
[INFO] ctakes-examples-res ................................ SUCCESS [  2.304 s]
[INFO] ctakes-examples .................................... SUCCESS [  7.203 s]
[INFO] Apache cTAKES Resources ctakes-ytex-res ............ SUCCESS [  2.256 s]
[INFO] Apache cTAKES YTEX ................................. SUCCESS [ 15.163 s]
[INFO] Apache cTAKES YTEX UIMA ............................ SUCCESS [  7.827 s]
[INFO] Apache cTAKES YTEX Web ............................. FAILURE [  6.347 s]
[INFO] Apache cTAKES Tiny Rest Service .................... SKIPPED
[INFO] Apache cTAKES Distribution ......................... SKIPPED
[INFO] Apache cTAKES Regression-test ...................... SKIPPED
[INFO] Apache cTAKES template filler ...................... SKIPPED
[INFO] Apache cTAKES Dockhand 4.0.1-SNAPSHOT .............. SKIPPED
[INFO] ------------------------------------------------------------------------
[INFO] BUILD FAILURE
[INFO] ------------------------------------------------------------------------
[INFO] Total time: 10:26 min
[INFO] Finished at: 2019-12-03T18:59:47Z
[INFO] ------------------------------------------------------------------------
[JENKINS] Archiving disabled
[JENKINS] Archiving disabled
[JENKINS] Archiving disabled
[JENKINS] Archiving disabled
[JENKINS] Archiving disabled
[JENKINS] Archiving disabled
[JENKINS] Archiving disabled
[JENKINS] Archiving disabled
[JENKINS] Archiving disabled
[JENKINS] Archiving disabled
[JENKINS] Archiving disabled
[JENKINS] Archiving disabled
[JENKINS] Archiving disabled
[JENKINS] Archiving disabled
[JENKINS] Archiving disabled
[JENKINS] Archiving disabled
[JENKINS] Archiving disabled
[JENKINS] Archiving disabled
[JENKINS] Archiving disabled
[JENKINS] Archiving disabled
[JENKINS] Archiving disabled
[JENKINS] Archiving disabled
[JENKINS] Archiving disabled
[JENKINS] Archiving disabled
[JENKINS] Archiving disabled
[JENKINS] Archiving disabled
[JENKINS] Archiving disabled
[JENKINS] Archiving disabled
[JENKINS] Archiving disabled
[JENKINS] Archiving disabled
[JENKINS] Archiving disabled
[JENKINS] Archiving disabled
[JENKINS] Archiving disabled
[JENKINS] Archiving disabled
[JENKINS] Archiving disabled
[JENKINS] Archiving disabled
[JENKINS] Archiving disabled
[JENKINS] Archiving disabled
[JENKINS] Archiving disabled
[JENKINS] Archiving disabled
[JENKINS] Archiving disabled
[JENKINS] Archiving disabled
[JENKINS] Archiving disabled
[JENKINS] Archiving disabled
[JENKINS] Archiving disabled
[JENKINS] Archiving disabled
[JENKINS] Archiving disabled
[JENKINS] Archiving disabled
[JENKINS] Archiving disabled
[JENKINS] Archiving disabled
[JENKINS] Archiving disabled
[JENKINS] Archiving disabled
[JENKINS] Archiving disabled
[JENKINS] Archiving disabled
[JENKINS] Archiving disabled
[JENKINS] Archiving disabled
Waiting for Jenkins to finish collecting data
[ERROR] Failed to execute goal on project ctakes-ytex-web: Could not resolve dependencies for project org.apache.ctakes:ctakes-ytex-web:war:4.0.1-SNAPSHOT: Failed to collect dependencies for [org.apache.ctakes:ctakes-ytex:jar:4.0.1-SNAPSHOT (compile), org.apache.ctakes:ctakes-ytex-res:jar:4.0.1-SNAPSHOT (compile), org.springframework:spring-web:jar:4.3.12.RELEASE (compile), com.sun.faces:jsf-api:jar:2.1.3 (compile), com.sun.faces:jsf-impl:jar:2.1.3 (compile), org.icefaces:icefaces:jar:2.0.2 (compile), org.icefaces:icefaces-ace:jar:2.0.2 (compile), org.icefaces:icefaces-compat:jar:2.0.2 (compile), backport-util-concurrent:backport-util-concurrent:jar:3.1 (compile), net.sf.jsr107cache:jsr107cache:jar:1.0 (compile), org.apache.cxf:cxf-rt-frontend-jaxws:jar:2.7.8 (compile), org.apache.cxf:cxf-rt-frontend-jaxrs:jar:2.7.8 (compile), org.apache.cxf:cxf-rt-transports-http:jar:2.7.8 (compile), org.apache.cxf:cxf-rt-databinding-aegis:jar:2.7.8 (compile), javax.servlet.jsp:jsp-api:jar:2.2 (compile), javax.servlet:jstl:jar:1.2 (compile), commons-el:commons-el:jar:1.0 (compile), org.glassfish.web:el-impl:jar:2.2 (compile), org.eclipse.jetty:jetty-server:jar:9.1.0.M0 (compile), org.eclipse.jetty:jetty-runner:jar:9.1.0.M0 (compile), org.eclipse.jetty:jetty-jsp:jar:9.1.0.M0 (compile)]: Failed to read artifact descriptor for org.glassfish:javax.el:jar:3.0.1-b06-SNAPSHOT: Could not transfer artifact org.glassfish:javax.el:pom:3.0.1-b06-SNAPSHOT from/to sonatype-snapshots (http://oss.sonatype.org/content/groups/jetty): Access denied to: http://oss.sonatype.org/content/groups/jetty/org/glassfish/javax.el/3.0.1-b06-SNAPSHOT/javax.el-3.0.1-b06-SNAPSHOT.pom -> [Help 1]
[ERROR] 
[ERROR] To see the full stack trace of the errors, re-run Maven with the -e switch.
[ERROR] Re-run Maven using the -X switch to enable full debug logging.
[ERROR] 
[ERROR] For more information about the errors and possible solutions, please read the following articles:
[ERROR] [Help 1] http://cwiki.apache.org/confluence/display/MAVEN/DependencyResolutionException
[ERROR] 
[ERROR] After correcting the problems, you can resume the build with the command
[ERROR]   mvn <goals> -rf :ctakes-ytex-web
No mail will be sent out, as 'ctakes-trunk-compiletest » Apache cTAKES fhir support #1255' does not have a result yet. Please make sure you set a proper result in case of pipeline/build scripts.
No mail will be sent out, as 'ctakes-trunk-compiletest » Apache cTAKES ctakes-clinical-pipeline #1255' does not have a result yet. Please make sure you set a proper result in case of pipeline/build scripts.
No mail will be sent out, as 'ctakes-trunk-compiletest » Apache cTAKES common type system #1255' does not have a result yet. Please make sure you set a proper result in case of pipeline/build scripts.
No mail will be sent out, as 'ctakes-trunk-compiletest » Apache cTAKES dictionary lookup #1255' does not have a result yet. Please make sure you set a proper result in case of pipeline/build scripts.
No mail will be sent out, as 'ctakes-trunk-compiletest » Apache cTAKES Constituency Parser #1255' does not have a result yet. Please make sure you set a proper result in case of pipeline/build scripts.
No mail will be sent out, as 'ctakes-trunk-compiletest » ctakes-examples-res #1255' does not have a result yet. Please make sure you set a proper result in case of pipeline/build scripts.
No mail will be sent out, as 'ctakes-trunk-compiletest » Apache cTAKES Temporal Information Extraction #1255' does not have a result yet. Please make sure you set a proper result in case of pipeline/build scripts.
No mail will be sent out, as 'ctakes-trunk-compiletest » Apache cTAKES Resources ctakes-chunker-res #1255' does not have a result yet. Please make sure you set a proper result in case of pipeline/build scripts.
No mail will be sent out, as 'ctakes-trunk-compiletest » Apache cTAKES Regression-test #1255' does not have a result yet. Please make sure you set a proper result in case of pipeline/build scripts.
No mail will be sent out, as 'ctakes-trunk-compiletest » Apache cTAKES Relation Extractor #1255' does not have a result yet. Please make sure you set a proper result in case of pipeline/build scripts.
No mail will be sent out, as 'ctakes-trunk-compiletest » ctakes-gui #1255' does not have a result yet. Please make sure you set a proper result in case of pipeline/build scripts.
No mail will be sent out, as 'ctakes-trunk-compiletest » Apache cTAKES document preprocessor #1255' does not have a result yet. Please make sure you set a proper result in case of pipeline/build scripts.
No mail will be sent out, as 'ctakes-trunk-compiletest » Apache cTAKES Resources assertion #1255' does not have a result yet. Please make sure you set a proper result in case of pipeline/build scripts.
No mail will be sent out, as 'ctakes-trunk-compiletest » Apache cTAKES Resources assertion-zoner #1255' does not have a result yet. Please make sure you set a proper result in case of pipeline/build scripts.
No mail will be sent out, as 'ctakes-trunk-compiletest » Apache cTAKES Assertion's zoner #1255' does not have a result yet. Please make sure you set a proper result in case of pipeline/build scripts.
No mail will be sent out, as 'ctakes-trunk-compiletest » Apache cTAKES Resources ne-contexts #1255' does not have a result yet. Please make sure you set a proper result in case of pipeline/build scripts.
No mail will be sent out, as 'ctakes-trunk-compiletest » Apache cTAKES Dockhand #1255' does not have a result yet. Please make sure you set a proper result in case of pipeline/build scripts.
No mail will be sent out, as 'ctakes-trunk-compiletest » Apache cTAKES Drug NER #1255' does not have a result yet. Please make sure you set a proper result in case of pipeline/build scripts.
Sending e-mails to: notifications@ctakes.apache.org
No mail will be sent out, as 'ctakes-trunk-compiletest » Apache cTAKES context dependent tokenizer #1255' does not have a result yet. Please make sure you set a proper result in case of pipeline/build scripts.
No mail will be sent out, as 'ctakes-trunk-compiletest » Apache cTAKES Resources side-effect #1255' does not have a result yet. Please make sure you set a proper result in case of pipeline/build scripts.
No mail will be sent out, as 'ctakes-trunk-compiletest » ctakes-examples #1255' does not have a result yet. Please make sure you set a proper result in case of pipeline/build scripts.
No mail will be sent out, as 'ctakes-trunk-compiletest » Apache cTAKES Resources dictionary-lookup-fast-res #1255' does not have a result yet. Please make sure you set a proper result in case of pipeline/build scripts.
No mail will be sent out, as 'ctakes-trunk-compiletest » Apache cTAKES dictionary lookup fast #1255' does not have a result yet. Please make sure you set a proper result in case of pipeline/build scripts.
No mail will be sent out, as 'ctakes-trunk-compiletest » Apache cTAKES named entity contexts #1255' does not have a result yet. Please make sure you set a proper result in case of pipeline/build scripts.
No mail will be sent out, as 'ctakes-trunk-compiletest » Apache cTAKES LVG lexical tools #1255' does not have a result yet. Please make sure you set a proper result in case of pipeline/build scripts.
No mail will be sent out, as 'ctakes-trunk-compiletest » Apache cTAKES Resources smoking-status #1255' does not have a result yet. Please make sure you set a proper result in case of pipeline/build scripts.
No mail will be sent out, as 'ctakes-trunk-compiletest » Apache cTAKES part-of-speech tagger #1255' does not have a result yet. Please make sure you set a proper result in case of pipeline/build scripts.
No mail will be sent out, as 'ctakes-trunk-compiletest » Apache cTAKES Side Effects #1255' does not have a result yet. Please make sure you set a proper result in case of pipeline/build scripts.
No mail will be sent out, as 'ctakes-trunk-compiletest » Apache cTAKES template filler #1255' does not have a result yet. Please make sure you set a proper result in case of pipeline/build scripts.
No mail will be sent out, as 'ctakes-trunk-compiletest » Apache cTAKES #1255' does not have a result yet. Please make sure you set a proper result in case of pipeline/build scripts.
No mail will be sent out, as 'ctakes-trunk-compiletest » Apache cTAKES chunker #1255' does not have a result yet. Please make sure you set a proper result in case of pipeline/build scripts.
No mail will be sent out, as 'ctakes-trunk-compiletest » Apache cTAKES Tiny Rest Service #1255' does not have a result yet. Please make sure you set a proper result in case of pipeline/build scripts.
No mail will be sent out, as 'ctakes-trunk-compiletest » Apache cTAKES Resources dependency-parser clearNLP #1255' does not have a result yet. Please make sure you set a proper result in case of pipeline/build scripts.
No mail will be sent out, as 'ctakes-trunk-compiletest » Apache cTAKES utils #1255' does not have a result yet. Please make sure you set a proper result in case of pipeline/build scripts.
No mail will be sent out, as 'ctakes-trunk-compiletest » Apache cTAKES Resources drug-ner #1255' does not have a result yet. Please make sure you set a proper result in case of pipeline/build scripts.
No mail will be sent out, as 'ctakes-trunk-compiletest » Apache cTAKES core #1255' does not have a result yet. Please make sure you set a proper result in case of pipeline/build scripts.
No mail will be sent out, as 'ctakes-trunk-compiletest » Apache cTAKES Dependency Parser #1255' does not have a result yet. Please make sure you set a proper result in case of pipeline/build scripts.
No mail will be sent out, as 'ctakes-trunk-compiletest » Apache cTAKES Distribution #1255' does not have a result yet. Please make sure you set a proper result in case of pipeline/build scripts.
No mail will be sent out, as 'ctakes-trunk-compiletest » Apache cTAKES Resources coreference #1255' does not have a result yet. Please make sure you set a proper result in case of pipeline/build scripts.
No mail will be sent out, as 'ctakes-trunk-compiletest » Apache cTAKES CoReference Resolver #1255' does not have a result yet. Please make sure you set a proper result in case of pipeline/build scripts.
No mail will be sent out, as 'ctakes-trunk-compiletest » Apache cTAKES Assertion #1255' does not have a result yet. Please make sure you set a proper result in case of pipeline/build scripts.
No mail will be sent out, as 'ctakes-trunk-compiletest » ctakes-clinical-pipeline-res #1255' does not have a result yet. Please make sure you set a proper result in case of pipeline/build scripts.
No mail will be sent out, as 'ctakes-trunk-compiletest » Apache cTAKES Resources ctakes-ytex-res #1255' does not have a result yet. Please make sure you set a proper result in case of pipeline/build scripts.
No mail will be sent out, as 'ctakes-trunk-compiletest » Apache cTAKES Resources dictionary-lookup #1255' does not have a result yet. Please make sure you set a proper result in case of pipeline/build scripts.
No mail will be sent out, as 'ctakes-trunk-compiletest » Apache cTAKES Resources temporal #1255' does not have a result yet. Please make sure you set a proper result in case of pipeline/build scripts.
No mail will be sent out, as 'ctakes-trunk-compiletest » ctakes-gui-res #1255' does not have a result yet. Please make sure you set a proper result in case of pipeline/build scripts.
No mail will be sent out, as 'ctakes-trunk-compiletest » Apache cTAKES Resources lvg #1255' does not have a result yet. Please make sure you set a proper result in case of pipeline/build scripts.
No mail will be sent out, as 'ctakes-trunk-compiletest » Apache cTAKES YTEX #1255' does not have a result yet. Please make sure you set a proper result in case of pipeline/build scripts.
No mail will be sent out, as 'ctakes-trunk-compiletest » Apache cTAKES Resources relation-extractor #1255' does not have a result yet. Please make sure you set a proper result in case of pipeline/build scripts.
No mail will be sent out, as 'ctakes-trunk-compiletest » Apache cTAKES Resources constituency-parser #1255' does not have a result yet. Please make sure you set a proper result in case of pipeline/build scripts.
No mail will be sent out, as 'ctakes-trunk-compiletest » Apache cTAKES Resources core #1255' does not have a result yet. Please make sure you set a proper result in case of pipeline/build scripts.
No mail will be sent out, as 'ctakes-trunk-compiletest » Apache cTAKES Resources dependency-parser #1255' does not have a result yet. Please make sure you set a proper result in case of pipeline/build scripts.
No mail will be sent out, as 'ctakes-trunk-compiletest » Apache cTAKES Smoking Status #1255' does not have a result yet. Please make sure you set a proper result in case of pipeline/build scripts.
No mail will be sent out, as 'ctakes-trunk-compiletest » Apache cTAKES Resources pos-tagger #1255' does not have a result yet. Please make sure you set a proper result in case of pipeline/build scripts.
No mail will be sent out, as 'ctakes-trunk-compiletest » Apache cTAKES YTEX UIMA #1255' does not have a result yet. Please make sure you set a proper result in case of pipeline/build scripts.
channel stopped
[ctakes-trunk-compiletest] $ /bin/bash -xe /tmp/jenkins831771359632868101.sh
+ rm -fr '/tmp/ctakes-*'

Jenkins build is back to normal : ctakes-trunk-compiletest #1256

Posted by Apache Jenkins Server <je...@builds.apache.org>.
See <https://builds.apache.org/job/ctakes-trunk-compiletest/1256/display/redirect>