You are viewing a plain text version of this content. The canonical link for it is here.
Posted to dev@lucene.apache.org by Policeman Jenkins Server <je...@thetaphi.de> on 2017/04/30 08:20:41 UTC

[JENKINS] Lucene-Solr-master-Linux (32bit/jdk1.8.0_121) - Build # 19518 - Failure!

Build: https://jenkins.thetaphi.de/job/Lucene-Solr-master-Linux/19518/
Java: 32bit/jdk1.8.0_121 -client -XX:+UseG1GC

All tests passed

Build Log:
[...truncated 13381 lines...]
   [junit4] JVM J2: stdout was not empty, see: /home/jenkins/workspace/Lucene-Solr-master-Linux/solr/build/solr-core/test/temp/junit4-J2-20170430_073349_7322563317394179065381.sysout
   [junit4] >>> JVM J2 emitted unexpected output (verbatim) ----
   [junit4] java.lang.OutOfMemoryError: Java heap space
   [junit4] Dumping heap to /home/jenkins/workspace/Lucene-Solr-master-Linux/heapdumps/java_pid15431.hprof ...
   [junit4] Heap dump file created [291592528 bytes in 0.507 secs]
   [junit4] <<< JVM J2: EOF ----

[...truncated 7479 lines...]
BUILD FAILED
/home/jenkins/workspace/Lucene-Solr-master-Linux/build.xml:775: The following error occurred while executing this line:
/home/jenkins/workspace/Lucene-Solr-master-Linux/build.xml:727: Some of the tests produced a heap dump, but did not fail. Maybe a suppressed OutOfMemoryError? Dumps created:
* java_pid15431.hprof

Total time: 109 minutes 35 seconds
Build step 'Invoke Ant' marked build as failure
Archiving artifacts
[WARNINGS] Skipping publisher since build result is FAILURE
Recording test results
Email was triggered for: Failure - Any
Sending email for trigger: Failure - Any

[JENKINS] Lucene-Solr-master-Linux (64bit/jdk1.8.0_121) - Build # 19519 - Unstable!

Posted by Policeman Jenkins Server <je...@thetaphi.de>.
Build: https://jenkins.thetaphi.de/job/Lucene-Solr-master-Linux/19519/
Java: 64bit/jdk1.8.0_121 -XX:-UseCompressedOops -XX:+UseParallelGC

1 tests failed.
FAILED:  org.apache.solr.cloud.ShardSplitTest.testSplitWithChaosMonkey

Error Message:
There are still nodes recoverying - waited for 330 seconds

Stack Trace:
java.lang.AssertionError: There are still nodes recoverying - waited for 330 seconds
	at __randomizedtesting.SeedInfo.seed([1D378D3EBBFC0ED9:96105EEFFAFAA55D]:0)
	at org.junit.Assert.fail(Assert.java:93)
	at org.apache.solr.cloud.AbstractDistribZkTestBase.waitForRecoveriesToFinish(AbstractDistribZkTestBase.java:187)
	at org.apache.solr.cloud.AbstractDistribZkTestBase.waitForRecoveriesToFinish(AbstractDistribZkTestBase.java:144)
	at org.apache.solr.cloud.AbstractDistribZkTestBase.waitForRecoveriesToFinish(AbstractDistribZkTestBase.java:139)
	at org.apache.solr.cloud.AbstractFullDistribZkTestBase.waitForRecoveriesToFinish(AbstractFullDistribZkTestBase.java:861)
	at org.apache.solr.cloud.ShardSplitTest.testSplitWithChaosMonkey(ShardSplitTest.java:442)
	at sun.reflect.NativeMethodAccessorImpl.invoke0(Native Method)
	at sun.reflect.NativeMethodAccessorImpl.invoke(NativeMethodAccessorImpl.java:62)
	at sun.reflect.DelegatingMethodAccessorImpl.invoke(DelegatingMethodAccessorImpl.java:43)
	at java.lang.reflect.Method.invoke(Method.java:498)
	at com.carrotsearch.randomizedtesting.RandomizedRunner.invoke(RandomizedRunner.java:1713)
	at com.carrotsearch.randomizedtesting.RandomizedRunner$8.evaluate(RandomizedRunner.java:907)
	at com.carrotsearch.randomizedtesting.RandomizedRunner$9.evaluate(RandomizedRunner.java:943)
	at com.carrotsearch.randomizedtesting.RandomizedRunner$10.evaluate(RandomizedRunner.java:957)
	at org.apache.solr.BaseDistributedSearchTestCase$ShardsRepeatRule$ShardsFixedStatement.callStatement(BaseDistributedSearchTestCase.java:985)
	at org.apache.solr.BaseDistributedSearchTestCase$ShardsRepeatRule$ShardsStatement.evaluate(BaseDistributedSearchTestCase.java:960)
	at com.carrotsearch.randomizedtesting.rules.SystemPropertiesRestoreRule$1.evaluate(SystemPropertiesRestoreRule.java:57)
	at org.apache.lucene.util.TestRuleSetupTeardownChained$1.evaluate(TestRuleSetupTeardownChained.java:49)
	at org.apache.lucene.util.AbstractBeforeAfterRule$1.evaluate(AbstractBeforeAfterRule.java:45)
	at org.apache.lucene.util.TestRuleThreadAndTestName$1.evaluate(TestRuleThreadAndTestName.java:48)
	at org.apache.lucene.util.TestRuleIgnoreAfterMaxFailures$1.evaluate(TestRuleIgnoreAfterMaxFailures.java:64)
	at org.apache.lucene.util.TestRuleMarkFailure$1.evaluate(TestRuleMarkFailure.java:47)
	at com.carrotsearch.randomizedtesting.rules.StatementAdapter.evaluate(StatementAdapter.java:36)
	at com.carrotsearch.randomizedtesting.ThreadLeakControl$StatementRunner.run(ThreadLeakControl.java:368)
	at com.carrotsearch.randomizedtesting.ThreadLeakControl.forkTimeoutingTask(ThreadLeakControl.java:817)
	at com.carrotsearch.randomizedtesting.ThreadLeakControl$3.evaluate(ThreadLeakControl.java:468)
	at com.carrotsearch.randomizedtesting.RandomizedRunner.runSingleTest(RandomizedRunner.java:916)
	at com.carrotsearch.randomizedtesting.RandomizedRunner$5.evaluate(RandomizedRunner.java:802)
	at com.carrotsearch.randomizedtesting.RandomizedRunner$6.evaluate(RandomizedRunner.java:852)
	at com.carrotsearch.randomizedtesting.RandomizedRunner$7.evaluate(RandomizedRunner.java:863)
	at com.carrotsearch.randomizedtesting.rules.StatementAdapter.evaluate(StatementAdapter.java:36)
	at com.carrotsearch.randomizedtesting.rules.SystemPropertiesRestoreRule$1.evaluate(SystemPropertiesRestoreRule.java:57)
	at org.apache.lucene.util.AbstractBeforeAfterRule$1.evaluate(AbstractBeforeAfterRule.java:45)
	at com.carrotsearch.randomizedtesting.rules.StatementAdapter.evaluate(StatementAdapter.java:36)
	at org.apache.lucene.util.TestRuleStoreClassName$1.evaluate(TestRuleStoreClassName.java:41)
	at com.carrotsearch.randomizedtesting.rules.NoShadowingOrOverridesOnMethodsRule$1.evaluate(NoShadowingOrOverridesOnMethodsRule.java:40)
	at com.carrotsearch.randomizedtesting.rules.NoShadowingOrOverridesOnMethodsRule$1.evaluate(NoShadowingOrOverridesOnMethodsRule.java:40)
	at com.carrotsearch.randomizedtesting.rules.StatementAdapter.evaluate(StatementAdapter.java:36)
	at com.carrotsearch.randomizedtesting.rules.StatementAdapter.evaluate(StatementAdapter.java:36)
	at com.carrotsearch.randomizedtesting.rules.StatementAdapter.evaluate(StatementAdapter.java:36)
	at org.apache.lucene.util.TestRuleAssertionsRequired$1.evaluate(TestRuleAssertionsRequired.java:53)
	at org.apache.lucene.util.TestRuleMarkFailure$1.evaluate(TestRuleMarkFailure.java:47)
	at org.apache.lucene.util.TestRuleIgnoreAfterMaxFailures$1.evaluate(TestRuleIgnoreAfterMaxFailures.java:64)
	at org.apache.lucene.util.TestRuleIgnoreTestSuites$1.evaluate(TestRuleIgnoreTestSuites.java:54)
	at com.carrotsearch.randomizedtesting.rules.StatementAdapter.evaluate(StatementAdapter.java:36)
	at com.carrotsearch.randomizedtesting.ThreadLeakControl$StatementRunner.run(ThreadLeakControl.java:368)
	at java.lang.Thread.run(Thread.java:745)




Build Log:
[...truncated 13329 lines...]
   [junit4] Suite: org.apache.solr.cloud.ShardSplitTest
   [junit4]   2> Creating dataDir: /home/jenkins/workspace/Lucene-Solr-master-Linux/solr/build/solr-core/test/J2/temp/solr.cloud.ShardSplitTest_1D378D3EBBFC0ED9-001/init-core-data-001
   [junit4]   2> 1295213 WARN  (SUITE-ShardSplitTest-seed#[1D378D3EBBFC0ED9]-worker) [    ] o.a.s.SolrTestCaseJ4 startTrackingSearchers: numOpens=14 numCloses=14
   [junit4]   2> 1295213 INFO  (SUITE-ShardSplitTest-seed#[1D378D3EBBFC0ED9]-worker) [    ] o.a.s.SolrTestCaseJ4 Using PointFields
   [junit4]   2> 1295214 INFO  (SUITE-ShardSplitTest-seed#[1D378D3EBBFC0ED9]-worker) [    ] o.a.s.SolrTestCaseJ4 Randomized ssl (false) and clientAuth (false) via: @org.apache.solr.SolrTestCaseJ4$SuppressSSL(bugUrl=https://issues.apache.org/jira/browse/SOLR-5776)
   [junit4]   2> 1295214 INFO  (SUITE-ShardSplitTest-seed#[1D378D3EBBFC0ED9]-worker) [    ] o.a.s.BaseDistributedSearchTestCase Setting hostContext system property: /_v/
   [junit4]   2> 1295216 INFO  (TEST-ShardSplitTest.testSplitStaticIndexReplication-seed#[1D378D3EBBFC0ED9]) [    ] o.a.s.c.ZkTestServer STARTING ZK TEST SERVER
   [junit4]   2> 1295216 INFO  (Thread-2341) [    ] o.a.s.c.ZkTestServer client port:0.0.0.0/0.0.0.0:0
   [junit4]   2> 1295216 INFO  (Thread-2341) [    ] o.a.s.c.ZkTestServer Starting server
   [junit4]   2> 1295217 ERROR (Thread-2341) [    ] o.a.z.s.ZooKeeperServer ZKShutdownHandler is not registered, so ZooKeeper server won't take any action on ERROR or SHUTDOWN server state changes
   [junit4]   2> 1295316 INFO  (TEST-ShardSplitTest.testSplitStaticIndexReplication-seed#[1D378D3EBBFC0ED9]) [    ] o.a.s.c.ZkTestServer start zk server on port:44697
   [junit4]   2> 1295323 INFO  (TEST-ShardSplitTest.testSplitStaticIndexReplication-seed#[1D378D3EBBFC0ED9]) [    ] o.a.s.c.AbstractZkTestCase put /home/jenkins/workspace/Lucene-Solr-master-Linux/solr/core/src/test-files/solr/collection1/conf/solrconfig-tlog.xml to /configs/conf1/solrconfig.xml
   [junit4]   2> 1295324 INFO  (TEST-ShardSplitTest.testSplitStaticIndexReplication-seed#[1D378D3EBBFC0ED9]) [    ] o.a.s.c.AbstractZkTestCase put /home/jenkins/workspace/Lucene-Solr-master-Linux/solr/core/src/test-files/solr/collection1/conf/schema15.xml to /configs/conf1/schema.xml
   [junit4]   2> 1295325 INFO  (TEST-ShardSplitTest.testSplitStaticIndexReplication-seed#[1D378D3EBBFC0ED9]) [    ] o.a.s.c.AbstractZkTestCase put /home/jenkins/workspace/Lucene-Solr-master-Linux/solr/core/src/test-files/solr/collection1/conf/solrconfig.snippet.randomindexconfig.xml to /configs/conf1/solrconfig.snippet.randomindexconfig.xml
   [junit4]   2> 1295325 INFO  (TEST-ShardSplitTest.testSplitStaticIndexReplication-seed#[1D378D3EBBFC0ED9]) [    ] o.a.s.c.AbstractZkTestCase put /home/jenkins/workspace/Lucene-Solr-master-Linux/solr/core/src/test-files/solr/collection1/conf/stopwords.txt to /configs/conf1/stopwords.txt
   [junit4]   2> 1295326 INFO  (TEST-ShardSplitTest.testSplitStaticIndexReplication-seed#[1D378D3EBBFC0ED9]) [    ] o.a.s.c.AbstractZkTestCase put /home/jenkins/workspace/Lucene-Solr-master-Linux/solr/core/src/test-files/solr/collection1/conf/protwords.txt to /configs/conf1/protwords.txt
   [junit4]   2> 1295326 INFO  (TEST-ShardSplitTest.testSplitStaticIndexReplication-seed#[1D378D3EBBFC0ED9]) [    ] o.a.s.c.AbstractZkTestCase put /home/jenkins/workspace/Lucene-Solr-master-Linux/solr/core/src/test-files/solr/collection1/conf/currency.xml to /configs/conf1/currency.xml
   [junit4]   2> 1295327 INFO  (TEST-ShardSplitTest.testSplitStaticIndexReplication-seed#[1D378D3EBBFC0ED9]) [    ] o.a.s.c.AbstractZkTestCase put /home/jenkins/workspace/Lucene-Solr-master-Linux/solr/core/src/test-files/solr/collection1/conf/enumsConfig.xml to /configs/conf1/enumsConfig.xml
   [junit4]   2> 1295332 INFO  (TEST-ShardSplitTest.testSplitStaticIndexReplication-seed#[1D378D3EBBFC0ED9]) [    ] o.a.s.c.AbstractZkTestCase put /home/jenkins/workspace/Lucene-Solr-master-Linux/solr/core/src/test-files/solr/collection1/conf/open-exchange-rates.json to /configs/conf1/open-exchange-rates.json
   [junit4]   2> 1295333 INFO  (TEST-ShardSplitTest.testSplitStaticIndexReplication-seed#[1D378D3EBBFC0ED9]) [    ] o.a.s.c.AbstractZkTestCase put /home/jenkins/workspace/Lucene-Solr-master-Linux/solr/core/src/test-files/solr/collection1/conf/mapping-ISOLatin1Accent.txt to /configs/conf1/mapping-ISOLatin1Accent.txt
   [junit4]   2> 1295333 INFO  (TEST-ShardSplitTest.testSplitStaticIndexReplication-seed#[1D378D3EBBFC0ED9]) [    ] o.a.s.c.AbstractZkTestCase put /home/jenkins/workspace/Lucene-Solr-master-Linux/solr/core/src/test-files/solr/collection1/conf/old_synonyms.txt to /configs/conf1/old_synonyms.txt
   [junit4]   2> 1295334 INFO  (TEST-ShardSplitTest.testSplitStaticIndexReplication-seed#[1D378D3EBBFC0ED9]) [    ] o.a.s.c.AbstractZkTestCase put /home/jenkins/workspace/Lucene-Solr-master-Linux/solr/core/src/test-files/solr/collection1/conf/synonyms.txt to /configs/conf1/synonyms.txt
   [junit4]   2> 1295400 INFO  (TEST-ShardSplitTest.testSplitStaticIndexReplication-seed#[1D378D3EBBFC0ED9]) [    ] o.a.s.SolrTestCaseJ4 Writing core.properties file to /home/jenkins/workspace/Lucene-Solr-master-Linux/solr/build/solr-core/test/J2/temp/solr.cloud.ShardSplitTest_1D378D3EBBFC0ED9-001/control-001/cores/collection1
   [junit4]   2> 1295401 INFO  (TEST-ShardSplitTest.testSplitStaticIndexReplication-seed#[1D378D3EBBFC0ED9]) [    ] o.e.j.s.Server jetty-9.3.14.v20161028
   [junit4]   2> 1295402 INFO  (TEST-ShardSplitTest.testSplitStaticIndexReplication-seed#[1D378D3EBBFC0ED9]) [    ] o.e.j.s.h.ContextHandler Started o.e.j.s.ServletContextHandler@51974bdd{/_v,null,AVAILABLE}
   [junit4]   2> 1295403 INFO  (TEST-ShardSplitTest.testSplitStaticIndexReplication-seed#[1D378D3EBBFC0ED9]) [    ] o.e.j.s.AbstractConnector Started ServerConnector@5f8096ff{HTTP/1.1,[http/1.1]}{127.0.0.1:35602}
   [junit4]   2> 1295403 INFO  (TEST-ShardSplitTest.testSplitStaticIndexReplication-seed#[1D378D3EBBFC0ED9]) [    ] o.e.j.s.Server Started @1296959ms
   [junit4]   2> 1295403 INFO  (TEST-ShardSplitTest.testSplitStaticIndexReplication-seed#[1D378D3EBBFC0ED9]) [    ] o.a.s.c.s.e.JettySolrRunner Jetty properties: {solr.data.dir=/home/jenkins/workspace/Lucene-Solr-master-Linux/solr/build/solr-core/test/J2/temp/solr.cloud.ShardSplitTest_1D378D3EBBFC0ED9-001/tempDir-001/control/data, hostContext=/_v, hostPort=35602, coreRootDirectory=/home/jenkins/workspace/Lucene-Solr-master-Linux/solr/build/solr-core/test/J2/../../../../../../../../../home/jenkins/workspace/Lucene-Solr-master-Linux/solr/build/solr-core/test/J2/temp/solr.cloud.ShardSplitTest_1D378D3EBBFC0ED9-001/control-001/cores}
   [junit4]   2> 1295403 ERROR (TEST-ShardSplitTest.testSplitStaticIndexReplication-seed#[1D378D3EBBFC0ED9]) [    ] o.a.s.s.StartupLoggingUtils Missing Java Option solr.log.dir. Logging may be missing or incomplete.
   [junit4]   2> 1295403 INFO  (TEST-ShardSplitTest.testSplitStaticIndexReplication-seed#[1D378D3EBBFC0ED9]) [    ] o.a.s.s.SolrDispatchFilter  ___      _       Welcome to Apache Solr™ version 7.0.0
   [junit4]   2> 1295403 INFO  (TEST-ShardSplitTest.testSplitStaticIndexReplication-seed#[1D378D3EBBFC0ED9]) [    ] o.a.s.s.SolrDispatchFilter / __| ___| |_ _   Starting in cloud mode on port null
   [junit4]   2> 1295403 INFO  (TEST-ShardSplitTest.testSplitStaticIndexReplication-seed#[1D378D3EBBFC0ED9]) [    ] o.a.s.s.SolrDispatchFilter \__ \/ _ \ | '_|  Install dir: null
   [junit4]   2> 1295404 INFO  (TEST-ShardSplitTest.testSplitStaticIndexReplication-seed#[1D378D3EBBFC0ED9]) [    ] o.a.s.s.SolrDispatchFilter |___/\___/_|_|    Start time: 2017-04-30T11:15:03.279Z
   [junit4]   2> 1295407 INFO  (TEST-ShardSplitTest.testSplitStaticIndexReplication-seed#[1D378D3EBBFC0ED9]) [    ] o.a.s.s.SolrDispatchFilter Loading solr.xml from SolrHome (not found in ZooKeeper)
   [junit4]   2> 1295407 INFO  (TEST-ShardSplitTest.testSplitStaticIndexReplication-seed#[1D378D3EBBFC0ED9]) [    ] o.a.s.c.SolrXmlConfig Loading container configuration from /home/jenkins/workspace/Lucene-Solr-master-Linux/solr/build/solr-core/test/J2/temp/solr.cloud.ShardSplitTest_1D378D3EBBFC0ED9-001/control-001/solr.xml
   [junit4]   2> 1295411 INFO  (TEST-ShardSplitTest.testSplitStaticIndexReplication-seed#[1D378D3EBBFC0ED9]) [    ] o.a.s.c.SolrXmlConfig MBean server found: com.sun.jmx.mbeanserver.JmxMBeanServer@5e6dc94c, but no JMX reporters were configured - adding default JMX reporter.
   [junit4]   2> 1295413 INFO  (TEST-ShardSplitTest.testSplitStaticIndexReplication-seed#[1D378D3EBBFC0ED9]) [    ] o.a.s.c.ZkContainer Zookeeper client=127.0.0.1:44697/solr
   [junit4]   2> 1295424 INFO  (TEST-ShardSplitTest.testSplitStaticIndexReplication-seed#[1D378D3EBBFC0ED9]) [n:127.0.0.1:35602__v    ] o.a.s.c.Overseer Overseer (id=null) closing
   [junit4]   2> 1295425 INFO  (TEST-ShardSplitTest.testSplitStaticIndexReplication-seed#[1D378D3EBBFC0ED9]) [n:127.0.0.1:35602__v    ] o.a.s.c.OverseerElectionContext I am going to be the leader 127.0.0.1:35602__v
   [junit4]   2> 1295425 INFO  (TEST-ShardSplitTest.testSplitStaticIndexReplication-seed#[1D378D3EBBFC0ED9]) [n:127.0.0.1:35602__v    ] o.a.s.c.Overseer Overseer (id=97881351984971780-127.0.0.1:35602__v-n_0000000000) starting
   [junit4]   2> 1295428 INFO  (TEST-ShardSplitTest.testSplitStaticIndexReplication-seed#[1D378D3EBBFC0ED9]) [n:127.0.0.1:35602__v    ] o.a.s.c.ZkController Register node as live in ZooKeeper:/live_nodes/127.0.0.1:35602__v
   [junit4]   2> 1295429 INFO  (zkCallback-2118-thread-1-processing-n:127.0.0.1:35602__v) [n:127.0.0.1:35602__v    ] o.a.s.c.c.ZkStateReader Updated live nodes from ZooKeeper... (0) -> (1)
   [junit4]   2> 1295500 INFO  (TEST-ShardSplitTest.testSplitStaticIndexReplication-seed#[1D378D3EBBFC0ED9]) [n:127.0.0.1:35602__v    ] o.a.s.m.r.SolrJmxReporter JMX monitoring for 'solr.node' (registry 'solr.node') enabled at server: com.sun.jmx.mbeanserver.JmxMBeanServer@5e6dc94c
   [junit4]   2> 1295504 INFO  (TEST-ShardSplitTest.testSplitStaticIndexReplication-seed#[1D378D3EBBFC0ED9]) [n:127.0.0.1:35602__v    ] o.a.s.m.r.SolrJmxReporter JMX monitoring for 'solr.jvm' (registry 'solr.jvm') enabled at server: com.sun.jmx.mbeanserver.JmxMBeanServer@5e6dc94c
   [junit4]   2> 1295504 INFO  (TEST-ShardSplitTest.testSplitStaticIndexReplication-seed#[1D378D3EBBFC0ED9]) [n:127.0.0.1:35602__v    ] o.a.s.m.r.SolrJmxReporter JMX monitoring for 'solr.jetty' (registry 'solr.jetty') enabled at server: com.sun.jmx.mbeanserver.JmxMBeanServer@5e6dc94c
   [junit4]   2> 1295515 INFO  (TEST-ShardSplitTest.testSplitStaticIndexReplication-seed#[1D378D3EBBFC0ED9]) [n:127.0.0.1:35602__v    ] o.a.s.c.CorePropertiesLocator Found 1 core definitions underneath /home/jenkins/workspace/Lucene-Solr-master-Linux/solr/build/solr-core/test/J2/../../../../../../../../../home/jenkins/workspace/Lucene-Solr-master-Linux/solr/build/solr-core/test/J2/temp/solr.cloud.ShardSplitTest_1D378D3EBBFC0ED9-001/control-001/cores
   [junit4]   2> 1295515 INFO  (TEST-ShardSplitTest.testSplitStaticIndexReplication-seed#[1D378D3EBBFC0ED9]) [n:127.0.0.1:35602__v    ] o.a.s.c.CorePropertiesLocator Cores are: [collection1]
   [junit4]   2> 1295516 INFO  (coreLoadExecutor-4783-thread-1-processing-n:127.0.0.1:35602__v) [n:127.0.0.1:35602__v c:control_collection   x:collection1] o.a.s.c.TransientSolrCoreCacheDefault Allocating transient cache for 4 transient cores
   [junit4]   2> 1295516 INFO  (OverseerStateUpdate-97881351984971780-127.0.0.1:35602__v-n_0000000000) [n:127.0.0.1:35602__v    ] o.a.s.c.o.ReplicaMutator Assigning new node to shard shard=shard1
   [junit4]   2> 1296528 INFO  (coreLoadExecutor-4783-thread-1-processing-n:127.0.0.1:35602__v) [n:127.0.0.1:35602__v c:control_collection   x:collection1] o.a.s.c.SolrConfig Using Lucene MatchVersion: 7.0.0
   [junit4]   2> 1296539 INFO  (coreLoadExecutor-4783-thread-1-processing-n:127.0.0.1:35602__v) [n:127.0.0.1:35602__v c:control_collection   x:collection1] o.a.s.s.IndexSchema [collection1] Schema name=test
   [junit4]   2> 1296628 WARN  (coreLoadExecutor-4783-thread-1-processing-n:127.0.0.1:35602__v) [n:127.0.0.1:35602__v c:control_collection   x:collection1] o.a.s.s.IndexSchema [collection1] default search field in schema is text. WARNING: Deprecated, please use 'df' on request instead.
   [junit4]   2> 1296631 INFO  (coreLoadExecutor-4783-thread-1-processing-n:127.0.0.1:35602__v) [n:127.0.0.1:35602__v c:control_collection   x:collection1] o.a.s.s.IndexSchema Loaded schema test/1.6 with uniqueid field id
   [junit4]   2> 1296641 INFO  (coreLoadExecutor-4783-thread-1-processing-n:127.0.0.1:35602__v) [n:127.0.0.1:35602__v c:control_collection   x:collection1] o.a.s.c.CoreContainer Creating SolrCore 'collection1' using configuration from collection control_collection, trusted=true
   [junit4]   2> 1296642 INFO  (coreLoadExecutor-4783-thread-1-processing-n:127.0.0.1:35602__v) [n:127.0.0.1:35602__v c:control_collection   x:collection1] o.a.s.m.r.SolrJmxReporter JMX monitoring for 'solr.core.control_collection.shard1.core_node1' (registry 'solr.core.control_collection.shard1.core_node1') enabled at server: com.sun.jmx.mbeanserver.JmxMBeanServer@5e6dc94c
   [junit4]   2> 1296642 INFO  (coreLoadExecutor-4783-thread-1-processing-n:127.0.0.1:35602__v) [n:127.0.0.1:35602__v c:control_collection   x:collection1] o.a.s.c.SolrCore solr.RecoveryStrategy.Builder
   [junit4]   2> 1296642 INFO  (coreLoadExecutor-4783-thread-1-processing-n:127.0.0.1:35602__v) [n:127.0.0.1:35602__v c:control_collection   x:collection1] o.a.s.c.SolrCore [[collection1] ] Opening new SolrCore at [/home/jenkins/workspace/Lucene-Solr-master-Linux/solr/build/solr-core/test/J2/temp/solr.cloud.ShardSplitTest_1D378D3EBBFC0ED9-001/control-001/cores/collection1], dataDir=[/home/jenkins/workspace/Lucene-Solr-master-Linux/solr/build/solr-core/test/J2/../../../../../../../../../home/jenkins/workspace/Lucene-Solr-master-Linux/solr/build/solr-core/test/J2/temp/solr.cloud.ShardSplitTest_1D378D3EBBFC0ED9-001/control-001/cores/collection1/data/]
   [junit4]   2> 1296646 INFO  (coreLoadExecutor-4783-thread-1-processing-n:127.0.0.1:35602__v) [n:127.0.0.1:35602__v c:control_collection   x:collection1] o.a.s.u.RandomMergePolicy RandomMergePolicy wrapping class org.apache.lucene.index.TieredMergePolicy: [TieredMergePolicy: maxMergeAtOnce=49, maxMergeAtOnceExplicit=41, maxMergedSegmentMB=52.3662109375, floorSegmentMB=0.70703125, forceMergeDeletesPctAllowed=24.393682989683743, segmentsPerTier=14.0, maxCFSSegmentSizeMB=8.796093022207999E12, noCFSRatio=0.0
   [junit4]   2> 1296663 WARN  (coreLoadExecutor-4783-thread-1-processing-n:127.0.0.1:35602__v) [n:127.0.0.1:35602__v c:control_collection   x:collection1] o.a.s.c.RequestHandlers INVALID paramSet a in requestHandler {type = requestHandler,name = /dump,class = DumpRequestHandler,attributes = {initParams=a, name=/dump, class=DumpRequestHandler},args = {defaults={a=A,b=B}}}
   [junit4]   2> 1296693 INFO  (coreLoadExecutor-4783-thread-1-processing-n:127.0.0.1:35602__v) [n:127.0.0.1:35602__v c:control_collection   x:collection1] o.a.s.u.UpdateHandler Using UpdateLog implementation: org.apache.solr.update.UpdateLog
   [junit4]   2> 1296693 INFO  (coreLoadExecutor-4783-thread-1-processing-n:127.0.0.1:35602__v) [n:127.0.0.1:35602__v c:control_collection   x:collection1] o.a.s.u.UpdateLog Initializing UpdateLog: dataDir= defaultSyncLevel=FLUSH numRecordsToKeep=100 maxNumLogsToKeep=10 numVersionBuckets=65536
   [junit4]   2> 1296694 INFO  (coreLoadExecutor-4783-thread-1-processing-n:127.0.0.1:35602__v) [n:127.0.0.1:35602__v c:control_collection   x:collection1] o.a.s.u.CommitTracker Hard AutoCommit: disabled
   [junit4]   2> 1296694 INFO  (coreLoadExecutor-4783-thread-1-processing-n:127.0.0.1:35602__v) [n:127.0.0.1:35602__v c:control_collection   x:collection1] o.a.s.u.CommitTracker Soft AutoCommit: disabled
   [junit4]   2> 1296695 INFO  (coreLoadExecutor-4783-thread-1-processing-n:127.0.0.1:35602__v) [n:127.0.0.1:35602__v c:control_collection   x:collection1] o.a.s.u.RandomMergePolicy RandomMergePolicy wrapping class org.apache.lucene.index.TieredMergePolicy: [TieredMergePolicy: maxMergeAtOnce=29, maxMergeAtOnceExplicit=11, maxMergedSegmentMB=69.419921875, floorSegmentMB=1.697265625, forceMergeDeletesPctAllowed=14.88844485480842, segmentsPerTier=35.0, maxCFSSegmentSizeMB=8.796093022207999E12, noCFSRatio=0.0
   [junit4]   2> 1296696 INFO  (coreLoadExecutor-4783-thread-1-processing-n:127.0.0.1:35602__v) [n:127.0.0.1:35602__v c:control_collection   x:collection1] o.a.s.s.SolrIndexSearcher Opening [Searcher@3fd431c3[collection1] main]
   [junit4]   2> 1296696 INFO  (coreLoadExecutor-4783-thread-1-processing-n:127.0.0.1:35602__v) [n:127.0.0.1:35602__v c:control_collection   x:collection1] o.a.s.r.ManagedResourceStorage Configured ZooKeeperStorageIO with znodeBase: /configs/conf1
   [junit4]   2> 1296696 INFO  (coreLoadExecutor-4783-thread-1-processing-n:127.0.0.1:35602__v) [n:127.0.0.1:35602__v c:control_collection   x:collection1] o.a.s.r.ManagedResourceStorage Loaded null at path _rest_managed.json using ZooKeeperStorageIO:path=/configs/conf1
   [junit4]   2> 1296697 INFO  (coreLoadExecutor-4783-thread-1-processing-n:127.0.0.1:35602__v) [n:127.0.0.1:35602__v c:control_collection   x:collection1] o.a.s.h.ReplicationHandler Commits will be reserved for  10000
   [junit4]   2> 1296698 INFO  (searcherExecutor-4784-thread-1-processing-n:127.0.0.1:35602__v x:collection1 c:control_collection) [n:127.0.0.1:35602__v c:control_collection   x:collection1] o.a.s.c.SolrCore [collection1] Registered new searcher Searcher@3fd431c3[collection1] main{ExitableDirectoryReader(UninvertingDirectoryReader())}
   [junit4]   2> 1296698 INFO  (coreLoadExecutor-4783-thread-1-processing-n:127.0.0.1:35602__v) [n:127.0.0.1:35602__v c:control_collection   x:collection1] o.a.s.u.UpdateLog Could not find max version in index or recent updates, using new clock 1566101633313538048
   [junit4]   2> 1296703 INFO  (coreZkRegister-4776-thread-1-processing-n:127.0.0.1:35602__v x:collection1 c:control_collection) [n:127.0.0.1:35602__v c:control_collection s:shard1 r:core_node1 x:collection1] o.a.s.c.ShardLeaderElectionContext Enough replicas found to continue.
   [junit4]   2> 1296703 INFO  (coreZkRegister-4776-thread-1-processing-n:127.0.0.1:35602__v x:collection1 c:control_collection) [n:127.0.0.1:35602__v c:control_collection s:shard1 r:core_node1 x:collection1] o.a.s.c.ShardLeaderElectionContext I may be the new leader - try and sync
   [junit4]   2> 1296703 INFO  (coreZkRegister-4776-thread-1-processing-n:127.0.0.1:35602__v x:collection1 c:control_collection) [n:127.0.0.1:35602__v c:control_collection s:shard1 r:core_node1 x:collection1] o.a.s.c.SyncStrategy Sync replicas to http://127.0.0.1:35602/_v/collection1/
   [junit4]   2> 1296704 INFO  (coreZkRegister-4776-thread-1-processing-n:127.0.0.1:35602__v x:collection1 c:control_collection) [n:127.0.0.1:35602__v c:control_collection s:shard1 r:core_node1 x:collection1] o.a.s.c.SyncStrategy Sync Success - now sync replicas to me
   [junit4]   2> 1296704 INFO  (coreZkRegister-4776-thread-1-processing-n:127.0.0.1:35602__v x:collection1 c:control_collection) [n:127.0.0.1:35602__v c:control_collection s:shard1 r:core_node1 x:collection1] o.a.s.c.SyncStrategy http://127.0.0.1:35602/_v/collection1/ has no replicas
   [junit4]   2> 1296704 INFO  (coreZkRegister-4776-thread-1-processing-n:127.0.0.1:35602__v x:collection1 c:control_collection) [n:127.0.0.1:35602__v c:control_collection s:shard1 r:core_node1 x:collection1] o.a.s.c.ShardLeaderElectionContext Found all replicas participating in election, clear LIR
   [junit4]   2> 1296705 INFO  (coreZkRegister-4776-thread-1-processing-n:127.0.0.1:35602__v x:collection1 c:control_collection) [n:127.0.0.1:35602__v c:control_collection s:shard1 r:core_node1 x:collection1] o.a.s.c.ShardLeaderElectionContext I am the new leader: http://127.0.0.1:35602/_v/collection1/ shard1
   [junit4]   2> 1296856 INFO  (coreZkRegister-4776-thread-1-processing-n:127.0.0.1:35602__v x:collection1 c:control_collection) [n:127.0.0.1:35602__v c:control_collection s:shard1 r:core_node1 x:collection1] o.a.s.c.ZkController I am the leader, no recovery necessary
   [junit4]   2> 1297030 INFO  (TEST-ShardSplitTest.testSplitStaticIndexReplication-seed#[1D378D3EBBFC0ED9]) [    ] o.a.s.c.c.ZkStateReader Updated live nodes from ZooKeeper... (0) -> (1)
   [junit4]   2> 1297030 INFO  (TEST-ShardSplitTest.testSplitStaticIndexReplication-seed#[1D378D3EBBFC0ED9]) [    ] o.a.s.c.s.i.ZkClientClusterStateProvider Cluster at 127.0.0.1:44697/solr ready
   [junit4]   2> 1297030 INFO  (TEST-ShardSplitTest.testSplitStaticIndexReplication-seed#[1D378D3EBBFC0ED9]) [    ] o.a.s.c.ChaosMonkey monkey: init - expire sessions:false cause connection loss:false
   [junit4]   2> 1297030 INFO  (TEST-ShardSplitTest.testSplitStaticIndexReplication-seed#[1D378D3EBBFC0ED9]) [    ] o.a.s.c.AbstractFullDistribZkTestBase Creating collection1 with stateFormat=2
   [junit4]   2> 1297094 INFO  (TEST-ShardSplitTest.testSplitStaticIndexReplication-seed#[1D378D3EBBFC0ED9]) [    ] o.a.s.SolrTestCaseJ4 Writing core.properties file to /home/jenkins/workspace/Lucene-Solr-master-Linux/solr/build/solr-core/test/J2/temp/solr.cloud.ShardSplitTest_1D378D3EBBFC0ED9-001/shard-1-001/cores/collection1
   [junit4]   2> 1297095 INFO  (TEST-ShardSplitTest.testSplitStaticIndexReplication-seed#[1D378D3EBBFC0ED9]) [    ] o.a.s.c.AbstractFullDistribZkTestBase create jetty 1 in directory /home/jenkins/workspace/Lucene-Solr-master-Linux/solr/build/solr-core/test/J2/temp/solr.cloud.ShardSplitTest_1D378D3EBBFC0ED9-001/shard-1-001
   [junit4]   2> 1297095 INFO  (TEST-ShardSplitTest.testSplitStaticIndexReplication-seed#[1D378D3EBBFC0ED9]) [    ] o.e.j.s.Server jetty-9.3.14.v20161028
   [junit4]   2> 1297103 INFO  (TEST-ShardSplitTest.testSplitStaticIndexReplication-seed#[1D378D3EBBFC0ED9]) [    ] o.e.j.s.h.ContextHandler Started o.e.j.s.ServletContextHandler@908b60{/_v,null,AVAILABLE}
   [junit4]   2> 1297104 INFO  (TEST-ShardSplitTest.testSplitStaticIndexReplication-seed#[1D378D3EBBFC0ED9]) [    ] o.e.j.s.AbstractConnector Started ServerConnector@105f3e8f{HTTP/1.1,[http/1.1]}{127.0.0.1:43663}
   [junit4]   2> 1297104 INFO  (TEST-ShardSplitTest.testSplitStaticIndexReplication-seed#[1D378D3EBBFC0ED9]) [    ] o.e.j.s.Server Started @1298660ms
   [junit4]   2> 1297104 INFO  (TEST-ShardSplitTest.testSplitStaticIndexReplication-seed#[1D378D3EBBFC0ED9]) [    ] o.a.s.c.s.e.JettySolrRunner Jetty properties: {solr.data.dir=/home/jenkins/workspace/Lucene-Solr-master-Linux/solr/build/solr-core/test/J2/temp/solr.cloud.ShardSplitTest_1D378D3EBBFC0ED9-001/tempDir-001/jetty1, solrconfig=solrconfig.xml, hostContext=/_v, hostPort=43663, coreRootDirectory=/home/jenkins/workspace/Lucene-Solr-master-Linux/solr/build/solr-core/test/J2/../../../../../../../../../home/jenkins/workspace/Lucene-Solr-master-Linux/solr/build/solr-core/test/J2/temp/solr.cloud.ShardSplitTest_1D378D3EBBFC0ED9-001/shard-1-001/cores}
   [junit4]   2> 1297104 ERROR (TEST-ShardSplitTest.testSplitStaticIndexReplication-seed#[1D378D3EBBFC0ED9]) [    ] o.a.s.s.StartupLoggingUtils Missing Java Option solr.log.dir. Logging may be missing or incomplete.
   [junit4]   2> 1297105 INFO  (TEST-ShardSplitTest.testSplitStaticIndexReplication-seed#[1D378D3EBBFC0ED9]) [    ] o.a.s.s.SolrDispatchFilter  ___      _       Welcome to Apache Solr™ version 7.0.0
   [junit4]   2> 1297105 INFO  (TEST-ShardSplitTest.testSplitStaticIndexReplication-seed#[1D378D3EBBFC0ED9]) [    ] o.a.s.s.SolrDispatchFilter / __| ___| |_ _   Starting in cloud mode on port null
   [junit4]   2> 1297105 INFO  (TEST-ShardSplitTest.testSplitStaticIndexReplication-seed#[1D378D3EBBFC0ED9]) [    ] o.a.s.s.SolrDispatchFilter \__ \/ _ \ | '_|  Install dir: null
   [junit4]   2> 1297105 INFO  (TEST-ShardSplitTest.testSplitStaticIndexReplication-seed#[1D378D3EBBFC0ED9]) [    ] o.a.s.s.SolrDispatchFilter |___/\___/_|_|    Start time: 2017-04-30T11:15:04.980Z
   [junit4]   2> 1297106 INFO  (TEST-ShardSplitTest.testSplitStaticIndexReplication-seed#[1D378D3EBBFC0ED9]) [    ] o.a.s.s.SolrDispatchFilter Loading solr.xml from SolrHome (not found in ZooKeeper)
   [junit4]   2> 1297106 INFO  (TEST-ShardSplitTest.testSplitStaticIndexReplication-seed#[1D378D3EBBFC0ED9]) [    ] o.a.s.c.SolrXmlConfig Loading container configuration from /home/jenkins/workspace/Lucene-Solr-master-Linux/solr/build/solr-core/test/J2/temp/solr.cloud.ShardSplitTest_1D378D3EBBFC0ED9-001/shard-1-001/solr.xml
   [junit4]   2> 1297111 INFO  (TEST-ShardSplitTest.testSplitStaticIndexReplication-seed#[1D378D3EBBFC0ED9]) [    ] o.a.s.c.SolrXmlConfig MBean server found: com.sun.jmx.mbeanserver.JmxMBeanServer@5e6dc94c, but no JMX reporters were configured - adding default JMX reporter.
   [junit4]   2> 1297115 INFO  (TEST-ShardSplitTest.testSplitStaticIndexReplication-seed#[1D378D3EBBFC0ED9]) [    ] o.a.s.c.ZkContainer Zookeeper client=127.0.0.1:44697/solr
   [junit4]   2> 1297119 INFO  (TEST-ShardSplitTest.testSplitStaticIndexReplication-seed#[1D378D3EBBFC0ED9]) [n:127.0.0.1:43663__v    ] o.a.s.c.c.ZkStateReader Updated live nodes from ZooKeeper... (0) -> (1)
   [junit4]   2> 1297120 INFO  (TEST-ShardSplitTest.testSplitStaticIndexReplication-seed#[1D378D3EBBFC0ED9]) [n:127.0.0.1:43663__v    ] o.a.s.c.Overseer Overseer (id=null) closing
   [junit4]   2> 1297120 INFO  (TEST-ShardSplitTest.testSplitStaticIndexReplication-seed#[1D378D3EBBFC0ED9]) [n:127.0.0.1:43663__v    ] o.a.s.c.ZkController Register node as live in ZooKeeper:/live_nodes/127.0.0.1:43663__v
   [junit4]   2> 1297121 INFO  (zkCallback-2122-thread-1) [    ] o.a.s.c.c.ZkStateReader Updated live nodes from ZooKeeper... (1) -> (2)
   [junit4]   2> 1297121 INFO  (zkCallback-2118-thread-1-processing-n:127.0.0.1:35602__v) [n:127.0.0.1:35602__v    ] o.a.s.c.c.ZkStateReader Updated live nodes from ZooKeeper... (1) -> (2)
   [junit4]   2> 1297121 INFO  (zkCallback-2128-thread-1-processing-n:127.0.0.1:43663__v) [n:127.0.0.1:43663__v    ] o.a.s.c.c.ZkStateReader Updated live nodes from ZooKeeper... (1) -> (2)
   [junit4]   2> 1297184 INFO  (TEST-ShardSplitTest.testSplitStaticIndexReplication-seed#[1D378D3EBBFC0ED9]) [n:127.0.0.1:43663__v    ] o.a.s.m.r.SolrJmxReporter JMX monitoring for 'solr.node' (registry 'solr.node') enabled at server: com.sun.jmx.mbeanserver.JmxMBeanServer@5e6dc94c
   [junit4]   2> 1297188 INFO  (TEST-ShardSplitTest.testSplitStaticIndexReplication-seed#[1D378D3EBBFC0ED9]) [n:127.0.0.1:43663__v    ] o.a.s.m.r.SolrJmxReporter JMX monitoring for 'solr.jvm' (registry 'solr.jvm') enabled at server: com.sun.jmx.mbeanserver.JmxMBeanServer@5e6dc94c
   [junit4]   2> 1297188 INFO  (TEST-ShardSplitTest.testSplitStaticIndexReplication-seed#[1D378D3EBBFC0ED9]) [n:127.0.0.1:43663__v    ] o.a.s.m.r.SolrJmxReporter JMX monitoring for 'solr.jetty' (registry 'solr.jetty') enabled at server: com.sun.jmx.mbeanserver.JmxMBeanServer@5e6dc94c
   [junit4]   2> 1297189 INFO  (TEST-ShardSplitTest.testSplitStaticIndexReplication-seed#[1D378D3EBBFC0ED9]) [n:127.0.0.1:43663__v    ] o.a.s.c.CorePropertiesLocator Found 1 core definitions underneath /home/jenkins/workspace/Lucene-Solr-master-Linux/solr/build/solr-core/test/J2/../../../../../../../../../home/jenkins/workspace/Lucene-Solr-master-Linux/solr/build/solr-core/test/J2/temp/solr.cloud.ShardSplitTest_1D378D3EBBFC0ED9-001/shard-1-001/cores
   [junit4]   2> 1297189 INFO  (TEST-ShardSplitTest.testSplitStaticIndexReplication-seed#[1D378D3EBBFC0ED9]) [n:127.0.0.1:43663__v    ] o.a.s.c.CorePropertiesLocator Cores are: [collection1]
   [junit4]   2> 1297190 INFO  (coreLoadExecutor-4794-thread-1-processing-n:127.0.0.1:43663__v) [n:127.0.0.1:43663__v c:collection1   x:collection1] o.a.s.c.TransientSolrCoreCacheDefault Allocating transient cache for 4 transient cores
   [junit4]   2> 1297191 INFO  (OverseerStateUpdate-97881351984971780-127.0.0.1:35602__v-n_0000000000) [n:127.0.0.1:35602__v    ] o.a.s.c.o.ReplicaMutator Assigning new node to shard shard=shard2
   [junit4]   2> 1297292 INFO  (zkCallback-2128-thread-1-processing-n:127.0.0.1:43663__v) [n:127.0.0.1:43663__v    ] o.a.s.c.c.ZkStateReader A cluster state change: [WatchedEvent state:SyncConnected type:NodeCreated path:/collections/collection1/state.json] for collection [collection1] has occurred - updating... (live nodes size: [2])
   [junit4]   2> 1298200 INFO  (coreLoadExecutor-4794-thread-1-processing-n:127.0.0.1:43663__v) [n:127.0.0.1:43663__v c:collection1   x:collection1] o.a.s.c.SolrConfig Using Lucene MatchVersion: 7.0.0
   [junit4]   2> 1298211 INFO  (coreLoadExecutor-4794-thread-1-processing-n:127.0.0.1:43663__v) [n:127.0.0.1:43663__v c:collection1   x:collection1] o.a.s.s.IndexSchema [collection1] Schema name=test
   [junit4]   2> 1298282 WARN  (coreLoadExecutor-4794-thread-1-processing-n:127.0.0.1:43663__v) [n:127.0.0.1:43663__v c:collection1   x:collection1] o.a.s.s.IndexSchema [collection1] default search field in schema is text. WARNING: Deprecated, please use 'df' on request instead.
   [junit4]   2> 1298283 INFO  (coreLoadExecutor-4794-thread-1-processing-n:127.0.0.1:43663__v) [n:127.0.0.1:43663__v c:collection1   x:collection1] o.a.s.s.IndexSchema Loaded schema test/1.6 with uniqueid field id
   [junit4]   2> 1298291 INFO  (coreLoadExecutor-4794-thread-1-processing-n:127.0.0.1:43663__v) [n:127.0.0.1:43663__v c:collection1   x:collection1] o.a.s.c.CoreContainer Creating SolrCore 'collection1' using configuration from collection collection1, trusted=true
   [junit4]   2> 1298292 INFO  (coreLoadExecutor-4794-thread-1-processing-n:127.0.0.1:43663__v) [n:127.0.0.1:43663__v c:collection1   x:collection1] o.a.s.m.r.SolrJmxReporter JMX monitoring for 'solr.core.collection1.shard2.core_node1' (registry 'solr.core.collection1.shard2.core_node1') enabled at server: com.sun.jmx.mbeanserver.JmxMBeanServer@5e6dc94c
   [junit4]   2> 1298292 INFO  (coreLoadExecutor-4794-thread-1-processing-n:127.0.0.1:43663__v) [n:127.0.0.1:43663__v c:collection1   x:collection1] o.a.s.c.SolrCore solr.RecoveryStrategy.Builder
   [junit4]   2> 1298292 INFO  (coreLoadExecutor-4794-thread-1-processing-n:127.0.0.1:43663__v) [n:127.0.0.1:43663__v c:collection1   x:collection1] o.a.s.c.SolrCore [[collection1] ] Opening new SolrCore at [/home/jenkins/workspace/Lucene-Solr-master-Linux/solr/build/solr-core/test/J2/temp/solr.cloud.ShardSplitTest_1D378D3EBBFC0ED9-001/shard-1-001/cores/collection1], dataDir=[/home/jenkins/workspace/Lucene-Solr-master-Linux/solr/build/solr-core/test/J2/../../../../../../../../../home/jenkins/workspace/Lucene-Solr-master-Linux/solr/build/solr-core/test/J2/temp/solr.cloud.ShardSplitTest_1D378D3EBBFC0ED9-001/shard-1-001/cores/collection1/data/]
   [junit4]   2> 1298294 INFO  (coreLoadExecutor-4794-thread-1-processing-n:127.0.0.1:43663__v) [n:127.0.0.1:43663__v c:collection1   x:collection1] o.a.s.u.RandomMergePolicy RandomMergePolicy wrapping class org.apache.lucene.index.TieredMergePolicy: [TieredMergePolicy: maxMergeAtOnce=49, maxMergeAtOnceExplicit=41, maxMergedSegmentMB=52.3662109375, floorSegmentMB=0.70703125, forceMergeDeletesPctAllowed=24.393682989683743, segmentsPerTier=14.0, maxCFSSegmentSizeMB=8.796093022207999E12, noCFSRatio=0.0
   [junit4]   2> 1298340 WARN  (coreLoadExecutor-4794-thread-1-processing-n:127.0.0.1:43663__v) [n:127.0.0.1:43663__v c:collection1   x:collection1] o.a.s.c.RequestHandlers INVALID paramSet a in requestHandler {type = requestHandler,name = /dump,class = DumpRequestHandler,attributes = {initParams=a, name=/dump, class=DumpRequestHandler},args = {defaults={a=A,b=B}}}
   [junit4]   2> 1298369 INFO  (coreLoadExecutor-4794-thread-1-processing-n:127.0.0.1:43663__v) [n:127.0.0.1:43663__v c:collection1   x:collection1] o.a.s.u.UpdateHandler Using UpdateLog implementation: org.apache.solr.update.UpdateLog
   [junit4]   2> 1298369 INFO  (coreLoadExecutor-4794-thread-1-processing-n:127.0.0.1:43663__v) [n:127.0.0.1:43663__v c:collection1   x:collection1] o.a.s.u.UpdateLog Initializing UpdateLog: dataDir= defaultSyncLevel=FLUSH numRecordsToKeep=100 maxNumLogsToKeep=10 numVersionBuckets=65536
   [junit4]   2> 1298370 INFO  (coreLoadExecutor-4794-thread-1-processing-n:127.0.0.1:43663__v) [n:127.0.0.1:43663__v c:collection1   x:collection1] o.a.s.u.CommitTracker Hard AutoCommit: disabled
   [junit4]   2> 1298370 INFO  (coreLoadExecutor-4794-thread-1-processing-n:127.0.0.1:43663__v) [n:127.0.0.1:43663__v c:collection1   x:collection1] o.a.s.u.CommitTracker Soft AutoCommit: disabled
   [junit4]   2> 1298371 INFO  (coreLoadExecutor-4794-thread-1-processing-n:127.0.0.1:43663__v) [n:127.0.0.1:43663__v c:collection1   x:collection1] o.a.s.u.RandomMergePolicy RandomMergePolicy wrapping class org.apache.lucene.index.TieredMergePolicy: [TieredMergePolicy: maxMergeAtOnce=29, maxMergeAtOnceExplicit=11, maxMergedSegmentMB=69.419921875, floorSegmentMB=1.697265625, forceMergeDeletesPctAllowed=14.88844485480842, segmentsPerTier=35.0, maxCFSSegmentSizeMB=8.796093022207999E12, noCFSRatio=0.0
   [junit4]   2> 1298372 INFO  (coreLoadExecutor-4794-thread-1-processing-n:127.0.0.1:43663__v) [n:127.0.0.1:43663__v c:collection1   x:collection1] o.a.s.s.SolrIndexSearcher Opening [Searcher@1f3a9f[collection1] main]
   [junit4]   2> 1298372 INFO  (coreLoadExecutor-4794-thread-1-processing-n:127.0.0.1:43663__v) [n:127.0.0.1:43663__v c:collection1   x:collection1] o.a.s.r.ManagedResourceStorage Configured ZooKeeperStorageIO with znodeBase: /configs/conf1
   [junit4]   2> 1298372 INFO  (coreLoadExecutor-4794-thread-1-processing-n:127.0.0.1:43663__v) [n:127.0.0.1:43663__v c:collection1   x:collection1] o.a.s.r.ManagedResourceStorage Loaded null at path _rest_managed.json using ZooKeeperStorageIO:path=/configs/conf1
   [junit4]   2> 1298373 INFO  (coreLoadExecutor-4794-thread-1-processing-n:127.0.0.1:43663__v) [n:127.0.0.1:43663__v c:collection1   x:collection1] o.a.s.h.ReplicationHandler Commits will be reserved for  10000
   [junit4]   2> 1298374 INFO  (searcherExecutor-4795-thread-1-processing-n:127.0.0.1:43663__v x:collection1 c:collection1) [n:127.0.0.1:43663__v c:collection1   x:collection1] o.a.s.c.SolrCore [collection1] Registered new searcher Searcher@1f3a9f[collection1] main{ExitableDirectoryReader(UninvertingDirectoryReader())}
   [junit4]   2> 1298374 INFO  (coreLoadExecutor-4794-thread-1-processing-n:127.0.0.1:43663__v) [n:127.0.0.1:43663__v c:collection1   x:collection1] o.a.s.u.UpdateLog Could not find max version in index or recent updates, using new clock 1566101635070951424
   [junit4]   2> 1298377 INFO  (coreZkRegister-4789-thread-1-processing-n:127.0.0.1:43663__v x:collection1 c:collection1) [n:127.0.0.1:43663__v c:collection1 s:shard2 r:core_node1 x:collection1] o.a.s.c.ShardLeaderElectionContext Enough replicas found to continue.
   [junit4]   2> 1298377 INFO  (coreZkRegister-4789-thread-1-processing-n:127.0.0.1:43663__v x:collection1 c:collection1) [n:127.0.0.1:43663__v c:collection1 s:shard2 r:core_node1 x:collection1] o.a.s.c.ShardLeaderElectionContext I may be the new leader - try and sync
   [junit4]   2> 1298377 INFO  (coreZkRegister-4789-thread-1-processing-n:127.0.0.1:43663__v x:collection1 c:collection1) [n:127.0.0.1:43663__v c:collection1 s:shard2 r:core_node1 x:collection1] o.a.s.c.SyncStrategy Sync replicas to http://127.0.0.1:43663/_v/collection1/
   [junit4]   2> 1298377 INFO  (coreZkRegister-4789-thread-1-processing-n:127.0.0.1:43663__v x:collection1 c:collection1) [n:127.0.0.1:43663__v c:collection1 s:shard2 r:core_node1 x:collection1] o.a.s.c.SyncStrategy Sync Success - now sync replicas to me
   [junit4]   2> 1298377 INFO  (coreZkRegister-4789-thread-1-processing-n:127.0.0.1:43663__v x:collection1 c:collection1) [n:127.0.0.1:43663__v c:collection1 s:shard2 r:core_node1 x:collection1] o.a.s.c.SyncStrategy http://127.0.0.1:43663/_v/collection1/ has no replicas
   [junit4]   2> 1298377 INFO  (coreZkRegister-4789-thread-1-processing-n:127.0.0.1:43663__v x:collection1 c:collection1) [n:127.0.0.1:43663__v c:collection1 s:shard2 r:core_node1 x:collection1] o.a.s.c.ShardLeaderElectionContext Found all replicas participating in election, clear LIR
   [junit4]   2> 1298379 INFO  (coreZkRegister-4789-thread-1-processing-n:127.0.0.1:43663__v x:collection1 c:collection1) [n:127.0.0.1:43663__v c:collection1 s:shard2 r:core_node1 x:collection1] o.a.s.c.ShardLeaderElectionContext I am the new leader: http://127.0.0.1:43663/_v/collection1/ shard2
   [junit4]   2> 1298480 INFO  (zkCallback-2128-thread-1-processing-n:127.0.0.1:43663__v) [n:127.0.0.1:43663__v    ] o.a.s.c.c.ZkStateReader A cluster state change: [WatchedEvent state:SyncConnected type:NodeDataChanged path:/collections/collection1/state.json] for collection [collection1] has occurred - updating... (live nodes size: [2])
   [junit4]   2> 1298529 INFO  (coreZkRegister-4789-thread-1-processing-n:127.0.0.1:43663__v x:collection1 c:collection1) [n:127.0.0.1:43663__v c:collection1 s:shard2 r:core_node1 x:collection1] o.a.s.c.ZkController I am the leader, no recovery necessary
   [junit4]   2> 1298632 INFO  (zkCallback-2128-thread-1-processing-n:127.0.0.1:43663__v) [n:127.0.0.1:43663__v    ] o.a.s.c.c.ZkStateReader A cluster state change: [WatchedEvent state:SyncConnected type:NodeDataChanged path:/collections/collection1/state.json] for collection [collection1] has occurred - updating... (live nodes size: [2])
   [junit4]   2> 1298818 INFO  (TEST-ShardSplitTest.testSplitStaticIndexReplication-seed#[1D378D3EBBFC0ED9]) [    ] o.a.s.SolrTestCaseJ4 Writing core.properties file to /home/jenkins/workspace/Lucene-Solr-master-Linux/solr/build/solr-core/test/J2/temp/solr.cloud.ShardSplitTest_1D378D3EBBFC0ED9-001/shard-2-001/cores/collection1
   [junit4]   2> 1298818 INFO  (TEST-ShardSplitTest.testSplitStaticIndexReplication-seed#[1D378D3EBBFC0ED9]) [    ] o.a.s.c.AbstractFullDistribZkTestBase create jetty 2 in directory /home/jenkins/workspace/Lucene-Solr-master-Linux/solr/build/solr-core/test/J2/temp/solr.cloud.ShardSplitTest_1D378D3EBBFC0ED9-001/shard-2-001
   [junit4]   2> 1298819 INFO  (TEST-ShardSplitTest.testSplitStaticIndexReplication-seed#[1D378D3EBBFC0ED9]) [    ] o.e.j.s.Server jetty-9.3.14.v20161028
   [junit4]   2> 1298820 INFO  (TEST-ShardSplitTest.testSplitStaticIndexReplication-seed#[1D378D3EBBFC0ED9]) [    ] o.e.j.s.h.ContextHandler Started o.e.j.s.ServletContextHandler@54487275{/_v,null,AVAILABLE}
   [junit4]   2> 1298820 INFO  (TEST-ShardSplitTest.testSplitStaticIndexReplication-seed#[1D378D3EBBFC0ED9]) [    ] o.e.j.s.AbstractConnector Started ServerConnector@76fc447c{HTTP/1.1,[http/1.1]}{127.0.0.1:44519}
   [junit4]   2> 1298820 INFO  (TEST-ShardSplitTest.testSplitStaticIndexReplication-seed#[1D378D3EBBFC0ED9]) [    ] o.e.j.s.Server Started @1300376ms
   [junit4]   2> 1298821 INFO  (TEST-ShardSplitTest.testSplitStaticIndexReplication-seed#[1D378D3EBBFC0ED9]) [    ] o.a.s.c.s.e.JettySolrRunner Jetty properties: {solr.data.dir=/home/jenkins/workspace/Lucene-Solr-master-Linux/solr/build/solr-core/test/J2/temp/solr.cloud.ShardSplitTest_1D378D3EBBFC0ED9-001/tempDir-001/jetty2, solrconfig=solrconfig.xml, hostContext=/_v, hostPort=44519, coreRootDirectory=/home/jenkins/workspace/Lucene-Solr-master-Linux/solr/build/solr-core/test/J2/../../../../../../../../../home/jenkins/workspace/Lucene-Solr-master-Linux/solr/build/solr-core/test/J2/temp/solr.cloud.ShardSplitTest_1D378D3EBBFC0ED9-001/shard-2-001/cores}
   [junit4]   2> 1298821 ERROR (TEST-ShardSplitTest.testSplitStaticIndexReplication-seed#[1D378D3EBBFC0ED9]) [    ] o.a.s.s.StartupLoggingUtils Missing Java Option solr.log.dir. Logging may be missing or incomplete.
   [junit4]   2> 1298821 INFO  (TEST-ShardSplitTest.testSplitStaticIndexReplication-seed#[1D378D3EBBFC0ED9]) [    ] o.a.s.s.SolrDispatchFilter  ___      _       Welcome to Apache Solr™ version 7.0.0
   [junit4]   2> 1298821 INFO  (TEST-ShardSplitTest.testSplitStaticIndexReplication-seed#[1D378D3EBBFC0ED9]) [    ] o.a.s.s.SolrDispatchFilter / __| ___| |_ _   Starting in cloud mode on port null
   [junit4]   2> 1298821 INFO  (TEST-ShardSplitTest.testSplitStaticIndexReplication-seed#[1D378D3EBBFC0ED9]) [    ] o.a.s.s.SolrDispatchFilter \__ \/ _ \ | '_|  Install dir: null
   [junit4]   2> 1298821 INFO  (TEST-ShardSplitTest.testSplitStaticIndexReplication-seed#[1D378D3EBBFC0ED9]) [    ] o.a.s.s.SolrDispatchFilter |___/\___/_|_|    Start time: 2017-04-30T11:15:06.696Z
   [junit4]   2> 1298823 INFO  (TEST-ShardSplitTest.testSplitStaticIndexReplication-seed#[1D378D3EBBFC0ED9]) [    ] o.a.s.s.SolrDispatchFilter Loading solr.xml from SolrHome (not found in ZooKeeper)
   [junit4]   2> 1298823 INFO  (TEST-ShardSplitTest.testSplitStaticIndexReplication-seed#[1D378D3EBBFC0ED9]) [    ] o.a.s.c.SolrXmlConfig Loading container configuration from /home/jenkins/workspace/Lucene-Solr-master-Linux/solr/build/solr-core/test/J2/temp/solr.cloud.ShardSplitTest_1D378D3EBBFC0ED9-001/shard-2-001/solr.xml
   [junit4]   2> 1298828 INFO  (TEST-ShardSplitTest.testSplitStaticIndexReplication-seed#[1D378D3EBBFC0ED9]) [    ] o.a.s.c.SolrXmlConfig MBean server found: com.sun.jmx.mbeanserver.JmxMBeanServer@5e6dc94c, but no JMX reporters were configured - adding default JMX reporter.
   [junit4]   2> 1298831 INFO  (TEST-ShardSplitTest.testSplitStaticIndexReplication-seed#[1D378D3EBBFC0ED9]) [    ] o.a.s.c.ZkContainer Zookeeper client=127.0.0.1:44697/solr
   [junit4]   2> 1298835 INFO  (TEST-ShardSplitTest.testSplitStaticIndexReplication-seed#[1D378D3EBBFC0ED9]) [n:127.0.0.1:44519__v    ] o.a.s.c.c.ZkStateReader Updated live nodes from ZooKeeper... (0) -> (2)
   [junit4]   2> 1298836 INFO  (TEST-ShardSplitTest.testSplitStaticIndexReplication-seed#[1D378D3EBBFC0ED9]) [n:127.0.0.1:44519__v    ] o.a.s.c.Overseer Overseer (id=null) closing
   [junit4]   2> 1298836 INFO  (TEST-ShardSplitTest.testSplitStaticIndexReplication-seed#[1D378D3EBBFC0ED9]) [n:127.0.0.1:44519__v    ] o.a.s.c.ZkController Register node as live in ZooKeeper:/live_nodes/127.0.0.1:44519__v
   [junit4]   2> 1298837 INFO  (zkCallback-2122-thread-1) [    ] o.a.s.c.c.ZkStateReader Updated live nodes from ZooKeeper... (2) -> (3)
   [junit4]   2> 1298837 INFO  (zkCallback-2118-thread-1-processing-n:127.0.0.1:35602__v) [n:127.0.0.1:35602__v    ] o.a.s.c.c.ZkStateReader Updated live nodes from ZooKeeper... (2) -> (3)
   [junit4]   2> 1298837 INFO  (zkCallback-2128-thread-1-processing-n:127.0.0.1:43663__v) [n:127.0.0.1:43663__v    ] o.a.s.c.c.ZkStateReader Updated live nodes from ZooKeeper... (2) -> (3)
   [junit4]   2> 1298838 INFO  (zkCallback-2134-thread-1-processing-n:127.0.0.1:44519__v) [n:127.0.0.1:44519__v    ] o.a.s.c.c.ZkStateReader Updated live nodes from ZooKeeper... (2) -> (3)
   [junit4]   2> 1298889 INFO  (TEST-ShardSplitTest.testSplitStaticIndexReplication-seed#[1D378D3EBBFC0ED9]) [n:127.0.0.1:44519__v    ] o.a.s.m.r.SolrJmxReporter JMX monitoring for 'solr.node' (registry 'solr.node') enabled at server: com.sun.jmx.mbeanserver.JmxMBeanServer@5e6dc94c
   [junit4]   2> 1298893 INFO  (TEST-ShardSplitTest.testSplitStaticIndexReplication-seed#[1D378D3EBBFC0ED9]) [n:127.0.0.1:44519__v    ] o.a.s.m.r.SolrJmxReporter JMX monitoring for 'solr.jvm' (registry 'solr.jvm') enabled at server: com.sun.jmx.mbeanserver.JmxMBeanServer@5e6dc94c
   [junit4]   2> 1298893 INFO  (TEST-ShardSplitTest.testSplitStaticIndexReplication-seed#[1D378D3EBBFC0ED9]) [n:127.0.0.1:44519__v    ] o.a.s.m.r.SolrJmxReporter JMX monitoring for 'solr.jetty' (registry 'solr.jetty') enabled at server: com.sun.jmx.mbeanserver.JmxMBeanServer@5e6dc94c
   [junit4]   2> 1298894 INFO  (TEST-ShardSplitTest.testSplitStaticIndexReplication-seed#[1D378D3EBBFC0ED9]) [n:127.0.0.1:44519__v    ] o.a.s.c.CorePropertiesLocator Found 1 core definitions underneath /home/jenkins/workspace/Lucene-Solr-master-Linux/solr/build/solr-core/test/J2/../../../../../../../../../home/jenkins/workspace/Lucene-Solr-master-Linux/solr/build/solr-core/test/J2/temp/solr.cloud.ShardSplitTest_1D378D3EBBFC0ED9-001/shard-2-001/cores
   [junit4]   2> 1298894 INFO  (TEST-ShardSplitTest.testSplitStaticIndexReplication-seed#[1D378D3EBBFC0ED9]) [n:127.0.0.1:44519__v    ] o.a.s.c.CorePropertiesLocator Cores are: [collection1]
   [junit4]   2> 1298895 INFO  (coreLoadExecutor-4805-thread-1-processing-n:127.0.0.1:44519__v) [n:127.0.0.1:44519__v c:collection1   x:collection1] o.a.s.c.TransientSolrCoreCacheDefault Allocating transient cache for 4 transient cores
   [junit4]   2> 1298896 INFO  (OverseerStateUpdate-97881351984971780-127.0.0.1:35602__v-n_0000000000) [n:127.0.0.1:35602__v    ] o.a.s.c.o.ReplicaMutator Assigning new node to shard shard=shard1
   [junit4]   2> 1298997 INFO  (zkCallback-2134-thread-1-processing-n:127.0.0.1:44519__v) [n:127.0.0.1:44519__v    ] o.a.s.c.c.ZkStateReader A cluster state change: [WatchedEvent state:SyncConnected type:NodeDataChanged path:/collections/collection1/state.json] for collection [collection1] has occurred - updating... (live nodes size: [3])
   [junit4]   2> 1298997 INFO  (zkCallback-2128-thread-1-processing-n:127.0.0.1:43663__v) [n:127.0.0.1:43663__v    ] o.a.s.c.c.ZkStateReader A cluster state change: [WatchedEvent state:SyncConnected type:NodeDataChanged path:/collections/collection1/state.json] for collection [collection1] has occurred - updating... (live nodes size: [3])
   [junit4]   2> 1299905 INFO  (coreLoadExecutor-4805-thread-1-processing-n:127.0.0.1:44519__v) [n:127.0.0.1:44519__v c:collection1   x:collection1] o.a.s.c.SolrConfig Using Lucene MatchVersion: 7.0.0
   [junit4]   2> 1299915 INFO  (coreLoadExecutor-4805-thread-1-processing-n:127.0.0.1:44519__v) [n:127.0.0.1:44519__v c:collection1   x:collection1] o.a.s.s.IndexSchema [collection1] Schema name=test
   [junit4]   2> 1299997 WARN  (coreLoadExecutor-4805-thread-1-processing-n:127.0.0.1:44519__v) [n:127.0.0.1:44519__v c:collection1   x:collection1] o.a.s.s.IndexSchema [collection1] default search field in schema is text. WARNING: Deprecated, please use 'df' on request instead.
   [junit4]   2> 1299999 INFO  (coreLoadExecutor-4805-thread-1-processing-n:127.0.0.1:44519__v) [n:127.0.0.1:44519__v c:collection1   x:collection1] o.a.s.s.IndexSchema Loaded schema test/1.6 with uniqueid field id
   [junit4]   2> 1300007 INFO  (coreLoadExecutor-4805-thread-1-processing-n:127.0.0.1:44519__v) [n:127.0.0.1:44519__v c:collection1   x:collection1] o.a.s.c.CoreContainer Creating SolrCore 'collection1' using configuration from collection collection1, trusted=true
   [junit4]   2> 1300007 INFO  (coreLoadExecutor-4805-thread-1-processing-n:127.0.0.1:44519__v) [n:127.0.0.1:44519__v c:collection1   x:collection1] o.a.s.m.r.SolrJmxReporter JMX monitoring for 'solr.core.collection1.shard1.core_node2' (registry 'solr.core.collection1.shard1.core_node2') enabled at server: com.sun.jmx.mbeanserver.JmxMBeanServer@5e6dc94c
   [junit4]   2> 1300007 INFO  (coreLoadExecutor-4805-thread-1-processing-n:127.0.0.1:44519__v) [n:127.0.0.1:44519__v c:collection1   x:collection1] o.a.s.c.SolrCore solr.RecoveryStrategy.Builder
   [junit4]   2> 1300007 INFO  (coreLoadExecutor-4805-thread-1-processing-n:127.0.0.1:44519__v) [n:127.0.0.1:44519__v c:collection1   x:collection1] o.a.s.c.SolrCore [[collection1] ] Opening new SolrCore at [/home/jenkins/workspace/Lucene-Solr-master-Linux/solr/build/solr-core/test/J2/temp/solr.cloud.ShardSplitTest_1D378D3EBBFC0ED9-001/shard-2-001/cores/collection1], dataDir=[/home/jenkins/workspace/Lucene-Solr-master-Linux/solr/build/solr-core/test/J2/../../../../../../../../../home/jenkins/workspace/Lucene-Solr-master-Linux/solr/build/solr-core/test/J2/temp/solr.cloud.ShardSplitTest_1D378D3EBBFC0ED9-001/shard-2-001/cores/collection1/data/]
   [junit4]   2> 1300009 INFO  (coreLoadExecutor-4805-thread-1-processing-n:127.0.0.1:44519__v) [n:127.0.0.1:44519__v c:collection1   x:collection1] o.a.s.u.RandomMergePolicy RandomMergePolicy wrapping class org.apache.lucene.index.TieredMergePolicy: [TieredMergePolicy: maxMergeAtOnce=49, maxMergeAtOnceExplicit=41, maxMergedSegmentMB=52.3662109375, floorSegmentMB=0.70703125, forceMergeDeletesPctAllowed=24.393682989683743, segmentsPerTier=14.0, maxCFSSegmentSizeMB=8.796093022207999E12, noCFSRatio=0.0
   [junit4]   2> 1300048 WARN  (coreLoadExecutor-4805-thread-1-processing-n:127.0.0.1:44519__v) [n:127.0.0.1:44519__v c:collection1   x:collection1] o.a.s.c.RequestHandlers INVALID paramSet a in requestHandler {type = requestHandler,name = /dump,class = DumpRequestHandler,attributes = {initParams=a, name=/dump, class=DumpRequestHandler},args = {defaults={a=A,b=B}}}
   [junit4]   2> 1300077 INFO  (coreLoadExecutor-4805-thread-1-processing-n:127.0.0.1:44519__v) [n:127.0.0.1:44519__v c:collection1   x:collection1] o.a.s.u.UpdateHandler Using UpdateLog implementation: org.apache.solr.update.UpdateLog
   [junit4]   2> 1300077 INFO  (coreLoadExecutor-4805-thread-1-processing-n:127.0.0.1:44519__v) [n:127.0.0.1:44519__v c:collection1   x:collection1] o.a.s.u.UpdateLog Initializing UpdateLog: dataDir= defaultSyncLevel=FLUSH numRecordsToKeep=100 maxNumLogsToKeep=10 numVersionBuckets=65536
   [junit4]   2> 1300078 INFO  (coreLoadExecutor-4805-thread-1-processing-n:127.0.0.1:44519__v) [n:127.0.0.1:44519__v c:collection1   x:collection1] o.a.s.u.CommitTracker Hard AutoCommit: disabled
   [junit4]   2> 1300078 INFO  (coreLoadExecutor-4805-thread-1-processing-n:127.0.0.1:44519__v) [n:127.0.0.1:44519__v c:collection1   x:collection1] o.a.s.u.CommitTracker Soft AutoCommit: disabled
   [junit4]   2> 1300079 INFO  (coreLoadExecutor-4805-thread-1-processing-n:127.0.0.1:44519__v) [n:127.0.0.1:44519__v c:collection1   x:collection1] o.a.s.u.RandomMergePolicy RandomMergePolicy wrapping class org.apache.lucene.index.TieredMergePolicy: [TieredMergePolicy: maxMergeAtOnce=29, maxMergeAtOnceExplicit=11, maxMergedSegmentMB=69.419921875, floorSegmentMB=1.697265625, forceMergeDeletesPctAllowed=14.88844485480842, segmentsPerTier=35.0, maxCFSSegmentSizeMB=8.796093022207999E12, noCFSRatio=0.0
   [junit4]   2> 1300079 INFO  (coreLoadExecutor-4805-thread-1-processing-n:127.0.0.1:44519__v) [n:127.0.0.1:44519__v c:collection1   x:collection1] o.a.s.s.SolrIndexSearcher Opening [Searcher@3f123d1c[collection1] main]
   [junit4]   2> 1300080 INFO  (coreLoadExecutor-4805-thread-1-processing-n:127.0.0.1:44519__v) [n:127.0.0.1:44519__v c:collection1   x:collection1] o.a.s.r.ManagedResourceStorage Configured ZooKeeperStorageIO with znodeBase: /configs/conf1
   [junit4]   2> 1300080 INFO  (coreLoadExecutor-4805-thread-1-processing-n:127.0.0.1:44519__v) [n:127.0.0.1:44519__v c:collection1   x:collection1] o.a.s.r.ManagedResourceStorage Loaded null at path _rest_managed.json using ZooKeeperStorageIO:path=/configs/conf1
   [junit4]   2> 1300080 INFO  (coreLoadExecutor-4805-thread-1-processing-n:127.0.0.1:44519__v) [n:127.0.0.1:44519__v c:collection1   x:collection1] o.a.s.h.ReplicationHandler Commits will be reserved for  10000
   [junit4]   2> 1300081 INFO  (searcherExecutor-4806-thread-1-processing-n:127.0.0.1:44519__v x:collection1 c:collection1) [n:127.0.0.1:44519__v c:collection1   x:collection1] o.a.s.c.SolrCore [collection1] Registered new searcher Searcher@3f123d1c[collection1] main{ExitableDirectoryReader(UninvertingDirectoryReader())}
   [junit4]   2> 1300081 INFO  (coreLoadExecutor-4805-thread-1-processing-n:127.0.0.1:44519__v) [n:127.0.0.1:44519__v c:collection1   x:collection1] o.a.s.u.UpdateLog Could not find max version in index or recent updates, using new clock 1566101636860870656
   [junit4]   2> 1300084 INFO  (coreZkRegister-4800-thread-1-processing-n:127.0.0.1:44519__v x:collection1 c:collection1) [n:127.0.0.1:44519__v c:collection1 s:shard1 r:core_node2 x:collection1] o.a.s.c.ShardLeaderElectionContext Enough replicas found to continue.
   [junit4]   2> 1300085 INFO  (coreZkRegister-4800-thread-1-processing-n:127.0.0.1:44519__v x:collection1 c:collection1) [n:127.0.0.1:44519__v c:collection1 s:shard1 r:core_node2 x:collection1] o.a.s.c.ShardLeaderElectionContext I may be the new leader - try and sync
   [junit4]   2> 1300085 INFO  (coreZkRegister-4800-thread-1-processing-n:127.0.0.1:44519__v x:collection1 c:collection1) [n:127.0.0.1:44519__v c:collection1 s:shard1 r:core_node2 x:collection1] o.a.s.c.SyncStrategy Sync replicas to http://127.0.0.1:44519/_v/collection1/
   [junit4]   2> 1300085 INFO  (coreZkRegister-4800-thread-1-processing-n:127.0.0.1:44519__v x:collection1 c:collection1) [n:127.0.0.1:44519__v c:collection1 s:shard1 r:core_node2 x:collection1] o.a.s.c.SyncStrategy Sync Success - now sync replicas to me
   [junit4]   2> 1300085 INFO  (coreZkRegister-4800-thread-1-processing-n:127.0.0.1:44519__v x:collection1 c:collection1) [n:127.0.0.1:44519__v c:collection1 s:shard1 r:core_node2 x:collection1] o.a.s.c.SyncStrategy http://127.0.0.1:44519/_v/collection1/ has no replicas
   [junit4]   2> 1300085 INFO  (coreZkRegister-4800-thread-1-processing-n:127.0.0.1:44519__v x:collection1 c:collection1) [n:127.0.0.1:44519__v c:collection1 s:shard1 r:core_node2 x:collection1] o.a.s.c.ShardLeaderElectionContext Found all replicas participating in election, clear LIR
   [junit4]   2> 1300087 INFO  (coreZkRegister-4800-thread-1-processing-n:127.0.0.1:44519__v x:collection1 c:collection1) [n:127.0.0.1:44519__v c:collection1 s:shard1 r:core_node2 x:collection1] o.a.s.c.ShardLeaderElectionContext I am the new leader: http://127.0.0.1:44519/_v/collection1/ shard1
   [junit4]   2> 1300188 INFO  (zkCallback-2134-thread-1-processing-n:127.0.0.1:44519__v) [n:127.0.0.1:44519__v    ] o.a.s.c.c.ZkStateReader A cluster state change: [WatchedEvent state:SyncConnected type:NodeDataChanged path:/collections/collection1/state.json] for collection [collection1] has occurred - updating... (live nodes size: [3])
   [junit4]   2> 1300188 INFO  (zkCallback-2128-thread-1-processing-n:127.0.0.1:43663__v) [n:127.0.0.1:43663__v    ] o.a.s.c.c.ZkStateReader A cluster state change: [WatchedEvent state:SyncConnected type:NodeDataChanged path:/collections/collection1/state.json] for collection [collection1] has occurred - updating... (live nodes size: [3])
   [junit4]   2> 1300237 INFO  (coreZkRegister-4800-thread-1-processing-n:127.0.0.1:44519__v x:collection1 c:collection1) [n:127.0.0.1:44519__v c:collection1 s:shard1 r:core_node2 x:collection1] o.a.s.c.ZkController I am the leader, no recovery necessary
   [junit4]   2> 1300340 INFO  (zkCallback-2134-thread-1-processing-n:127.0.0.1:44519__v) [n:127.0.0.1:44519__v    ] o.a.s.c.c.ZkStateReader A cluster state change: [WatchedEvent state:SyncConnected type:NodeDataChanged path:/collections/collection1/state.json] for collection [collection1] has occurred - updating... (live nodes size: [3])
   [junit4]   2> 1300340 INFO  (zkCallback-2128-thread-1-processing-n:127.0.0.1:43663__v) [n:127.0.0.1:43663__v    ] o.a.s.c.c.ZkStateReader A cluster state change: [WatchedEvent state:SyncConnected type:NodeDataChanged path:/collections/collection1/state.json] for collection [collection1] has occurred - updating... (live nodes size: [3])
   [junit4]   2> 1300476 INFO  (TEST-ShardSplitTest.testSplitStaticIndexReplication-seed#[1D378D3EBBFC0ED9]) [    ] o.a.s.SolrTestCaseJ4 Writing core.properties file to /home/jenkins/workspace/Lucene-Solr-master-Linux/solr/build/solr-core/test/J2/temp/solr.cloud.ShardSplitTest_1D378D3EBBFC0ED9-001/shard-3-001/cores/collection1
   [junit4]   2> 1300476 INFO  (TEST-ShardSplitTest.testSplitStaticIndexReplication-seed#[1D378D3EBBFC0ED9]) [    ] o.a.s.c.AbstractFullDistribZkTestBase create jetty 3 in directory /home/jenkins/workspace/Lucene-Solr-master-Linux/solr/build/solr-core/test/J2/temp/solr.cloud.ShardSplitTest_1D378D3EBBFC0ED9-001/shard-3-001
   [junit4]   2> 1300477 INFO  (TEST-ShardSplitTest.testSplitStaticIndexReplication-seed#[1D378D3EBBFC0ED9]) [    ] o.e.j.s.Server jetty-9.3.14.v20161028
   [junit4]   2> 1300477 INFO  (TEST-ShardSplitTest.testSplitStaticIndexReplication-seed#[1D378D3EBBFC0ED9]) [    ] o.e.j.s.h.ContextHandler Started o.e.j.s.ServletContextHandler@23ea1979{/_v,null,AVAILABLE}
   [junit4]   2> 1300477 INFO  (TEST-ShardSplitTest.testSplitStaticIndexReplication-seed#[1D378D3EBBFC0ED9]) [    ] o.e.j.s.AbstractConnector Started ServerConnector@80a05b8{HTTP/1.1,[http/1.1]}{127.0.0.1:37353}
   [junit4]   2> 1300478 INFO  (TEST-ShardSplitTest.testSplitStaticIndexReplication-seed#[1D378D3EBBFC0ED9]) [    ] o.e.j.s.Server Started @1302034ms
   [junit4]   2> 1300478 INFO  (TEST-ShardSplitTest.testSplitStaticIndexReplication-seed#[1D378D3EBBFC0ED9]) [    ] o.a.s.c.s.e.JettySolrRunner Jetty properties: {solr.data.dir=/home/jenkins/workspace/Lucene-Solr-master-Linux/solr/build/solr-core/test/J2/temp/solr.cloud.ShardSplitTest_1D378D3EBBFC0ED9-001/tempDir-001/jetty3, solrconfig=solrconfig.xml, hostContext=/_v, hostPort=37353, coreRootDirectory=/home/jenkins/workspace/Lucene-Solr-master-Linux/solr/build/solr-core/test/J2/../../../../../../../../../home/jenkins/workspace/Lucene-Solr-master-Linux/solr/build/solr-core/test/J2/temp/solr.cloud.ShardSplitTest_1D378D3EBBFC0ED9-001/shard-3-001/cores}
   [junit4]   2> 1300478 ERROR (TEST-ShardSplitTest.testSplitStaticIndexReplication-seed#[1D378D3EBBFC0ED9]) [    ] o.a.s.s.StartupLoggingUtils Missing Java Option solr.log.dir. Logging may be missing or incomplete.
   [junit4]   2> 1300479 INFO  (TEST-ShardSplitTest.testSplitStaticIndexReplication-seed#[1D378D3EBBFC0ED9]) [    ] o.a.s.s.SolrDispatchFilter  ___      _       Welcome to Apache Solr™ version 7.0.0
   [junit4]   2> 1300479 INFO  (TEST-ShardSplitTest.testSplitStaticIndexReplication-seed#[1D378D3EBBFC0ED9]) [    ] o.a.s.s.SolrDispatchFilter / __| ___| |_ _   Starting in cloud mode on port null
   [junit4]   2> 1300479 INFO  (TEST-ShardSplitTest.testSplitStaticIndexReplication-seed#[1D378D3EBBFC0ED9]) [    ] o.a.s.s.SolrDispatchFilter \__ \/ _ \ | '_|  Install dir: null
   [junit4]   2> 1300479 INFO  (TEST-ShardSplitTest.testSplitStaticIndexReplication-seed#[1D378D3EBBFC0ED9]) [    ] o.a.s.s.SolrDispatchFilter |___/\___/_|_|    Start time: 2017-04-30T11:15:08.354Z
   [junit4]   2> 1300480 INFO  (TEST-ShardSplitTest.testSplitStaticIndexReplication-seed#[1D378D3EBBFC0ED9]) [    ] o.a.s.s.SolrDispatchFilter Loading solr.xml from SolrHome (not found in ZooKeeper)
   [junit4]   2> 1300480 INFO  (TEST-ShardSplitTest.testSplitStaticIndexReplication-seed#[1D378D3EBBFC0ED9]) [    ] o.a.s.c.SolrXmlConfig Loading container configuration from /home/jenkins/workspace/Lucene-Solr-master-Linux/solr/build/solr-core/test/J2/temp/solr.cloud.ShardSplitTest_1D378D3EBBFC0ED9-001/shard-3-001/solr.xml
   [junit4]   2> 1300484 INFO  (TEST-ShardSplitTest.testSplitStaticIndexReplication-seed#[1D378D3EBBFC0ED9]) [    ] o.a.s.c.SolrXmlConfig MBean server found: com.sun.jmx.mbeanserver.JmxMBeanServer@5e6dc94c, but no JMX reporters were configured - adding default JMX reporter.
   [junit4]   2> 1300487 INFO  (TEST-ShardSplitTest.testSplitStaticIndexReplication-seed#[1D378D3EBBFC0ED9]) [    ] o.a.s.c.ZkContainer Zookeeper client=127.0.0.1:44697/solr
   [junit4]   2> 1300491 INFO  (TEST-ShardSplitTest.testSplitStaticIndexReplication-seed#[1D378D3EBBFC0ED9]) [n:127.0.0.1:37353__v    ] o.a.s.c.c.ZkStateReader Updated live nodes from ZooKeeper... (0) -> (3)
   [junit4]   2> 1300492 INFO  (TEST-ShardSplitTest.testSplitStaticIndexReplication-seed#[1D378D3EBBFC0ED9]) [n:127.0.0.1:37353__v    ] o.a.s.c.Overseer Overseer (id=null) closing
   [junit4]   2> 1300493 INFO  (TEST-ShardSplitTest.testSplitStaticIndexReplication-seed#[1D378D3EBBFC0ED9]) [n:127.0.0.1:37353__v    ] o.a.s.c.ZkController Register node as live in ZooKeeper:/live_nodes/127.0.0.1:37353__v
   [junit4]   2> 1300493 INFO  (zkCallback-2140-thread-1-processing-n:127.0.0.1:37353__v) [n:127.0.0.1:37353__v    ] o.a.s.c.c.ZkStateReader Updated live nodes from ZooKeeper... (3) -> (4)
   [junit4]   2> 1300494 INFO  (zkCallback-2128-thread-1-processing-n:127.0.0.1:43663__v) [n:127.0.0.1:43663__v    ] o.a.s.c.c.ZkStateReader Updated live nodes from ZooKeeper... (3) -> (4)
   [junit4]   2> 1300493 INFO  (zkCallback-2122-thread-1) [    ] o.a.s.c.c.ZkStateReader Updated live nodes from ZooKeeper... (3) -> (4)
   [junit4]   2> 1300495 INFO  (zkCallback-2118-thread-1-processing-n:127.0.0.1:35602__v) [n:127.0.0.1:35602__v    ] o.a.s.c.c.ZkStateReader Updated live nodes from ZooKeeper... (3) -> (4)
   [junit4]   2> 1300495 INFO  (zkCallback-2134-thread-1-processing-n:127.0.0.1:44519__v) [n:127.0.0.1:44519__v    ] o.a.s.c.c.ZkStateReader Updated live nodes from ZooKeeper... (3) -> (4)
   [junit4]   2> 1300613 INFO  (TEST-ShardSplitTest.testSplitStaticIndexReplication-seed#[1D378D3EBBFC0ED9]) [n:127.0.0.1:37353__v    ] o.a.s.m.r.SolrJmxReporter JMX monitoring for 'solr.node' (registry 'solr.node') enabled at server: com.sun.jmx.mbeanserver.JmxMBeanServer@5e6dc94c
   [junit4]   2> 1300617 INFO  (TEST-ShardSplitTest.testSplitStaticIndexReplication-seed#[1D378D3EBBFC0ED9]) [n:127.0.0.1:37353__v    ] o.a.s.m.r.SolrJmxReporter JMX monitoring for 'solr.jvm' (registry 'solr.jvm') enabled at server: com.sun.jmx.mbeanserver.JmxMBeanServer@5e6dc94c
   [junit4]   2> 1300617 INFO  (TEST-ShardSplitTest.testSplitStaticIndexReplication-seed#[1D378D3EBBFC0ED9]) [n:127.0.0.1:37353__v    ] o.a.s.m.r.SolrJmxReporter JMX monitoring for 'solr.jetty' (registry 'solr.jetty') enabled at server: com.sun.jmx.mbeanserver.JmxMBeanServer@5e6dc94c
   [junit4]   2> 1300619 INFO  (TEST-ShardSplitTest.testSplitStaticIndexReplication-seed#[1D378D3EBBFC0ED9]) [n:127.0.0.1:37353__v    ] o.a.s.c.CorePropertiesLocator Found 1 core definitions underneath /home/jenkins/workspace/Lucene-Solr-master-Linux/solr/build/solr-core/test/J2/../../../../../../../../../home/jenkins/workspace/Lucene-Solr-master-Linux/solr/build/solr-core/test/J2/temp/solr.cloud.ShardSplitTest_1D378D3EBBFC0ED9-001/shard-3-001/cores
   [junit4]   2> 1300619 INFO  (TEST-ShardSplitTest.testSplitStaticIndexReplication-seed#[1D378D3EBBFC0ED9]) [n:127.0.0.1:37353__v    ] o.a.s.c.CorePropertiesLocator Cores are: [collection1]
   [junit4]   2> 1300620 INFO  (coreLoadExecutor-4816-thread-1-processing-n:127.0.0.1:37353__v) [n:127.0.0.1:37353__v c:collection1   x:collection1] o.a.s.c.TransientSolrCoreCacheDefault Allocating transient cache for 4 transient cores
   [junit4]   2> 1300621 INFO  (OverseerStateUpdate-97881351984971780-127.0.0.1:35602__v-n_0000000000) [n:127.0.0.1:35602__v    ] o.a.s.c.o.ReplicaMutator Assigning new node to shard shard=shard2
   [junit4]   2> 1300722 INFO  (zkCallback-2128-thread-1-processing-n:127.0.0.1:43663__v) [n:127.0.0.1:43663__v    ] o.a.s.c.c.ZkStateReader A cluster state change: [WatchedEvent state:SyncConnected type:NodeDataChanged path:/collections/collection1/state.json] for collection [collection1] has occurred - updating... (live nodes size: [4])
   [junit4]   2> 1300722 INFO  (zkCallback-2140-thread-1-processing-n:127.0.0.1:37353__v) [n:127.0.0.1:37353__v    ] o.a.s.c.c.ZkStateReader A cluster state change: [WatchedEvent state:SyncConnected type:NodeDataChanged path:/collections/collection1/state.json] for collection [collection1] has occurred - updating... (live nodes size: [4])
   [junit4]   2> 1300722 INFO  (zkCallback-2134-thread-1-processing-n:127.0.0.1:44519__v) [n:127.0.0.1:44519__v    ] o.a.s.c.c.ZkStateReader A cluster state change: [WatchedEvent state:SyncConnected type:NodeDataChanged path:/collections/collection1/state.json] for collection [collection1] has occurred - updating... (live nodes size: [4])
   [junit4]   2> 1301629 INFO  (coreLoadExecutor-4816-thread-1-processing-n:127.0.0.1:37353__v) [n:127.0.0.1:37353__v c:collection1   x:collection1] o.a.s.c.SolrConfig Using Lucene MatchVersion: 7.0.0
   [junit4]   2> 1301648 INFO  (coreLoadExecutor-4816-thread-1-processing-n:127.0.0.1:37353__v) [n:127.0.0.1:37353__v c:collection1   x:collection1] o.a.s.s.IndexSchema [collection1] Schema name=test
   [junit4]   2> 1301718 WARN  (coreLoadExecutor-4816-thread-1-processing-n:127.0.0.1:37353__v) [n:127.0.0.1:37353__v c:collection1   x:collection1] o.a.s.s.IndexSchema [collection1] default search field in schema is text. WARNING: Deprecated, please use 'df' on request instead.
   [junit4]   2> 1301720 INFO  (coreLoadExecutor-4816-thread-1-processing-n:127.0.0.1:37353__v) [n:127.0.0.1:37353__v c:collection1   x:collection1] o.a.s.s.IndexSchema Loaded schema test/1.6 with uniqueid field id
   [junit4]   2> 1301729 INFO  (coreLoadExecutor-4816-thread-1-processing-n:127.0.0.1:37353__v) [n:127.0.0.1:37353__v c:collection1   x:collection1] o.a.s.c.CoreContainer Creating SolrCore 'collection1' using configuration from collection collection1, trusted=true
   [junit4]   2> 1301729 INFO  (coreLoadExecutor-4816-thread-1-processing-n:127.0.0.1:37353__v) [n:127.0.0.1:37353__v c:collection1   x:collection1] o.a.s.m.r.SolrJmxReporter JMX monitoring for 'solr.core.collection1.shard2.core_node3' (registry 'solr.core.collection1.shard2.core_node3') enabled at server: com.sun.jmx.mbeanserver.JmxMBeanServer@5e6dc94c
   [junit4]   2> 1301729 INFO  (coreLoadExecutor-4816-thread-1-processing-n:127.0.0.1:37353__v) [n:127.0.0.1:37353__v c:collection1   x:collection1] o.a.s.c.SolrCore solr.RecoveryStrategy.Builder
   [junit4]   2> 1301729 INFO  (coreLoadExecutor-4816-thread-1-processing-n:127.0.0.1:37353__v) [n:127.0.0.1:37353__v c:collection1   x:collection1] o.a.s.c.SolrCore [[collection1] ] Opening new SolrCore at [/home/jenkins/workspace/Lucene-Solr-master-Linux/solr/build/solr-core/test/J2/temp/solr.cloud.ShardSplitTest_1D378D3EBBFC0ED9-001/shard-3-001/cores/collection1], dataDir=[/home/jenkins/workspace/Lucene-Solr-master-Linux/solr/build/solr-core/test/J2/../../../../../../../../../home/jenkins/workspace/Lucene-Solr-master-Linux/solr/build/solr-core/test/J2/temp/solr.cloud.ShardSplitTest_1D378D3EBBFC0ED9-001/shard-3-001/cores/collection1/data/]
   [junit4]   2> 1301733 INFO  (coreLoadExecutor-4816-thread-1-processing-n:127.0.0.1:37353__v) [n:127.0.0.1:37353__v c:collection1   x:collection1] o.a.s.u.RandomMergePolicy RandomMergePolicy wrapping class org.apache.lucene.index.TieredMergePolicy: [TieredMergePolicy: maxMergeAtOnce=49, maxMergeAtOnceExplicit=41, maxMergedSegmentMB=52.3662109375, floorSegmentMB=0.70703125, forceMergeDeletesPctAllowed=24.393682989683743, segmentsPerTier=14.0, maxCFSSegmentSizeMB=8.796093022207999E12, noCFSRatio=0.0
   [junit4]   2> 1301760 WARN  (coreLoadExecutor-4816-thread-1-processing-n:127.0.0.1:37353__v) [n:127.0.0.1:37353__v c:collection1   x:collection1] o.a.s.c.RequestHandlers INVALID paramSet a in requestHandler {type = requestHandler,name = /dump,class = DumpRequestHandler,attributes = {initParams=a, name=/dump, class=DumpRequestHandler},args = {defaults={a=A,b=B}}}
   [junit4]   2> 1301805 INFO  (coreLoadExecutor-4816-thread-1-processing-n:127.0.0.1:37353__v) [n:127.0.0.1:37353__v c:collection1   x:collection1] o.a.s.u.UpdateHandler Using UpdateLog implementation: org.apache.solr.update.UpdateLog
   [junit4]   2> 1301805 INFO  (coreLoadExecutor-4816-thread-1-processing-n:127.0.0.1:37353__v) [n:127.0.0.1:37353__v c:collection1   x:collection1] o.a.s.u.UpdateLog Initializing UpdateLog: dataDir= defaultSyncLevel=FLUSH numRecordsToKeep=100 maxNumLogsToKeep=10 numVersionBuckets=65536
   [junit4]   2> 1301806 INFO  (coreLoadExecutor-4816-thread-1-processing-n:127.0.0.1:37353__v) [n:127.0.0.1:37353__v c:collection1   x:collection1] o.a.s.u.CommitTracker Hard AutoCommit: disabled
   [junit4]   2> 1301806 INFO  (coreLoadExecutor-4816-thread-1-processing-n:127.0.0.1:37353__v) [n:127.0.0.1:37353__v c:collection1   x:collection1] o.a.s.u.CommitTracker Soft AutoCommit: disabled
   [junit4]   2> 1301807 INFO  (coreLoadExecutor-4816-thread-1-processing-n:127.0.0.1:37353__v) [n:127.0.0.1:37353__v c:collection1   x:collection1] o.a.s.u.RandomMergePolicy RandomMergePolicy wrapping class org.apache.lucene.index.TieredMergePolicy: [TieredMergePolicy: maxMergeAtOnce=29, maxMergeAtOnceExplicit=11, maxMergedSegmentMB=69.419921875, floorSegmentMB=1.697265625, forceMergeDeletesPctAllowed=14.88844485480842, segmentsPerTier=35.0, maxCFSSegmentSizeMB=8.796093022207999E12, noCFSRatio=0.0
   [junit4]   2> 1301808 INFO  (coreLoadExecutor-4816-thread-1-processing-n:127.0.0.1:37353__v) [n:127.0.0.1:37353__v c:collection1   x:collection1] o.a.s.s.SolrIndexSearcher Opening [Searcher@5fb3047b[collection1] main]
   [junit4]   2> 1301809 INFO  (coreLoadExecutor-4816-thread-1-processing-n:127.0.0.1:37353__v) [n:127.0.0.1:37353__v c:collection1   x:collection1] o.a.s.r.ManagedResourceStorage Configured ZooKeeperStorageIO with znodeBase: /configs/conf1
   [junit4]   2> 1301809 INFO  (coreLoadExecutor-4816-thread-1-processing-n:127.0.0.1:37353__v) [n:127.0.0.1:37353__v c:collection1   x:collection1] o.a.s.r.ManagedResourceStorage Loaded null at path _rest_managed.json using ZooKeeperStorageIO:path=/configs/conf1
   [junit4]   2> 1301809 INFO  (coreLoadExecutor-4816-thread-1-processing-n:127.0.0.1:37353__v) [n:127.0.0.1:37353__v c:collection1   x:collection1] o.a.s.h.ReplicationHandler Commits will be reserved for  10000
   [junit4]   2> 1301811 INFO  (searcherExecutor-4817-thread-1-processing-n:127.0.0.1:37353__v x:collection1 c:collection1) [n:127.0.0.1:37353__v c:collection1   x:collection1] o.a.s.c.SolrCore [collection1] Registered new searcher Searcher@5fb3047b[collection1] main{ExitableDirectoryReader(UninvertingDirectoryReader())}
   [junit4]   2> 1301811 INFO  (coreLoadExecutor-4816-thread-1-processing-n:127.0.0.1:37353__v) [n:127.0.0.1:37353__v c:collection1   x:collection1] o.a.s.u.UpdateLog Could not find max version in index or recent updates, using new clock 1566101638674907136
   [junit4]   2> 1301814 INFO  (coreZkRegister-4811-thread-1-processing-n:127.0.0.1:37353__v x:collection1 c:collection1) [n:127.0.0.1:37353__v c:collection1 s:shard2 r:core_node3 x:collection1] o.a.s.c.ZkController Core needs to recover:collection1
   [junit4]   2> 1301814 INFO  (updateExecutor-2137-thread-1-processing-n:127.0.0.1:37353__v x:collection1 s:shard2 c:collection1 r:core_node3) [n:127.0.0.1:37353__v c:collection1 s:shard2 r:core_node3 x:collection1] o.a.s.u.DefaultSolrCoreState Running recovery
   [junit4]   2> 1301815 INFO  (recoveryExecutor-2138-thread-1-processing-n:127.0.0.1:37353__v x:collection1 s:shard2 c:collection1 r:core_node3) [n:127.0.0.1:37353__v c:collection1 s:shard2 r:core_node3 x:collection1] o.a.s.c.RecoveryStrategy Starting recovery process. recoveringAfterStartup=true
   [junit4]   2> 1301815 INFO  (recoveryExecutor-2138-thread-1-processing-n:127.0.0.1:37353__v x:collection1 s:shard2 c:collection1 r:core_node3) [n:127.0.0.1:37353__v c:collection1 s:shard2 r:core_node3 x:collection1] o.a.s.c.RecoveryStrategy ###### startupVersions=[[]]
   [junit4]   2> 1301815 INFO  (recoveryExecutor-2138-thread-1-processing-n:127.0.0.1:37353__v x:collection1 s:shard2 c:collection1 r:core_node3) [n:127.0.0.1:37353__v c:collection1 s:shard2 r:core_node3 x:collection1] o.a.s.c.RecoveryStrategy Begin buffering updates. core=[collection1]
   [junit4]   2> 1301815 INFO  (recoveryExecutor-2138-thread-1-processing-n:127.0.0.1:37353__v x:collection1 s:shard2 c:collection1 r:core_node3) [n:127.0.0.1:37353__v c:collection1 s:shard2 r:core_node3 x:collection1] o.a.s.u.UpdateLog Starting to buffer updates. FSUpdateLog{state=ACTIVE, tlog=null}
   [junit4]   2> 1301815 INFO  (recoveryExecutor-2138-thread-1-processing-n:127.0.0.1:37353__v x:collection1 s:shard2 c:collection1 r:core_node3) [n:127.0.0.1:37353__v c:collection1 s:shard2 r:core_node3 x:collection1] o.a.s.c.RecoveryStrategy Publishing state of core [collection1] as recovering, leader is [http://127.0.0.1:43663/_v/collection1/] and I am [http://127.0.0.1:37353/_v/collection1/]
   [junit4]   2> 1301816 INFO  (recoveryExecutor-2138-thread-1-processing-n:127.0.0.1:37353__v x:collection1 s:shard2 c:collection1 r:core_node3) [n:127.0.0.1:37353__v c:collection1 s:shard2 r:core_node3 x:collection1] o.a.s.c.RecoveryStrategy Sending prep recovery command to [http://127.0.0.1:43663/_v]; [WaitForState: action=PREPRECOVERY&core=collection1&nodeName=127.0.0.1:37353__v&coreNodeName=core_node3&state=recovering&checkLive=true&onlyIfLeader=true&onlyIfLeaderActive=true]
   [junit4]   2> 1301817 INFO  (qtp1513768096-11815) [n:127.0.0.1:43663__v    ] o.a.s.h.a.PrepRecoveryOp Going to wait for coreNodeName: core_node3, state: recovering, checkLive: true, onlyIfLeader: true, onlyIfLeaderActive: true
   [junit4]   2> 1301817 INFO  (qtp1513768096-11815) [n:127.0.0.1:43663__v    ] o.a.s.h.a.PrepRecoveryOp Will wait a max of 183 seconds to see collection1 (shard2 of collection1) have state: recovering
   [junit4]   2> 1301817 INFO  (qtp1513768096-11815) [n:127.0.0.1:43663__v    ] o.a.s.h.a.PrepRecoveryOp In WaitForState(recovering): collection=collection1, shard=shard2, thisCore=collection1, leaderDoesNotNeedRecovery=false, isLeader? true, live=true, checkLive=true, currentState=down, localState=active, nodeName=127.0.0.1:37353__v, coreNodeName=core_node3, onlyIfActiveCheckResult=false, nodeProps: core_node3:{"core":"collection1","base_url":"http://127.0.0.1:37353/_v","node_name":"127.0.0.1:37353__v","state":"down"}
   [junit4]   2> 1301917 INFO  (zkCallback-2128-thread-1-processing-n:127.0.0.1:43663__v) [n:127.0.0.1:43663__v    ] o.a.s.c.c.ZkStateReader A cluster state change: [WatchedEvent state:SyncConnected type:NodeDataChanged path:/collections/collection1/state.json] for collection [collection1] has occurred - updating... (live nodes size: [4])
   [junit4]   2> 1301917 INFO  (zkCallback-2134-thread-1-processing-n:127.0.0.1:44519__v) [n:127.0.0.1:44519__v    ] o.a.s.c.c.ZkStateReader A cluster state change: [WatchedEvent state:SyncConnected type:NodeDataChanged path:/collections/collection1/state.json] for collection [collection1] has occurred - updating... (live nodes size: [4])
   [junit4]   2> 1301917 INFO  (zkCallback-2140-thread-1-processing-n:127.0.0.1:37353__v) [n:127.0.0.1:37353__v    ] o.a.s.c.c.ZkStateReader A cluster state change: [WatchedEvent state:SyncConnected type:NodeDataChanged path:/collections/collection1/state.json] for collection [collection1] has occurred - updating... (live nodes size: [4])
   [junit4]   2> 1302205 INFO  (TEST-ShardSplitTest.testSplitStaticIndexReplication-seed#[1D378D3EBBFC0ED9]) [    ] o.a.s.SolrTestCaseJ4 Writing core.properties file to /home/jenkins/workspace/Lucene-Solr-master-Linux/solr/build/solr-core/test/J2/temp/solr.cloud.ShardSplitTest_1D378D3EBBFC0ED9-001/shard-4-001/cores/collection1
   [junit4]   2> 1302206 INFO  (TEST-ShardSplitTest.testSplitStaticIndexReplication-seed#[1D378D3EBBFC0ED9]) [    ] o.a.s.c.AbstractFullDistribZkTestBase create jetty 4 in directory /home/jenkins/workspace/Lucene-Solr-master-Linux/solr/build/solr-core/test/J2/temp/solr.cloud.ShardSplitTest_1D378D3EBBFC0ED9-001/shard-4-001
   [junit4]   2> 1302207 INFO  (TEST-ShardSplitTest.testSplitStaticIndexReplication-seed#[1D378D3EBBFC0ED9]) [    ] o.e.j.s.Server jetty-9.3.14.v20161028
   [junit4]   2> 1302207 INFO  (TEST-ShardSplitTest.testSplitStaticIndexReplication-seed#[1D378D3EBBFC0ED9]) [    ] o.e.j.s.h.ContextHandler Started o.e.j.s.ServletContextHandler@5de5f164{/_v,null,AVAILABLE}
   [junit4]   2> 1302207 INFO  (TEST-ShardSplitTest.testSplitStaticIndexReplication-seed#[1D378D3EBBFC0ED9]) [    ] o.e.j.s.AbstractConnector Started ServerConnector@143fcdaa{HTTP/1.1,[http/1.1]}{127.0.0.1:39422}
   [junit4]   2> 1302208 INFO  (TEST-ShardSplitTest.testSplitStaticIndexReplication-seed#[1D378D3EBBFC0ED9]) [    ] o.e.j.s.Server Started @1303764ms
   [junit4]   2> 1302209 INFO  (TEST-ShardSplitTest.testSplitStaticIndexReplication-seed#[1D378D3EBBFC0ED9]) [    ] o.a.s.c.s.e.JettySolrRunner Jetty properties: {solr.data.dir=/home/jenkins/workspace/Lucene-Solr-master-Linux/solr/build/solr-core/test/J2/temp/solr.cloud.ShardSplitTest_1D378D3EBBFC0ED9-001/tempDir-001/jetty4, solrconfig=solrconfig.xml, hostContext=/_v, hostPort=39422, coreRootDirectory=/home/jenkins/workspace/Lucene-Solr-master-Linux/solr/build/solr-core/test/J2/temp/solr.cloud.ShardSplitTest_1D378D3EBBFC0ED9-001/shard-4-001/cores}
   [junit4]   2> 1302209 ERROR (TEST-ShardSplitTest.testSplitStaticIndexReplication-seed#[1D378D3EBBFC0ED9]) [    ] o.a.s.s.StartupLoggingUtils Missing Java Option solr.log.dir. Logging may be missing or incomplete.
   [junit4]   2> 1302209 INFO  (TEST-ShardSplitTest.testSplitStaticIndexReplication-seed#[1D378D3EBBFC0ED9]) [    ] o.a.s.s.SolrDispatchFilter  ___      _       Welcome to Apache Solr™ version 7.0.0
   [junit4]   2> 1302209 INFO  (TEST-ShardSplitTest.testSplitStaticIndexReplication-seed#[1D378D3EBBFC0ED9]) [    ] o.a.s.s.SolrDispatchFilter / __| ___| |_ _   Starting in cloud mode on port null
   [junit4]   2> 1302209 INFO  (TEST-ShardSplitTest.testSplitStaticIndexReplication-seed#[1D378D3EBBFC0ED9]) [    ] o.a.s.s.SolrDispatchFilter \__ \/ _ \ | '_|  Install dir: null
   [junit4]   2> 1302209 INFO  (TEST-ShardSplitTest.testSplitStaticIndexReplication-seed#[1D378D3EBBFC0ED9]) [    ] o.a.s.s.SolrDispatchFilter |___/\___/_|_|    Start time: 2017-04-30T11:15:10.084Z
   [junit4]   2> 1302211 INFO  (TEST-ShardSplitTest.testSplitStaticIndexReplication-seed#[1D378D3EBBFC0ED9]) [    ] o.a.s.s.SolrDispatchFilter Loading solr.xml from SolrHome (not found in ZooKeeper)
   [junit4]   2> 1302211 INFO  (TEST-ShardSplitTest.testSplitStaticIndexReplication-seed#[1D378D3EBBFC0ED9]) [    ] o.a.s.c.SolrXmlConfig Loading container configuration from /home/jenkins/workspace/Lucene-Solr-master-Linux/solr/build/solr-core/test/J2/temp/solr.cloud.ShardSplitTest_1D378D3EBBFC0ED9-001/shard-4-001/solr.xml
   [junit4]   2> 1302215 INFO  (TEST-ShardSplitTest.testSplitStaticIndexReplication-seed#[1D378D3EBBFC0ED9]) [    ] o.a.s.c.SolrXmlConfig MBean server found: com.sun.jmx.mbeanserver.JmxMBeanServer@5e6dc94c, but no JMX reporters were configured - adding default JMX reporter.
   [junit4]   2> 1302218 INFO  (TEST-ShardSplitTest.testSplitStaticIndexReplication-seed#[1D378D3EBBFC0ED9]) [    ] o.a.s.c.ZkContainer Zookeeper client=127.0.0.1:44697/solr
   [junit4]   2> 1302223 INFO  (TEST-ShardSplitTest.testSplitStaticIndexReplication-seed#[1D378D3EBBFC0ED9]) [n:127.0.0.1:39422__v    ] o.a.s.c.c.ZkStateReader Updated live nodes from ZooKeeper... (0) -> (4)
   [junit4]   2> 1302224 INFO  (TEST-ShardSplitTest.testSplitStaticIndexReplication-seed#[1D378D3EBBFC0ED9]) [n:127.0.0.1:39422__v    ] o.a.s.c.Overseer Overseer (id=null) closing
   [junit4]   2> 1302225 INFO  (TEST-ShardSplitTest.testSplitStaticIndexReplication-seed#[1D378D3EBBFC0ED9]) [n:127.0.0.1:39422__v    ] o.a.s.c.ZkController Register node as live in ZooKeeper:/live_nodes/127.0.0.1:39422__v
   [junit4]   2> 1302225 INFO  (zkCallback-2140-thread-1-processing-n:127.0.0.1:37353__v) [n:127.0.0.1:37353__v    ] o.a.s.c.c.ZkStateReader Updated live nodes from ZooKeeper... (4) -> (5)
   [junit4]   2> 1302226 INFO  (zkCallback-2122-thread-1) [    ] o.a.s.c.c.ZkStateReader Updated live nodes from ZooKeeper... (4) -> (5)
   [junit4]   2> 1302226 INFO  (zkCallback-2134-thread-1-processing-n:127.0.0.1:44519__v) [n:127.0.0.1:44519__v    ] o.a.s.c.c.ZkStateReader Updated live nodes from ZooKeeper... (4) -> (5)
   [junit4]   2> 1302226 INFO  (zkCallback-2118-thread-1-processing-n:127.0.0.1:35602__v) [n:127.0.0.1:35602__v    ] o.a.s.c.c.ZkStateReader Updated live nodes from ZooKeeper... (4) -> (5)
   [junit4]   2> 1302226 INFO  (zkCallback-2128-thread-1-processing-n:127.0.0.1:43663__v) [n:127.0.0.1:43663__v    ] o.a.s.c.c.ZkStateReader Updated live nodes from ZooKeeper... (4) -> (5)
   [junit4]   2> 1302225 INFO  (zkCallback-2147-thread-1-processing-n:127.0.0.1:39422__v) [n:127.0.0.1:39422__v    ] o.a.s.c.c.ZkStateReader Updated live nodes from ZooKeeper... (4) -> (5)
   [junit4]   2> 1302326 INFO  (TEST-ShardSplitTest.testSplitStaticIndexReplication-seed#[1D378D3EBBFC0ED9]) [n:127.0.0.1:39422__v    ] o.a.s.m.r.SolrJmxReporter JMX monitoring for 'solr.node' (registry 'solr.node') enabled at server: com.sun.jmx.mbeanserver.JmxMBeanServer@5e6dc94c
   [junit4]   2> 1302330 INFO  (TEST-ShardSplitTest.testSplitStaticIndexReplication-seed#[1D378D3EBBFC0ED9]) [n:127.0.0.1:39422__v    ] o.a.s.m.r.SolrJmxReporter JMX monitoring for 'solr.jvm' (registry 'solr.jvm') enabled at server: com.sun.jmx.mbeanserver.JmxMBeanServer@5e6dc94c
   [junit4]   2> 1302330 INFO  (TEST-ShardSplitTest.testSplitStaticIndexReplication-seed#[1D378D3EBBFC0ED9]) [n:127.0.0.1:39422__v    ] o.a.s.m.r.SolrJmxReporter JMX monitoring for 'solr.jetty' (registry 'solr.jetty') enabled at server: com.sun.jmx.mbeanserver.JmxMBeanServer@5e6dc94c
   [junit4]   2> 1302332 INFO  (TEST-ShardSplitTest.testSplitStaticIndexReplication-seed#[1D378D3EBBFC0ED9]) [n:127.0.0.1:39422__v    ] o.a.s.c.CorePropertiesLocator Found 1 core definitions underneath /home/jenkins/workspace/Lucene-Solr-master-Linux/solr/build/solr-core/test/J2/temp/solr.cloud.ShardSplitTest_1D378D3EBBFC0ED9-001/shard-4-001/cores
   [junit4]   2> 1302332 INFO  (TEST-ShardSplitTest.testSplitStaticIndexReplication-seed#[1D378D3EBBFC0ED9]) [n:127.0.0.1:39422__v    ] o.a.s.c.CorePropertiesLocator Cores are: [collection1]
   [junit4]   2> 1302332 INFO  (coreLoadExecutor-4827-thread-1-processing-n:127.0.0.1:39422__v) [n:127.0.0.1:39422__v c:collection1   x:collection1] o.a.s.c.TransientSolrCoreCacheDefault Allocating transient cache for 4 transient cores
   [junit4]   2> 1302333 INFO  (OverseerStateUpdate-97881351984971780-127.0.0.1:35602__v-n_0000000000) [n:127.0.0.1:35602__v    ] o.a.s.c.o.ReplicaMutator Assigning new node to shard shard=shard1
   [junit4]   2> 1302434 INFO  (zkCallback-2140-thread-1-processing-n:127.0.0.1:37353__v) [n:127.0.0.1:37353__v    ] o.a.s.c.c.ZkStateReader A cluster state change: [WatchedEvent state:SyncConnected type:NodeDataChanged path:/collections/collection1/state.json] for collection [collection1] has occurred - updating... (live nodes size: [5])
   [junit4]   2> 1302434 INFO  (zkCallback-2134-thread-1-processing-n:127.0.0.1:44519__v) [n:127.0.0.1:44519__v    ] o.a.s.c.c.ZkStateReader A cluster state change: [WatchedEvent state:SyncConnected type:NodeDataChanged path:/collections/collection1/state.json] for collection [collection1] has occurred - updating... (live nodes size: [5])
   [junit4]   2> 1302434 INFO  (zkCallback-2128-thread-1-processing-n:127.0.0.1:43663__v) [n:127.0.0.1:43663__v    ] o.a.s.c.c.ZkStateReader A cluster state change: [WatchedEvent state:SyncConnected type:NodeDataChanged path:/collections/collection1/state.json] for collection [collection1] has occurred - updating... (live nodes size: [5])
   [junit4]   2> 1302434 INFO  (zkCallback-2147-thread-1-processing-n:127.0.0.1:39422__v) [n:127.0.0.1:39422__v    ] o.a.s.c.c.ZkStateReader A cluster state change: [WatchedEvent state:SyncConnected type:NodeDataChanged path:/collections/collection1/state.json] for collection [collection1] has occurred - updating... (live nodes size: [5])
   [junit4]   2> 1302817 INFO  (qtp1513768096-11815) [n:127.0.0.1:43663__v    ] o.a.s.h.a.PrepRecoveryOp In WaitForState(recovering): collection=collection1, shard=shard2, thisCore=collection1, leaderDoesNotNeedRecovery=false, isLeader? true, live=true, checkLive=true, currentState=recovering, localState=active, nodeName=127.0.0.1:37353__v, coreNodeName=core_node3, onlyIfActiveCheckResult=false, nodeProps: core_node3:{"core":"collection1","base_url":"http://127.0.0.1:37353/_v","node_name":"127.0.0.1:37353__v","state":"recovering"}
   [junit4]   2> 1302818 INFO  (qtp1513768096-11815) [n:127.0.0.1:43663__v    ] o.a.s.h.a.PrepRecoveryOp Waited coreNodeName: core_node3, state: recovering, checkLive: true, onlyIfLeader: true for: 1 seconds.
   [junit4]   2> 1302818 INFO  (qtp1513768096-11815) [n:127.0.0.1:43663__v    ] o.a.s.s.HttpSolrCall [admin] webapp=null path=/admin/cores params={nodeName=127.0.0.1:37353__v&onlyIfLeaderActive=true&core=collection1&coreNodeName=core_node3&action=PREPRECOVERY&checkLive=true&state=recovering&onlyIfLeader=true&wt=javabin&version=2} status=0 QTime=1000
   [junit4]   2> 1303318 INFO  (recoveryExecutor-2138-thread-1-processing-n:127.0.0.1:37353__v x:collection1 s:shard2 c:collection1 r:core_node3) [n:127.0.0.1:37353__v c:collection1 s:shard2 r:core_node3 x:collection1] o.a.s.c.RecoveryStrategy Attempting to PeerSync from [http://127.0.0.1:43663/_v/collection1/] - recoveringAfterStartup=[true]
   [junit4]   2> 1303318 INFO  (recoveryExecutor-2138-thread-1-processing-n:127.0.0.1:37353__v x:collection1 s:shard2 c:collection1 r:core_node3) [n:127.0.0.1:37353__v c:collection1 s:shard2 r:core_node3 x:collection1] o.a.s.u.PeerSync PeerSync: core=collection1 url=http://127.0.0.1:37353/_v START replicas=[http://127.0.0.1:43663/_v/collection1/] nUpdates=100
   [junit4]   2> 1303320 INFO  (qtp151

[...truncated too long message...]

5 INFO  (coreCloseExecutor-5453-thread-1) [n:127.0.0.1:35179__v c:collection1 s:shard1 r:core_node4 x:collection1] o.a.s.c.SolrCore [collection1]  CLOSING SolrCore org.apache.solr.core.SolrCore@47bbb6eb
   [junit4]   2> 2069736 INFO  (coreCloseExecutor-5453-thread-1) [n:127.0.0.1:35179__v c:collection1 s:shard1 r:core_node4 x:collection1] o.a.s.m.SolrMetricManager Closing metric reporters for registry=solr.core.collection1.shard1.core_node4, tag=1203484395
   [junit4]   2> 2069738 INFO  (coreCloseExecutor-5453-thread-1) [n:127.0.0.1:35179__v c:collection1 s:shard1 r:core_node4 x:collection1] o.a.s.m.SolrMetricManager Closing metric reporters for registry=solr.collection.collection1.shard1.leader, tag=1203484395
   [junit4]   2> 2069738 INFO  (TEST-ShardSplitTest.testSplitWithChaosMonkey-seed#[1D378D3EBBFC0ED9]) [    ] o.a.s.c.Overseer Overseer (id=97881371953594386-127.0.0.1:35179__v-n_0000000004) closing
   [junit4]   2> 2069738 INFO  (OverseerStateUpdate-97881371953594386-127.0.0.1:35179__v-n_0000000004) [n:127.0.0.1:35179__v    ] o.a.s.c.Overseer Overseer Loop exiting : 127.0.0.1:35179__v
   [junit4]   2> 2069739 WARN  (zkCallback-2329-thread-5-processing-n:127.0.0.1:35179__v) [n:127.0.0.1:35179__v    ] o.a.s.c.c.ZkStateReader ZooKeeper watch triggered, but Solr cannot talk to ZK: [KeeperErrorCode = Session expired for /live_nodes]
   [junit4]   2> 2069739 INFO  (TEST-ShardSplitTest.testSplitWithChaosMonkey-seed#[1D378D3EBBFC0ED9]) [    ] o.e.j.s.AbstractConnector Stopped ServerConnector@63528573{HTTP/1.1,[http/1.1]}{127.0.0.1:0}
   [junit4]   2> 2069739 INFO  (TEST-ShardSplitTest.testSplitWithChaosMonkey-seed#[1D378D3EBBFC0ED9]) [    ] o.e.j.s.h.ContextHandler Stopped o.e.j.s.ServletContextHandler@3e78efbf{/_v,null,UNAVAILABLE}
   [junit4]   2> 2069740 ERROR (TEST-ShardSplitTest.testSplitWithChaosMonkey-seed#[1D378D3EBBFC0ED9]) [    ] o.a.z.s.ZooKeeperServer ZKShutdownHandler is not registered, so ZooKeeper server won't take any action on ERROR or SHUTDOWN server state changes
   [junit4]   2> 2069740 INFO  (TEST-ShardSplitTest.testSplitWithChaosMonkey-seed#[1D378D3EBBFC0ED9]) [    ] o.a.s.c.ZkTestServer connecting to 127.0.0.1:39965 39965
   [junit4]   2> 2069763 INFO  (Thread-2628) [    ] o.a.s.c.ZkTestServer connecting to 127.0.0.1:39965 39965
   [junit4]   2> 2069764 WARN  (Thread-2628) [    ] o.a.s.c.ZkTestServer Watch limit violations: 
   [junit4]   2> Maximum concurrent create/delete watches above limit:
   [junit4]   2> 
   [junit4]   2> 	7	/solr/aliases.json
   [junit4]   2> 	7	/solr/clusterprops.json
   [junit4]   2> 	6	/solr/security.json
   [junit4]   2> 	6	/solr/configs/conf1
   [junit4]   2> 
   [junit4]   2> Maximum concurrent data watches above limit:
   [junit4]   2> 
   [junit4]   2> 	7	/solr/clusterstate.json
   [junit4]   2> 	6	/solr/collections/collection1/state.json
   [junit4]   2> 	2	/solr/overseer_elect/election/97881371953594377-127.0.0.1:35203__v-n_0000000001
   [junit4]   2> 
   [junit4]   2> Maximum concurrent children watches above limit:
   [junit4]   2> 
   [junit4]   2> 	7	/solr/collections
   [junit4]   2> 	6	/solr/live_nodes
   [junit4]   2> 	4	/solr/overseer/queue
   [junit4]   2> 	4	/solr/overseer/collection-queue-work
   [junit4]   2> 	2	/solr/overseer/queue-work
   [junit4]   2> 
   [junit4]   2> NOTE: reproduce with: ant test  -Dtestcase=ShardSplitTest -Dtests.method=testSplitWithChaosMonkey -Dtests.seed=1D378D3EBBFC0ED9 -Dtests.multiplier=3 -Dtests.slow=true -Dtests.locale=es-PE -Dtests.timezone=America/Danmarkshavn -Dtests.asserts=true -Dtests.file.encoding=UTF-8
   [junit4] FAILURE  470s J2 | ShardSplitTest.testSplitWithChaosMonkey <<<
   [junit4]    > Throwable #1: java.lang.AssertionError: There are still nodes recoverying - waited for 330 seconds
   [junit4]    > 	at __randomizedtesting.SeedInfo.seed([1D378D3EBBFC0ED9:96105EEFFAFAA55D]:0)
   [junit4]    > 	at org.apache.solr.cloud.AbstractDistribZkTestBase.waitForRecoveriesToFinish(AbstractDistribZkTestBase.java:187)
   [junit4]    > 	at org.apache.solr.cloud.AbstractDistribZkTestBase.waitForRecoveriesToFinish(AbstractDistribZkTestBase.java:144)
   [junit4]    > 	at org.apache.solr.cloud.AbstractDistribZkTestBase.waitForRecoveriesToFinish(AbstractDistribZkTestBase.java:139)
   [junit4]    > 	at org.apache.solr.cloud.AbstractFullDistribZkTestBase.waitForRecoveriesToFinish(AbstractFullDistribZkTestBase.java:861)
   [junit4]    > 	at org.apache.solr.cloud.ShardSplitTest.testSplitWithChaosMonkey(ShardSplitTest.java:442)
   [junit4]    > 	at org.apache.solr.BaseDistributedSearchTestCase$ShardsRepeatRule$ShardsFixedStatement.callStatement(BaseDistributedSearchTestCase.java:985)
   [junit4]    > 	at org.apache.solr.BaseDistributedSearchTestCase$ShardsRepeatRule$ShardsStatement.evaluate(BaseDistributedSearchTestCase.java:960)
   [junit4]    > 	at java.lang.Thread.run(Thread.java:745)
   [junit4]   2> 2069767 INFO  (SUITE-ShardSplitTest-seed#[1D378D3EBBFC0ED9]-worker) [    ] o.a.s.SolrTestCaseJ4 ###deleteCore
   [junit4]   2> NOTE: leaving temporary files on disk at: /home/jenkins/workspace/Lucene-Solr-master-Linux/solr/build/solr-core/test/J2/temp/solr.cloud.ShardSplitTest_1D378D3EBBFC0ED9-001
   [junit4]   2> Apr 30, 2017 11:27:57 AM com.carrotsearch.randomizedtesting.ThreadLeakControl checkThreadLeaks
   [junit4]   2> WARNING: Will linger awaiting termination of 2 leaked thread(s).
   [junit4]   2> NOTE: test params are: codec=Asserting(Lucene70): {rnd_b=BlockTreeOrds(blocksize=128), shard_s=FST50, n_ti=FST50, a_t=FST50, a_i=BlockTreeOrds(blocksize=128), id=BlockTreeOrds(blocksize=128)}, docValues:{rnd_b=DocValuesFormat(name=Memory), shard_s=DocValuesFormat(name=Asserting), _version_=DocValuesFormat(name=Lucene70), n_ti=DocValuesFormat(name=Asserting), a_t=DocValuesFormat(name=Asserting), a_i=DocValuesFormat(name=Memory), id=DocValuesFormat(name=Memory)}, maxPointsInLeafNode=534, maxMBSortInHeap=5.6259940398419275, sim=RandomSimilarity(queryNorm=true): {}, locale=es-PE, timezone=America/Danmarkshavn
   [junit4]   2> NOTE: Linux 4.4.0-72-generic amd64/Oracle Corporation 1.8.0_121 (64-bit)/cpus=12,threads=1,free=115997184,total=521666560
   [junit4]   2> NOTE: All tests run in this JVM: [UpdateParamsTest, TestSolrDeletionPolicy1, TestRequestStatusCollectionAPI, DistributedFacetPivotSmallAdvancedTest, TestIndexSearcher, StatsComponentTest, TestLuceneMatchVersion, BinaryUpdateRequestHandlerTest, TestBlobHandler, LukeRequestHandlerTest, MigrateRouteKeyTest, TestFastOutputStream, TestSolr4Spatial2, RecoveryZkTest, TestCloudDeleteByQuery, TestLMDirichletSimilarityFactory, ShowFileRequestHandlerTest, TestConfig, SolrIndexConfigTest, MultiThreadedOCPTest, SharedFSAutoReplicaFailoverUtilsTest, SecurityConfHandlerTest, SuggesterWFSTTest, TestQueryWrapperFilter, DeleteShardTest, BlockCacheTest, TestFieldCollectionResource, TestFileDictionaryLookup, LeaderElectionTest, BasicDistributedZk2Test, TestSolrCloudWithKerberosAlt, TestStressReorder, TestMacroExpander, TestImplicitCoreProperties, TestReload, TestHdfsCloudBackupRestore, TestPKIAuthenticationPlugin, OutOfBoxZkACLAndCredentialsProvidersTest, TestSort, TestDelegationWithHadoopAuth, TestFieldCacheSortRandom, SolrTestCaseJ4Test, CdcrReplicationDistributedZkTest, UninvertDocValuesMergePolicyTest, TestCloudPseudoReturnFields, OutputWriterTest, TestDocSet, TestIndexingPerformance, TestTolerantSearch, CdcrVersionReplicationTest, DistributedFacetExistsSmallTest, ActionThrottleTest, BlockJoinFacetRandomTest, DirectoryFactoryTest, TestRebalanceLeaders, ExternalFileFieldSortTest, TestXmlQParser, TestReversedWildcardFilterFactory, MBeansHandlerTest, TestOnReconnectListenerSupport, TestCollationField, SaslZkACLProviderTest, DeleteLastCustomShardedReplicaTest, VMParamsZkACLAndCredentialsProvidersTest, SolrSlf4jReporterTest, DistributedVersionInfoTest, TestDefaultSearchFieldResource, DistributedQueryComponentCustomSortTest, SolrCloudExampleTest, RestartWhileUpdatingTest, CloudExitableDirectoryReaderTest, CollectionTooManyReplicasTest, TestSolrQueryParserDefaultOperatorResource, AtomicUpdatesTest, HdfsChaosMonkeyNothingIsSafeTest, TestSolrQueryParser, EchoParamsTest, DocValuesMissingTest, PluginInfoTest, TestCollectionAPI, TestApiFramework, SolrCoreCheckLockOnStartupTest, TestUseDocValuesAsStored2, BooleanFieldTest, CurrencyFieldXmlFileTest, OverseerTest, TestMultiWordSynonyms, TestPhraseSuggestions, TestMergePolicyConfig, TestLegacyFieldCache, CursorMarkTest, SuggestComponentTest, TestComponentsName, TestNRTOpen, TestReRankQParserPlugin, TestCustomSort, TestEmbeddedSolrServerSchemaAPI, ZkStateWriterTest, TestLegacyNumericRangeQueryBuilder, DateFieldTest, HttpPartitionTest, TestSolrCLIRunExample, TestGraphTermsQParserPlugin, AsyncCallRequestStatusResponseTest, HdfsRestartWhileUpdatingTest, HttpSolrCallGetCoreTest, FullSolrCloudDistribCmdsTest, TestCloudNestedDocsSort, OpenExchangeRatesOrgProviderTest, TestFieldCache, DocValuesMultiTest, TolerantUpdateProcessorTest, SolrPluginUtilsTest, SyncSliceTest, TestRandomFaceting, TestRandomDVFaceting, TermVectorComponentDistributedTest, HardAutoCommitTest, TestRangeQuery, TestQueryUtils, TestQueryTypes, XmlUpdateRequestHandlerTest, TermVectorComponentTest, FieldAnalysisRequestHandlerTest, QueryParsingTest, TestLFUCache, TestCrossCoreJoin, TestCursorMarkWithoutUniqueKey, TestDistributedMissingSort, TestEmbeddedSolrServerConstructors, TestJettySolrRunner, ConnectionReuseTest, CollectionReloadTest, ConcurrentDeleteAndCreateCollectionTest, ConfigSetsAPITest, ConnectionManagerTest, CreateCollectionCleanupTest, CustomCollectionTest, DistributedQueueTest, DocValuesNotIndexedTest, LeaderFailureAfterFreshStartTest, NodeMutatorTest, OverriddenZkACLAndCredentialsProvidersTest, OverseerCollectionConfigSetProcessorTest, OverseerModifyCollectionTest, OverseerRolesTest, OverseerTaskQueueTest, RemoteQueryErrorTest, ReplaceNodeTest, ShardSplitTest]
   [junit4] Completed [706/706 (1!)] on J2 in 775.07s, 5 tests, 1 failure <<< FAILURES!

[...truncated 43367 lines...]