You are viewing a plain text version of this content. The canonical link for it is here.
Posted to yarn-issues@hadoop.apache.org by "Ahmed Hussein (Jira)" <ji...@apache.org> on 2020/04/09 15:40:00 UTC

[jira] [Updated] (YARN-10220) RM HA times out intermittently

     [ https://issues.apache.org/jira/browse/YARN-10220?page=com.atlassian.jira.plugin.system.issuetabpanels:all-tabpanel ]

Ahmed Hussein updated YARN-10220:
---------------------------------
    Affects Version/s: 3.3.0
                       2.10.0
                       3.2.1
                       3.1.3

> RM HA times out intermittently
> ------------------------------
>
>                 Key: YARN-10220
>                 URL: https://issues.apache.org/jira/browse/YARN-10220
>             Project: Hadoop YARN
>          Issue Type: Bug
>    Affects Versions: 2.10.0, 3.3.0, 3.2.1, 3.1.3
>            Reporter: Ahmed Hussein
>            Assignee: Bilwa S T
>            Priority: Major
>
> TestResourceTrackerOnHA Among other tests time out intermittently
> * TestApplicationClientProtocolOnHA
> * TestApplicationMasterServiceProtocolForTimelineV2
> * TestApplicationMasterServiceProtocolOnHA
> {code:bash}
> [INFO] --- maven-surefire-plugin:3.0.0-M1:test (default-test) @ hadoop-yarn-client ---
> [INFO]
> [INFO] -------------------------------------------------------
> [INFO]  T E S T S
> [INFO] -------------------------------------------------------
> [INFO] Running org.apache.hadoop.yarn.client.TestResourceTrackerOnHA
> [ERROR] Tests run: 1, Failures: 0, Errors: 1, Skipped: 0, Time elapsed: 19.612 s <<< FAILURE! - in org.apache.hadoop.yarn.client.TestResourceTrackerOnHA
> [ERROR] testResourceTrackerOnHA(org.apache.hadoop.yarn.client.TestResourceTrackerOnHA)  Time elapsed: 19.473 s  <<< ERROR!
> org.junit.runners.model.TestTimedOutException: test timed out after 15000 milliseconds
> 	at sun.nio.ch.KQueueArrayWrapper.kevent0(Native Method)
> 	at sun.nio.ch.KQueueArrayWrapper.poll(KQueueArrayWrapper.java:198)
> 	at sun.nio.ch.KQueueSelectorImpl.doSelect(KQueueSelectorImpl.java:117)
> 	at sun.nio.ch.SelectorImpl.lockAndDoSelect(SelectorImpl.java:86)
> 	at sun.nio.ch.SelectorImpl.select(SelectorImpl.java:97)
> 	at org.apache.hadoop.net.SocketIOWithTimeout$SelectorPool.select(SocketIOWithTimeout.java:336)
> 	at org.apache.hadoop.net.SocketIOWithTimeout.connect(SocketIOWithTimeout.java:203)
> 	at org.apache.hadoop.net.NetUtils.connect(NetUtils.java:533)
> 	at org.apache.hadoop.ipc.Client$Connection.setupConnection(Client.java:699)
> 	at org.apache.hadoop.ipc.Client$Connection.setupIOstreams(Client.java:812)
> 	at org.apache.hadoop.ipc.Client$Connection.access$3800(Client.java:413)
> 	at org.apache.hadoop.ipc.Client.getConnection(Client.java:1636)
> 	at org.apache.hadoop.ipc.Client.call(Client.java:1452)
> 	at org.apache.hadoop.ipc.Client.call(Client.java:1405)
> 	at org.apache.hadoop.ipc.ProtobufRpcEngine$Invoker.invoke(ProtobufRpcEngine.java:233)
> 	at org.apache.hadoop.ipc.ProtobufRpcEngine$Invoker.invoke(ProtobufRpcEngine.java:118)
> 	at com.sun.proxy.$Proxy93.registerNodeManager(Unknown Source)
> 	at org.apache.hadoop.yarn.server.api.impl.pb.client.ResourceTrackerPBClientImpl.registerNodeManager(ResourceTrackerPBClientImpl.java:73)
> 	at sun.reflect.NativeMethodAccessorImpl.invoke0(Native Method)
> 	at sun.reflect.NativeMethodAccessorImpl.invoke(NativeMethodAccessorImpl.java:62)
> 	at sun.reflect.DelegatingMethodAccessorImpl.invoke(DelegatingMethodAccessorImpl.java:43)
> 	at java.lang.reflect.Method.invoke(Method.java:498)
> 	at org.apache.hadoop.io.retry.RetryInvocationHandler.invokeMethod(RetryInvocationHandler.java:422)
> 	at org.apache.hadoop.io.retry.RetryInvocationHandler$Call.invokeMethod(RetryInvocationHandler.java:165)
> 	at org.apache.hadoop.io.retry.RetryInvocationHandler$Call.invoke(RetryInvocationHandler.java:157)
> 	at org.apache.hadoop.io.retry.RetryInvocationHandler$Call.invokeOnce(RetryInvocationHandler.java:95)
> 	at org.apache.hadoop.io.retry.RetryInvocationHandler.invoke(RetryInvocationHandler.java:359)
> 	at com.sun.proxy.$Proxy94.registerNodeManager(Unknown Source)
> 	at org.apache.hadoop.yarn.client.TestResourceTrackerOnHA.testResourceTrackerOnHA(TestResourceTrackerOnHA.java:64)
> 	at sun.reflect.NativeMethodAccessorImpl.invoke0(Native Method)
> 	at sun.reflect.NativeMethodAccessorImpl.invoke(NativeMethodAccessorImpl.java:62)
> 	at sun.reflect.DelegatingMethodAccessorImpl.invoke(DelegatingMethodAccessorImpl.java:43)
> 	at java.lang.reflect.Method.invoke(Method.java:498)
> 	at org.junit.runners.model.FrameworkMethod$1.runReflectiveCall(FrameworkMethod.java:50)
> 	at org.junit.internal.runners.model.ReflectiveCallable.run(ReflectiveCallable.java:12)
> 	at org.junit.runners.model.FrameworkMethod.invokeExplosively(FrameworkMethod.java:47)
> 	at org.junit.internal.runners.statements.InvokeMethod.evaluate(InvokeMethod.java:17)
> 	at org.apache.zookeeper.JUnit4ZKTestRunner$LoggedInvokeMethod.evaluate(JUnit4ZKTestRunner.java:80)
> 	at org.junit.internal.runners.statements.FailOnTimeout$CallableStatement.call(FailOnTimeout.java:298)
> 	at org.junit.internal.runners.statements.FailOnTimeout$CallableStatement.call(FailOnTimeout.java:292)
> 	at java.util.concurrent.FutureTask.run(FutureTask.java:266)
> 	at java.lang.Thread.run(Thread.java:748)
> [INFO]
> [INFO] Results:
> [INFO]
> [ERROR] Errors:
> [ERROR]   TestResourceTrackerOnHA.testResourceTrackerOnHA:64 ยป TestTimedOut test timed o...
> [INFO]
> [ERROR] Tests run: 1, Failures: 0, Errors: 1, Skipped: 0
> [INFO]
> [ERROR] There are test failures.
> {code}



--
This message was sent by Atlassian Jira
(v8.3.4#803005)

---------------------------------------------------------------------
To unsubscribe, e-mail: yarn-issues-unsubscribe@hadoop.apache.org
For additional commands, e-mail: yarn-issues-help@hadoop.apache.org