You are viewing a plain text version of this content. The canonical link for it is here.
Posted to dev@jmeter.apache.org by Apache Jenkins Server <je...@builds.apache.org> on 2025/10/31 18:19:05 UTC
Build failed in Jenkins: JMeter » JMeter-analysis #557
See <https://ci-builds.apache.org/job/JMeter/job/JMeter-analysis/557/display/redirect?page=changes>
Changes:
[Vladimir Sitnikov] chore: drop xerces:xercesImpl dependency, avoid renovate bumping xml-apis to v2
[Vladimir Sitnikov] chore: add PureJavaReflectionProvider to XStream constructor
[Vladimir Sitnikov] test: JUnit5 does not execute static test methods, so revert static modifiers
------------------------------------------
[...truncated 333.15 KiB...]
> Task :src:dist-check:batchTestHeaderManagerHttpClient4
2025-10-31T18:17:39.448994260Z main WARN The use of package scanning to locate Log4j plugins is deprecated.
Please remove the `packages` attribute from your configuration file.
See https://logging.apache.org/log4j/2.x/faq.html#package-scanning for details.
Creating summariser <summary>
Created the tree successfully using <https://ci-builds.apache.org/job/JMeter/job/JMeter-analysis/ws/bin/testfiles/TestHeaderManager.jmx>
Starting standalone test @ 2025 Oct 31 18:17:40 UTC (1761934660706)
Waiting for possible Shutdown/StopTestNow/HeapDump/ThreadDump message on port 4445
2025-10-31T18:17:41.123659511Z Thread Group 1-1 WARN The use of package scanning to locate Log4j plugins is deprecated.
Please remove the `packages` attribute from your configuration file.
See https://logging.apache.org/log4j/2.x/faq.html#package-scanning for details.
summary = 3 in 00:00:00 = 7.8/s Avg: 13 Min: 1 Max: 37 Err: 0 (0.00%)
Tidying up ... @ 2025 Oct 31 18:17:41 UTC (1761934661332)
... end of run
No errors present in the logfile <https://ci-builds.apache.org/job/JMeter/job/JMeter-analysis/ws/bin/TestHeaderManager.log> (the file is empty)
> Task :src:dist-check:batchTestHeaderManagerJava
2025-10-31T18:17:43.814841184Z main WARN The use of package scanning to locate Log4j plugins is deprecated.
Please remove the `packages` attribute from your configuration file.
See https://logging.apache.org/log4j/2.x/faq.html#package-scanning for details.
Creating summariser <summary>
Created the tree successfully using <https://ci-builds.apache.org/job/JMeter/job/JMeter-analysis/ws/bin/testfiles/TestHeaderManager.jmx>
Starting standalone test @ 2025 Oct 31 18:17:45 UTC (1761934665005)
Waiting for possible Shutdown/StopTestNow/HeapDump/ThreadDump message on port 4445
summary = 3 in 00:00:00 = 15.2/s Avg: 5 Min: 1 Max: 15 Err: 0 (0.00%)
Tidying up ... @ 2025 Oct 31 18:17:45 UTC (1761934665437)
... end of run
No errors present in the logfile <https://ci-builds.apache.org/job/JMeter/job/JMeter-analysis/ws/bin/TestHeaderManager.log> (the file is empty)
> Task :src:dist-check:batchTestKeepAlive SKIPPED
> Task :src:dist-check:batchTestRedirectionPolicies SKIPPED
> Task :src:dist-check:batchTestResultStatusAction
2025-10-31T18:17:47.944771971Z main WARN The use of package scanning to locate Log4j plugins is deprecated.
Please remove the `packages` attribute from your configuration file.
See https://logging.apache.org/log4j/2.x/faq.html#package-scanning for details.
Creating summariser <summary>
Created the tree successfully using <https://ci-builds.apache.org/job/JMeter/job/JMeter-analysis/ws/bin/testfiles/TestResultStatusAction.jmx>
Starting standalone test @ 2025 Oct 31 18:17:49 UTC (1761934669178)
Waiting for possible Shutdown/StopTestNow/HeapDump/ThreadDump message on port 4445
summary = 135 in 00:00:01 = 94.0/s Avg: 1 Min: 0 Max: 148 Err: 18 (13.33%)
Tidying up ... @ 2025 Oct 31 18:17:51 UTC (1761934671249)
... end of run
No errors present in the logfile <https://ci-builds.apache.org/job/JMeter/job/JMeter-analysis/ws/bin/TestResultStatusAction.log> (the file is empty)
> Task :src:dist-check:batchTestSchedulerWithTimer
2025-10-31T18:17:53.727152717Z main WARN The use of package scanning to locate Log4j plugins is deprecated.
Please remove the `packages` attribute from your configuration file.
See https://logging.apache.org/log4j/2.x/faq.html#package-scanning for details.
Creating summariser <summary>
Created the tree successfully using <https://ci-builds.apache.org/job/JMeter/job/JMeter-analysis/ws/bin/testfiles/TestSchedulerWithTimer.jmx>
Starting standalone test @ 2025 Oct 31 18:17:54 UTC (1761934674917)
Waiting for possible Shutdown/StopTestNow/HeapDump/ThreadDump message on port 4445
summary + 5 in 00:00:07 = 0.8/s Avg: 284 Min: 5 Max: 1117 Err: 0 (0.00%) Active: 1 Started: 1 Finished: 0
summary = 5 in 00:00:07 = 0.8/s Avg: 284 Min: 5 Max: 1117 Err: 0 (0.00%)
Tidying up ... @ 2025 Oct 31 18:18:02 UTC (1761934682069)
... end of run
No errors present in the logfile <https://ci-builds.apache.org/job/JMeter/job/JMeter-analysis/ws/bin/TestSchedulerWithTimer.log> (the file is empty)
> Task :src:dist-check:batchTests
> Task :src:dist-check:kaptTestKotlin
> Task :src:dist-check:compileTestKotlin
w: file://<https://ci-builds.apache.org/job/JMeter/job/JMeter-analysis/ws/src/dist-check/src/test/kotlin/org/apache/jmeter/gui/action/HtmlReportGeneratorTest.kt>:116:35 'fun readTree(p0: URL!): JsonNode!' is deprecated. Deprecated in Java.
w: file://<https://ci-builds.apache.org/job/JMeter/job/JMeter-analysis/ws/src/dist-check/src/test/kotlin/org/apache/jmeter/report/dashboard/ReportGeneratorTest.kt>:60:35 'fun readTree(p0: URL!): JsonNode!' is deprecated. Deprecated in Java.
w: file://<https://ci-builds.apache.org/job/JMeter/job/JMeter-analysis/ws/src/dist-check/src/test/kotlin/org/apache/jmeter/report/dashboard/ReportGeneratorTest.kt>:77:35 'fun readTree(p0: URL!): JsonNode!' is deprecated. Deprecated in Java.
> Task :src:dist-check:compileTestJava
> Task :src:dist-check:testClasses
> Task :src:bom:cleanLocalRepository UP-TO-DATE
> Task :src:bom-testing:cleanLocalRepository UP-TO-DATE
> Task :src:core:cleanLocalRepository UP-TO-DATE
> Task :src:functions:cleanLocalRepository UP-TO-DATE
> Task :src:protocol:bolt:cleanLocalRepository UP-TO-DATE
> Task :src:protocol:ftp:cleanLocalRepository UP-TO-DATE
> Task :src:protocol:java:cleanLocalRepository UP-TO-DATE
> Task :src:protocol:http:cleanLocalRepository UP-TO-DATE
> Task :src:protocol:jdbc:cleanLocalRepository UP-TO-DATE
> Task :src:protocol:jms:cleanLocalRepository UP-TO-DATE
> Task :src:protocol:junit-sample:cleanLocalRepository UP-TO-DATE
> Task :src:protocol:junit:cleanLocalRepository UP-TO-DATE
> Task :src:protocol:ldap:cleanLocalRepository UP-TO-DATE
> Task :src:protocol:mail:cleanLocalRepository UP-TO-DATE
> Task :src:protocol:native:cleanLocalRepository UP-TO-DATE
> Task :src:launcher:cleanLocalRepository UP-TO-DATE
> Task :src:components:cleanLocalRepository UP-TO-DATE
> Task :src:config:cleanLocalRepository UP-TO-DATE
> Task :src:jorphan:cleanLocalRepository UP-TO-DATE
> Task :src:bom-thirdparty:cleanLocalRepository UP-TO-DATE
> Task :src:protocol:tcp:cleanLocalRepository UP-TO-DATE
> Task :src:bom:publishMavenJavaPlatformPublicationToTmp-mavenRepository
> Task :src:launcher:publishMavenJavaPublicationToTmp-mavenRepository
> Task :src:protocol:ftp:publishMavenJavaPublicationToTmp-mavenRepository
> Task :src:launcher:publishAllPublicationsToTmp-mavenRepository
> Task :src:bom:publishAllPublicationsToTmp-mavenRepository
> Task :src:protocol:ftp:publishAllPublicationsToTmp-mavenRepository
> Task :src:launcher:assemble
> Task :src:protocol:junit-sample:publishMavenJavaPublicationToTmp-mavenRepository
> Task :src:bom:assemble
> Task :src:protocol:ldap:publishMavenJavaPublicationToTmp-mavenRepository
> Task :src:bom-testing:publishMavenJavaPlatformPublicationToTmp-mavenRepository
> Task :src:protocol:native:publishMavenJavaPublicationToTmp-mavenRepository
> Task :src:protocol:ftp:assemble
> Task :src:bom-testing:publishAllPublicationsToTmp-mavenRepository
> Task :src:protocol:ldap:publishAllPublicationsToTmp-mavenRepository
> Task :src:protocol:native:publishAllPublicationsToTmp-mavenRepository
> Task :src:bom-testing:assemble
> Task :src:protocol:native:assemble
> Task :src:protocol:ldap:assemble
> Task :src:protocol:bolt:publishMavenJavaPublicationToTmp-mavenRepository
> Task :src:protocol:junit:publishMavenJavaPublicationToTmp-mavenRepository
> Task :src:bom-thirdparty:publishMavenJavaPlatformPublicationToTmp-mavenRepository
> Task :src:protocol:junit:publishAllPublicationsToTmp-mavenRepository
> Task :src:bom-thirdparty:publishAllPublicationsToTmp-mavenRepository
> Task :src:bom-thirdparty:assemble
> Task :src:protocol:junit:assemble
> Task :src:protocol:jdbc:publishMavenJavaPublicationToTmp-mavenRepository
> Task :src:config:publishMavenJavaPublicationToTmp-mavenRepository
> Task :src:protocol:junit-sample:publishAllPublicationsToTmp-mavenRepository
> Task :src:protocol:jdbc:publishAllPublicationsToTmp-mavenRepository
> Task :src:config:publishAllPublicationsToTmp-mavenRepository
> Task :src:protocol:bolt:publishAllPublicationsToTmp-mavenRepository
> Task :src:functions:publishMavenJavaPublicationToTmp-mavenRepository
> Task :src:config:assemble
> Task :src:protocol:jdbc:assemble
> Task :src:functions:publishAllPublicationsToTmp-mavenRepository
> Task :src:protocol:bolt:assemble
> Task :src:functions:assemble
> Task :src:protocol:junit-sample:assemble
> Task :src:protocol:jms:publishMavenJavaPublicationToTmp-mavenRepository
> Task :src:protocol:jms:publishAllPublicationsToTmp-mavenRepository
> Task :src:protocol:jms:assemble
> Task :src:protocol:mail:publishMavenJavaPublicationToTmp-mavenRepository
> Task :src:protocol:mail:publishAllPublicationsToTmp-mavenRepository
> Task :src:protocol:mail:assemble
> Task :src:protocol:tcp:publishMavenJavaPublicationToTmp-mavenRepository
> Task :src:protocol:tcp:publishAllPublicationsToTmp-mavenRepository
> Task :src:protocol:tcp:assemble
> Task :src:jorphan:publishMavenJavaPublicationToTmp-mavenRepository
> Task :src:jorphan:publishAllPublicationsToTmp-mavenRepository
> Task :src:jorphan:assemble
> Task :src:protocol:java:publishMavenJavaPublicationToTmp-mavenRepository
> Task :src:protocol:java:publishAllPublicationsToTmp-mavenRepository
> Task :src:protocol:java:assemble
> Task :src:protocol:http:publishMavenJavaPublicationToTmp-mavenRepository
> Task :src:protocol:http:publishAllPublicationsToTmp-mavenRepository
> Task :src:protocol:http:assemble
> Task :src:components:publishMavenJavaPublicationToTmp-mavenRepository
> Task :src:components:publishAllPublicationsToTmp-mavenRepository
> Task :src:components:assemble
> Task :src:core:publishMavenJavaPublicationToTmp-mavenRepository
> Task :src:core:publishAllPublicationsToTmp-mavenRepository
> Task :src:core:assemble
> Task :src:dist-check:test
ThreadGroupLoad STANDARD_ERROR
2025-10-31T18:18:08.352590235Z ForkJoinPool-1-worker-1 WARN The use of package scanning to locate Log4j plugins is deprecated.
Please remove the `packages` attribute from your configuration file.
See https://logging.apache.org/log4j/2.x/faq.html#package-scanning for details.
ThreadGroupLoad STANDARD_OUT
Setting JMeterHome: <https://ci-builds.apache.org/job/JMeter/job/JMeter-analysis/ws/src/dist-check/../../.>
Initializing Properties: ../.././bin/jmeter.properties
JMeterVersion=6.0.0-SNAPSHOT 2c17f5d
java.version=21.0.4
java.vm.name=OpenJDK 64-Bit Server VM
java.vendor=Eclipse Adoptium
java.home=/usr/local/asfpackages/java/adoptium-jdk-21.0.4+7
file.encoding=UTF-8
default encoding=UTF-8
user.home=/home/jenkins
user.dir=<https://ci-builds.apache.org/job/JMeter/job/JMeter-analysis/ws/src/dist-check>
user.language=en
user.region=null
user.country=US
user.variant=
Locale=en_US
java.class.version=65.0
java.awt.headless=null
os.name=Linux
os.version=5.15.0-160-generic
os.arch=amd64
> Task :src:dist-check:spotbugsTest
SpotBugs ended with exit code 1
> Task :src:dist-check:test
[0;1m 12.3sec[0m, org.apache.jorphan.reflect.[0;1mTestClassFinder[0m > [0;1mtestFindClassesThatExtendStringArrayClassOfQArrayTrue()[0m
[0;1m 4.4sec[0m, org.apache.jorphan.reflect.[0;1mTestClassFinder[0m > [0;1mtestFindAnnotatedClasses()[0m
[0;1m 1.6sec[0m, org.apache.jorphan.reflect.[0;1mTestClassFinder[0m > [0;1mtestFindAnnotatedInnerClasses()[0m
[0;1m 19.5sec[0m, 9 completed, 0 failed, 0 skipped, org.apache.jorphan.reflect.TestClassFinder
[0;1m 2.8sec[0m, 138 completed, 0 failed, 0 skipped, org.apache.jmeter.junit.[0;1mJMeterTest[0m > [0;1mrunGUITitle(GuiComponentHolder)[0m
JMeterTest > runSerialTest(Serializable) STANDARD_ERROR
Unable to instantiate org.apache.jmeter.gui.GlobalUndoableEdit for service interface java.io.Serializable, java.lang.NoSuchMethodException: org.apache.jmeter.gui.GlobalUndoableEdit.<init>()
Unable to instantiate org.apache.jmeter.gui.JBooleanPropertyEditor for service interface java.io.Serializable, java.lang.NoSuchMethodException: org.apache.jmeter.gui.JBooleanPropertyEditor.<init>()
Unable to instantiate org.apache.jmeter.gui.logging.LogEventObject for service interface java.io.Serializable, java.lang.NoSuchMethodException: org.apache.jmeter.gui.logging.LogEventObject.<init>()
Unable to instantiate org.apache.jmeter.rmi.RMIServerSocketFactoryImpl for service interface java.io.Serializable, java.lang.NoSuchMethodException: org.apache.jmeter.rmi.RMIServerSocketFactoryImpl.<init>()
Unable to instantiate org.apache.jmeter.rmi.SSLRMIServerSocketFactory for service interface java.io.Serializable, java.lang.NoSuchMethodException: org.apache.jmeter.rmi.SSLRMIServerSocketFactory.<init>()
Unable to instantiate org.apache.jmeter.threads.RemoteThreadsListenerImpl for service interface java.io.Serializable, java.rmi.server.ExportException: Listen failed on port: 0; nested exception is:
java.io.FileNotFoundException: rmi_keystore.jks (No such file or directory)
Unable to instantiate org.apache.jmeter.threads.openmodel.ParserException for service interface java.io.Serializable, java.lang.NoSuchMethodException: org.apache.jmeter.threads.openmodel.ParserException.<init>()
Unable to instantiate org.apache.jmeter.threads.openmodel.TokenizerException for service interface java.io.Serializable, java.lang.NoSuchMethodException: org.apache.jmeter.threads.openmodel.TokenizerException.<init>()
Unable to instantiate org.apache.jmeter.util.LocaleChangeEvent for service interface java.io.Serializable, java.lang.NoSuchMethodException: org.apache.jmeter.util.LocaleChangeEvent.<init>()
[0;34;1mWARNING[0m [0;1m 10.6sec[0m, 1296 completed, 0 failed, [0;34;1m 6[0m skipped, org.apache.jmeter.junit.[0;34;1mJMeterTest[0m
[0;1m 2.1sec[0m, 384 completed, 0 failed, 0 skipped, org.apache.jmeter.testbeans.gui.[0;1mPackageTest[0m > [0;1mrunTest(Class,[0m Locale, ResourceBundle)
[0;1m 2.1sec[0m, 384 completed, 0 failed, 0 skipped, org.apache.jmeter.testbeans.gui.PackageTest
[0;1m 1.8sec[0m, org.apache.jmeter.gui.action.[0;1mHtmlReportGeneratorTest[0m > [0;1mreport[0m generation fails when format does not match and error is reported()
[0;1m 2.8sec[0m, org.apache.jmeter.gui.action.[0;1mHtmlReportGeneratorTest[0m > [0;1mcheck[0m that report generation succeeds and statistic are generated()
[0;1m 4.6sec[0m, 6 completed, 0 failed, 0 skipped, org.apache.jmeter.gui.action.HtmlReportGeneratorTest
[0;34;1mWARNING[0m [0;1m 46.2sec[0m, 2066 completed, 0 failed, [0;34;1m 6[0m skipped, [0;34;1mGradle Test Run :src:dist-check:test[0m
> Task :src:dist-check:check
> Task :sonarqube
Task 'sonarqube' is deprecated. Use 'sonar' instead.
> Task :sonarqube FAILED
[Incubating] Problems report is available at: file://<https://ci-builds.apache.org/job/JMeter/job/JMeter-analysis/ws/build/reports/problems/problems-report.html>
FAILURE: Build failed with an exception.
* What went wrong:
Execution failed for task ':sonarqube'.
> Project not found. Please check the 'sonar.projectKey' and 'sonar.organization' properties, the 'SONAR_TOKEN' environment variable, or contact the project administrator to check the permissions of the user the token belongs to
* Try:
> Run with --stacktrace option to get the stack trace.
> Run with --info or --debug option to get more log output.
> Get more help at https://help.gradle.org.
Deprecated Gradle features were used in this build, making it incompatible with Gradle 9.0.
You can use '--warning-mode all' to show the individual deprecation warnings and determine if they come from your own scripts or plugins.
For more on this, please refer to https://docs.gradle.org/8.14.3/userguide/command_line_interface.html#sec:command_line_warnings in the Gradle documentation.
BUILD FAILED in 19m 25s
629 actionable tasks: 581 executed, 48 up-to-date
See the profiling report at: file://<https://ci-builds.apache.org/job/JMeter/job/JMeter-analysis/ws/build/reports/profile/profile-2025-10-31-18-00-46.html>
A fine-grained performance profile is available: use the --scan option.
Build step 'Invoke Gradle script' changed build result to FAILURE
Build step 'Invoke Gradle script' marked build as failure
Xvfb stopping
Recording test results
[Checks API] No suitable checks publisher found.
Build failed in Jenkins: JMeter » JMeter-analysis #561
Posted by Apache Jenkins Server <je...@builds.apache.org>.
See <https://ci-builds.apache.org/job/JMeter/job/JMeter-analysis/561/display/redirect?page=changes>
Changes:
[Vladimir Sitnikov] chore: remove uses of commons-collect4
[Vladimir Sitnikov] chore: remove core->commons-collections dependency
[Vladimir Sitnikov] test: remove excessive static modifiers from test methods
[Vladimir Sitnikov] chore: remove the use of commons-io and commons-text
------------------------------------------
[...truncated 786.41 KiB...]
[0m [0;0;90mat org.gradle.execution.plan.DefaultExecutionPlan.addEntryTasks(DefaultExecutionPlan.java:121)
[0m [0;0;90mat org.gradle.execution.TaskNameResolvingBuildTaskScheduler.scheduleRequestedTasks(TaskNameResolvingBuildTaskScheduler.java:61)
[0m [0;0;90mat org.gradle.execution.DefaultTasksBuildTaskScheduler.scheduleRequestedTasks(DefaultTasksBuildTaskScheduler.java:72)
[0m [0;0;90mat org.gradle.initialization.DefaultTaskExecutionPreparer.lambda$scheduleRequestedTasks$0(DefaultTaskExecutionPreparer.java:48)
[0m [0;0;90mat org.gradle.internal.Factories$1.create(Factories.java:31)
[0m [0;0;90mat org.gradle.internal.work.DefaultWorkerLeaseService.withReplacedLocks(DefaultWorkerLeaseService.java:359)
[0m [0;0;90mat org.gradle.api.internal.project.DefaultProjectStateRegistry$DefaultBuildProjectRegistry.withMutableStateOfAllProjects(DefaultProjectStateRegistry.java:239)
[0m [0;0;90mat org.gradle.api.internal.project.DefaultProjectStateRegistry$DefaultBuildProjectRegistry.withMutableStateOfAllProjects(DefaultProjectStateRegistry.java:232)
[0m [0;0;90mat org.gradle.initialization.DefaultTaskExecutionPreparer.scheduleRequestedTasks(DefaultTaskExecutionPreparer.java:47)
[0m [0;0;90mat org.gradle.initialization.VintageBuildModelController.lambda$scheduleRequestedTasks$0(VintageBuildModelController.java:76)
[0m [0;0;90mat org.gradle.internal.model.StateTransitionController.lambda$inState$1(StateTransitionController.java:99)
[0m [0;0;90mat org.gradle.internal.model.StateTransitionController.lambda$inState$2(StateTransitionController.java:114)
[0m [0;0;90mat org.gradle.internal.work.DefaultSynchronizer.withLock(DefaultSynchronizer.java:46)
[0m [0;0;90mat org.gradle.internal.model.StateTransitionController.inState(StateTransitionController.java:110)
[0m [0;0;90mat org.gradle.internal.model.StateTransitionController.inState(StateTransitionController.java:98)
[0m [0;0;90mat org.gradle.initialization.VintageBuildModelController.scheduleRequestedTasks(VintageBuildModelController.java:76)
[0m [0;0;90mat org.gradle.internal.build.DefaultBuildLifecycleController$DefaultWorkGraphBuilder.addRequestedTasks(DefaultBuildLifecycleController.java:404)
[0m [0;0;90mat org.gradle.internal.buildtree.DefaultBuildTreeWorkPreparer.lambda$scheduleRequestedTasks$0(DefaultBuildTreeWorkPreparer.java:41)
[0m [0;0;90mat org.gradle.internal.build.DefaultBuildLifecycleController.lambda$populateWorkGraph$7(DefaultBuildLifecycleController.java:189)
[0m [0;0;90mat org.gradle.internal.build.DefaultBuildWorkPreparer.populateWorkGraph(DefaultBuildWorkPreparer.java:42)
[0m [0;0;90mat org.gradle.internal.build.BuildOperationFiringBuildWorkPreparer$PopulateWorkGraph.populateTaskGraph(BuildOperationFiringBuildWorkPreparer.java:106)
[0m [0;0;90mat org.gradle.internal.build.BuildOperationFiringBuildWorkPreparer$PopulateWorkGraph.run(BuildOperationFiringBuildWorkPreparer.java:92)
[0m [0;0;90mat org.gradle.internal.operations.DefaultBuildOperationRunner$1.execute(DefaultBuildOperationRunner.java:30)
[0m [0;0;90mat org.gradle.internal.operations.DefaultBuildOperationRunner$1.execute(DefaultBuildOperationRunner.java:27)
[0m [0;0;90mat org.gradle.internal.operations.DefaultBuildOperationRunner$2.execute(DefaultBuildOperationRunner.java:67)
[0m [0;0;90mat org.gradle.internal.operations.DefaultBuildOperationRunner$2.execute(DefaultBuildOperationRunner.java:60)
[0m [0;0;90mat org.gradle.internal.operations.DefaultBuildOperationRunner.execute(DefaultBuildOperationRunner.java:167)
[0m [0;0;90mat org.gradle.internal.operations.DefaultBuildOperationRunner.execute(DefaultBuildOperationRunner.java:60)
[0m [0;0;90mat org.gradle.internal.operations.DefaultBuildOperationRunner.run(DefaultBuildOperationRunner.java:48)
[0m [0;0;90mat org.gradle.internal.build.BuildOperationFiringBuildWorkPreparer.populateWorkGraph(BuildOperationFiringBuildWorkPreparer.java:67)
[0m [0;0;90mat org.gradle.internal.build.DefaultBuildLifecycleController.lambda$populateWorkGraph$8(DefaultBuildLifecycleController.java:189)
[0m [0;0;90mat org.gradle.internal.model.StateTransitionController.lambda$inState$1(StateTransitionController.java:99)
[0m [0;0;90mat org.gradle.internal.model.StateTransitionController.lambda$inState$2(StateTransitionController.java:114)
[0m [0;0;90mat org.gradle.internal.work.DefaultSynchronizer.withLock(DefaultSynchronizer.java:46)
[0m [0;0;90mat org.gradle.internal.model.StateTransitionController.inState(StateTransitionController.java:110)
[0m [0;0;90mat org.gradle.internal.model.StateTransitionController.inState(StateTransitionController.java:98)
[0m [0;0;90mat org.gradle.internal.build.DefaultBuildLifecycleController.populateWorkGraph(DefaultBuildLifecycleController.java:189)
[0m [0;0;90mat org.gradle.internal.build.DefaultBuildWorkGraphController$DefaultBuildWorkGraph.populateWorkGraph(DefaultBuildWorkGraphController.java:169)
[0m [0;0;90mat org.gradle.composite.internal.DefaultBuildController.populateWorkGraph(DefaultBuildController.java:76)
[0m [0;0;90mat org.gradle.composite.internal.DefaultIncludedBuildTaskGraph$DefaultBuildTreeWorkGraphBuilder.withWorkGraph(DefaultIncludedBuildTaskGraph.java:153)
[0m [0;0;90mat org.gradle.internal.buildtree.DefaultBuildTreeWorkPreparer.lambda$scheduleRequestedTasks$1(DefaultBuildTreeWorkPreparer.java:41)
[0m [0;0;90mat org.gradle.composite.internal.DefaultIncludedBuildTaskGraph$DefaultBuildTreeWorkGraph$1.run(DefaultIncludedBuildTaskGraph.java:209)
[0m [0;0;90mat org.gradle.internal.operations.DefaultBuildOperationRunner$1.execute(DefaultBuildOperationRunner.java:30)
[0m [0;0;90mat org.gradle.internal.operations.DefaultBuildOperationRunner$1.execute(DefaultBuildOperationRunner.java:27)
[0m [0;0;90mat org.gradle.internal.operations.DefaultBuildOperationRunner$2.execute(DefaultBuildOperationRunner.java:67)
[0m [0;0;90mat org.gradle.internal.operations.DefaultBuildOperationRunner$2.execute(DefaultBuildOperationRunner.java:60)
[0m [0;0;90mat org.gradle.internal.operations.DefaultBuildOperationRunner.execute(DefaultBuildOperationRunner.java:167)
[0m [0;0;90mat org.gradle.internal.operations.DefaultBuildOperationRunner.execute(DefaultBuildOperationRunner.java:60)
[0m [0;0;90mat org.gradle.internal.operations.DefaultBuildOperationRunner.run(DefaultBuildOperationRunner.java:48)
[0m [0;0;90mat org.gradle.composite.internal.DefaultIncludedBuildTaskGraph$DefaultBuildTreeWorkGraph.scheduleWork(DefaultIncludedBuildTaskGraph.java:204)
[0m [0;0;90mat org.gradle.internal.buildtree.DefaultBuildTreeWorkPreparer.scheduleRequestedTasks(DefaultBuildTreeWorkPreparer.java:37)
[0m [0;0;90mat org.gradle.internal.cc.impl.VintageBuildTreeWorkController$scheduleAndRunRequestedTasks$1.apply(VintageBuildTreeWorkController.kt:36)
[0m [0;0;90mat org.gradle.internal.cc.impl.VintageBuildTreeWorkController$scheduleAndRunRequestedTasks$1.apply(VintageBuildTreeWorkController.kt:35)
[0m [0;0;90mat org.gradle.composite.internal.DefaultIncludedBuildTaskGraph.withNewWorkGraph(DefaultIncludedBuildTaskGraph.java:112)
[0m [0;0;90mat org.gradle.internal.cc.impl.VintageBuildTreeWorkController.scheduleAndRunRequestedTasks(VintageBuildTreeWorkController.kt:35)
[0m [0;0;90mat org.gradle.internal.buildtree.DefaultBuildTreeLifecycleController.lambda$scheduleAndRunTasks$1(DefaultBuildTreeLifecycleController.java:77)
[0m [0;0;90mat org.gradle.internal.buildtree.DefaultBuildTreeLifecycleController.lambda$runBuild$4(DefaultBuildTreeLifecycleController.java:120)
[0m [0;0;90mat org.gradle.internal.model.StateTransitionController.lambda$transition$6(StateTransitionController.java:169)
[0m [0;0;90mat org.gradle.internal.model.StateTransitionController.doTransition(StateTransitionController.java:266)
[0m [0;0;90mat org.gradle.internal.model.StateTransitionController.lambda$transition$7(StateTransitionController.java:169)
[0m [0;0;90mat org.gradle.internal.work.DefaultSynchronizer.withLock(DefaultSynchronizer.java:46)
[0m [0;0;90mat org.gradle.internal.model.StateTransitionController.transition(StateTransitionController.java:169)
[0m [0;0;90mat org.gradle.internal.buildtree.DefaultBuildTreeLifecycleController.runBuild(DefaultBuildTreeLifecycleController.java:117)
[0m [0;0;90mat org.gradle.internal.buildtree.DefaultBuildTreeLifecycleController.scheduleAndRunTasks(DefaultBuildTreeLifecycleController.java:77)
[0m [0;0;90mat org.gradle.internal.buildtree.DefaultBuildTreeLifecycleController.scheduleAndRunTasks(DefaultBuildTreeLifecycleController.java:72)
[0m [0;0;90mat org.gradle.tooling.internal.provider.ExecuteBuildActionRunner.run(ExecuteBuildActionRunner.java:31)
[0m [0;0;90mat org.gradle.launcher.exec.ChainingBuildActionRunner.run(ChainingBuildActionRunner.java:35)
[0m [0;0;90mat org.gradle.internal.buildtree.ProblemReportingBuildActionRunner.run(ProblemReportingBuildActionRunner.java:49)
[0m [0;0;90mat org.gradle.launcher.exec.BuildOutcomeReportingBuildActionRunner.run(BuildOutcomeReportingBuildActionRunner.java:71)
[0m [0;0;90mat org.gradle.tooling.internal.provider.FileSystemWatchingBuildActionRunner.run(FileSystemWatchingBuildActionRunner.java:135)
[0m [0;0;90mat org.gradle.launcher.exec.BuildCompletionNotifyingBuildActionRunner.run(BuildCompletionNotifyingBuildActionRunner.java:41)
[0m [0;0;90mat org.gradle.launcher.exec.RootBuildLifecycleBuildActionExecutor.lambda$execute$0(RootBuildLifecycleBuildActionExecutor.java:54)
[0m [0;0;90mat org.gradle.composite.internal.DefaultRootBuildState.run(DefaultRootBuildState.java:130)
[0m [0;0;90mat org.gradle.launcher.exec.RootBuildLifecycleBuildActionExecutor.execute(RootBuildLifecycleBuildActionExecutor.java:54)
[0m [0;0;90mat org.gradle.internal.buildtree.InitDeprecationLoggingActionExecutor.execute(InitDeprecationLoggingActionExecutor.java:62)
[0m [0;0;90mat org.gradle.internal.buildtree.InitProblems.execute(InitProblems.java:36)
[0m [0;0;90mat org.gradle.internal.buildtree.DefaultBuildTreeContext.execute(DefaultBuildTreeContext.java:40)
[0m [0;0;90mat org.gradle.launcher.exec.BuildTreeLifecycleBuildActionExecutor.lambda$execute$0(BuildTreeLifecycleBuildActionExecutor.java:71)
[0m [0;0;90mat org.gradle.internal.buildtree.BuildTreeState.run(BuildTreeState.java:60)
[0m [0;0;90mat org.gradle.launcher.exec.BuildTreeLifecycleBuildActionExecutor.execute(BuildTreeLifecycleBuildActionExecutor.java:71)
[0m [0;0;90mat org.gradle.launcher.exec.RunAsBuildOperationBuildActionExecutor$2.call(RunAsBuildOperationBuildActionExecutor.java:67)
[0m [0;0;90mat org.gradle.launcher.exec.RunAsBuildOperationBuildActionExecutor$2.call(RunAsBuildOperationBuildActionExecutor.java:63)
[0m [0;0;90mat org.gradle.internal.operations.DefaultBuildOperationRunner$CallableBuildOperationWorker.execute(DefaultBuildOperationRunner.java:210)
[0m [0;0;90mat org.gradle.internal.operations.DefaultBuildOperationRunner$CallableBuildOperationWorker.execute(DefaultBuildOperationRunner.java:205)
[0m [0;0;90mat org.gradle.internal.operations.DefaultBuildOperationRunner$2.execute(DefaultBuildOperationRunner.java:67)
[0m [0;0;90mat org.gradle.internal.operations.DefaultBuildOperationRunner$2.execute(DefaultBuildOperationRunner.java:60)
[0m [0;0;90mat org.gradle.internal.operations.DefaultBuildOperationRunner.execute(DefaultBuildOperationRunner.java:167)
[0m [0;0;90mat org.gradle.internal.operations.DefaultBuildOperationRunner.execute(DefaultBuildOperationRunner.java:60)
[0m [0;0;90mat org.gradle.internal.operations.DefaultBuildOperationRunner.call(DefaultBuildOperationRunner.java:54)
[0m [0;0;90mat org.gradle.launcher.exec.RunAsBuildOperationBuildActionExecutor.execute(RunAsBuildOperationBuildActionExecutor.java:63)
[0m [0;0;90mat org.gradle.launcher.exec.RunAsWorkerThreadBuildActionExecutor.lambda$execute$0(RunAsWorkerThreadBuildActionExecutor.java:36)
[0m [0;0;90mat org.gradle.internal.work.DefaultWorkerLeaseService.withLocks(DefaultWorkerLeaseService.java:263)
[0m [0;0;90mat org.gradle.internal.work.DefaultWorkerLeaseService.runAsWorkerThread(DefaultWorkerLeaseService.java:127)
[0m [0;0;90mat org.gradle.launcher.exec.RunAsWorkerThreadBuildActionExecutor.execute(RunAsWorkerThreadBuildActionExecutor.java:36)
[0m [0;0;90mat org.gradle.tooling.internal.provider.continuous.ContinuousBuildActionExecutor.execute(ContinuousBuildActionExecutor.java:110)
[0m [0;0;90mat org.gradle.tooling.internal.provider.SubscribableBuildActionExecutor.execute(SubscribableBuildActionExecutor.java:64)
[0m [0;0;90mat org.gradle.internal.session.DefaultBuildSessionContext.execute(DefaultBuildSessionContext.java:46)
[0m [0;0;90mat org.gradle.internal.buildprocess.execution.BuildSessionLifecycleBuildActionExecutor$ActionImpl.apply(BuildSessionLifecycleBuildActionExecutor.java:92)
[0m [0;0;90mat org.gradle.internal.buildprocess.execution.BuildSessionLifecycleBuildActionExecutor$ActionImpl.apply(BuildSessionLifecycleBuildActionExecutor.java:80)
[0m [0;0;90mat org.gradle.internal.session.BuildSessionState.run(BuildSessionState.java:73)
[0m [0;0;90mat org.gradle.internal.buildprocess.execution.BuildSessionLifecycleBuildActionExecutor.execute(BuildSessionLifecycleBuildActionExecutor.java:62)
[0m [0;0;90mat org.gradle.internal.buildprocess.execution.BuildSessionLifecycleBuildActionExecutor.execute(BuildSessionLifecycleBuildActionExecutor.java:41)
[0m [0;0;90mat org.gradle.internal.buildprocess.execution.StartParamsValidatingActionExecutor.execute(StartParamsValidatingActionExecutor.java:64)
[0m [0;0;90mat org.gradle.internal.buildprocess.execution.StartParamsValidatingActionExecutor.execute(StartParamsValidatingActionExecutor.java:32)
[0m [0;0;90mat org.gradle.internal.buildprocess.execution.SessionFailureReportingActionExecutor.execute(SessionFailureReportingActionExecutor.java:51)
[0m [0;0;90mat org.gradle.internal.buildprocess.execution.SessionFailureReportingActionExecutor.execute(SessionFailureReportingActionExecutor.java:39)
[0m [0;0;90mat org.gradle.internal.buildprocess.execution.SetupLoggingActionExecutor.execute(SetupLoggingActionExecutor.java:47)
[0m [0;0;90mat org.gradle.internal.buildprocess.execution.SetupLoggingActionExecutor.execute(SetupLoggingActionExecutor.java:31)
[0m [0;0;90mat org.gradle.launcher.daemon.server.exec.ExecuteBuild.doBuild(ExecuteBuild.java:70)
[0m [0;0;90mat org.gradle.launcher.daemon.server.exec.BuildCommandOnly.execute(BuildCommandOnly.java:37)
[0m [0;0;90mat org.gradle.launcher.daemon.server.api.DaemonCommandExecution.proceed(DaemonCommandExecution.java:104)
[0m [0;0;90mat org.gradle.launcher.daemon.server.exec.WatchForDisconnection.execute(WatchForDisconnection.java:39)
[0m [0;0;90mat org.gradle.launcher.daemon.server.api.DaemonCommandExecution.proceed(DaemonCommandExecution.java:104)
[0m [0;0;90mat org.gradle.launcher.daemon.server.exec.ResetDeprecationLogger.execute(ResetDeprecationLogger.java:29)
[0m [0;0;90mat org.gradle.launcher.daemon.server.api.DaemonCommandExecution.proceed(DaemonCommandExecution.java:104)
[0m [0;0;90mat org.gradle.launcher.daemon.server.exec.RequestStopIfSingleUsedDaemon.execute(RequestStopIfSingleUsedDaemon.java:35)
[0m [0;0;90mat org.gradle.launcher.daemon.server.api.DaemonCommandExecution.proceed(DaemonCommandExecution.java:104)
[0m [0;0;90mat org.gradle.launcher.daemon.server.exec.ForwardClientInput.lambda$execute$0(ForwardClientInput.java:40)
[0m [0;0;90mat org.gradle.internal.daemon.clientinput.ClientInputForwarder.forwardInput(ClientInputForwarder.java:80)
[0m [0;0;90mat org.gradle.launcher.daemon.server.exec.ForwardClientInput.execute(ForwardClientInput.java:37)
[0m [0;0;90mat org.gradle.launcher.daemon.server.api.DaemonCommandExecution.proceed(DaemonCommandExecution.java:104)
[0m [0;0;90mat org.gradle.launcher.daemon.server.exec.LogAndCheckHealth.execute(LogAndCheckHealth.java:53)
[0m [0;0;90mat org.gradle.launcher.daemon.server.api.DaemonCommandExecution.proceed(DaemonCommandExecution.java:104)
[0m [0;0;90mat org.gradle.launcher.daemon.server.exec.LogToClient.doBuild(LogToClient.java:63)
[0m [0;0;90mat org.gradle.launcher.daemon.server.exec.BuildCommandOnly.execute(BuildCommandOnly.java:37)
[0m [0;0;90mat org.gradle.launcher.daemon.server.api.DaemonCommandExecution.proceed(DaemonCommandExecution.java:104)
[0m [0;0;90mat org.gradle.launcher.daemon.server.exec.EstablishBuildEnvironment.doBuild(EstablishBuildEnvironment.java:84)
[0m [0;0;90mat org.gradle.launcher.daemon.server.exec.BuildCommandOnly.execute(BuildCommandOnly.java:37)
[0m [0;0;90mat org.gradle.launcher.daemon.server.api.DaemonCommandExecution.proceed(DaemonCommandExecution.java:104)
[0m [0;0;90mat org.gradle.launcher.daemon.server.exec.StartBuildOrRespondWithBusy$1.run(StartBuildOrRespondWithBusy.java:52)
[0m [0;0;90mat org.gradle.launcher.daemon.server.DaemonStateCoordinator.lambda$runCommand$0(DaemonStateCoordinator.java:321)
[0m [0;0;90mat org.gradle.internal.concurrent.ExecutorPolicy$CatchAndRecordFailures.onExecute(ExecutorPolicy.java:64)
[0m [0;0;90mat org.gradle.internal.concurrent.AbstractManagedExecutor$1.run(AbstractManagedExecutor.java:48)
[0m Caused by: org.gradle.api.internal.artifacts.verification.exceptions.DependencyVerificationException: Dependency verification failed for configuration ':src:dist:detachedConfiguration2':
- On artifact jakarta.jakartaee-bom-9.1.0.pom (jakarta.platform:jakarta.jakartaee-bom:9.1.0) in repository 'MavenRepo': Artifact was signed with key '2B34821418CF19CF1F2A8352953E02E4F573B46F' (Eclipse Jakarta EE Platform <ja...@eclipse.org>) and passed verification but the key isn't in your trusted keys list.
- On artifact jakartaee-api-parent-9.1.0.pom (jakarta.platform:jakartaee-api-parent:9.1.0) in repository 'MavenRepo': Artifact was signed with key '2B34821418CF19CF1F2A8352953E02E4F573B46F' (Eclipse Jakarta EE Platform <ja...@eclipse.org>) and passed verification but the key isn't in your trusted keys list.
- On artifact mockito-bom-4.11.0.pom (org.mockito:mockito-bom:4.11.0) in repository 'MavenRepo': Artifact was signed with key '147B691A19097624902F4EA9689CBE64F4BC997F' (Szczepan Faber <sz...@gmail.com>) and passed verification but the key isn't in your trusted keys list.
- On artifact project-1.0.7.pom (org.eclipse.ee4j:project:1.0.7) in repository 'MavenRepo': Artifact was signed with key 'AA70C7C433D501636392EC02153E7A3C2B4E5118' (Eclipse EE4J Project <ee...@eclipse.org>) and passed verification but the key isn't in your trusted keys list.
If the artifacts are trustworthy, you will need to update the gradle/verification-metadata.xml file. For more on how to do this, please refer to https://docs.gradle.org/8.14.3/userguide/dependency_verification.html#sec:troubleshooting-verification in the Gradle documentation.
These files failed verification:
- GRADLE_USER_HOME/caches/modules-2/files-2.1/jakarta.platform/jakarta.jakartaee-bom/9.1.0/39a915229cabfe6bba43e0566b1a74bf8fe3eefe/jakarta.jakartaee-bom-9.1.0.pom (signature: GRADLE_USER_HOME/caches/modules-2/files-2.1/jakarta.platform/jakarta.jakartaee-bom/9.1.0/c42bffabf41f44605ce49b1a2cedd34ad524ae35/jakarta.jakartaee-bom-9.1.0.pom.asc)
- GRADLE_USER_HOME/caches/modules-2/files-2.1/jakarta.platform/jakartaee-api-parent/9.1.0/e5020a636b3c0cc4c5dd110e17213aaded1d6895/jakartaee-api-parent-9.1.0.pom (signature: GRADLE_USER_HOME/caches/modules-2/files-2.1/jakarta.platform/jakartaee-api-parent/9.1.0/757e0adf815c38b82902bb0a47af7c1a3c9a9fbe/jakartaee-api-parent-9.1.0.pom.asc)
- GRADLE_USER_HOME/caches/modules-2/files-2.1/org.eclipse.ee4j/project/1.0.7/b0f6c4bc691a0b694a377edc9bc4777871647253/project-1.0.7.pom (signature: GRADLE_USER_HOME/caches/modules-2/files-2.1/org.eclipse.ee4j/project/1.0.7/5a25d3a85b128673326ac669f26c14114dac956f/project-1.0.7.pom.asc)
- GRADLE_USER_HOME/caches/modules-2/files-2.1/org.mockito/mockito-bom/4.11.0/1c271051b650e8dd5ae2c9726ee5953887030d/mockito-bom-4.11.0.pom (signature: GRADLE_USER_HOME/caches/modules-2/files-2.1/org.mockito/mockito-bom/4.11.0/8922853080d6eff633ba48d1134160649ee1932/mockito-bom-4.11.0.pom.asc)
GRADLE_USER_HOME = /home/jenkins/.gradle
These files failed verification:
- GRADLE_USER_HOME/caches/modules-2/files-2.1/jakarta.platform/jakarta.jakartaee-bom/9.1.0/39a915229cabfe6bba43e0566b1a74bf8fe3eefe/jakarta.jakartaee-bom-9.1.0.pom (signature: GRADLE_USER_HOME/caches/modules-2/files-2.1/jakarta.platform/jakarta.jakartaee-bom/9.1.0/c42bffabf41f44605ce49b1a2cedd34ad524ae35/jakarta.jakartaee-bom-9.1.0.pom.asc)
- GRADLE_USER_HOME/caches/modules-2/files-2.1/jakarta.platform/jakartaee-api-parent/9.1.0/e5020a636b3c0cc4c5dd110e17213aaded1d6895/jakartaee-api-parent-9.1.0.pom (signature: GRADLE_USER_HOME/caches/modules-2/files-2.1/jakarta.platform/jakartaee-api-parent/9.1.0/757e0adf815c38b82902bb0a47af7c1a3c9a9fbe/jakartaee-api-parent-9.1.0.pom.asc)
- GRADLE_USER_HOME/caches/modules-2/files-2.1/org.eclipse.ee4j/project/1.0.7/b0f6c4bc691a0b694a377edc9bc4777871647253/project-1.0.7.pom (signature: GRADLE_USER_HOME/caches/modules-2/files-2.1/org.eclipse.ee4j/project/1.0.7/5a25d3a85b128673326ac669f26c14114dac956f/project-1.0.7.pom.asc)
- GRADLE_USER_HOME/caches/modules-2/files-2.1/org.mockito/mockito-bom/4.11.0/1c271051b650e8dd5ae2c9726ee5953887030d/mockito-bom-4.11.0.pom (signature: GRADLE_USER_HOME/caches/modules-2/files-2.1/org.mockito/mockito-bom/4.11.0/8922853080d6eff633ba48d1134160649ee1932/mockito-bom-4.11.0.pom.asc)
GRADLE_USER_HOME = /home/jenkins/.gradle
Open this report for more details: file://<https://ci-builds.apache.org/job/JMeter/job/JMeter-analysis/ws/build/reports/dependency-verification/at-1762549299349/dependency-verification-report.html>
[0;0;90mat org.gradle.api.internal.artifacts.ivyservice.ivyresolve.verification.ChecksumAndSignatureVerificationOverride.artifactsAccessed(ChecksumAndSignatureVerificationOverride.java:194)
[0m [0;0;90mat org.gradle.api.internal.artifacts.ivyservice.resolveengine.artifact.ResolvedArtifactSetResolver$1.run(ResolvedArtifactSetResolver.java:69)
[0m [0;0;90mat org.gradle.internal.operations.DefaultBuildOperationRunner$1.execute(DefaultBuildOperationRunner.java:30)
[0m [0;0;90mat org.gradle.internal.operations.DefaultBuildOperationRunner$1.execute(DefaultBuildOperationRunner.java:27)
[0m [0;0;90mat org.gradle.internal.operations.DefaultBuildOperationRunner$2.execute(DefaultBuildOperationRunner.java:67)
[0m [0;0;90mat org.gradle.internal.operations.DefaultBuildOperationRunner$2.execute(DefaultBuildOperationRunner.java:60)
[0m [0;0;90mat org.gradle.internal.operations.DefaultBuildOperationRunner.execute(DefaultBuildOperationRunner.java:167)
[0m [0;0;90mat org.gradle.internal.operations.DefaultBuildOperationRunner.execute(DefaultBuildOperationRunner.java:60)
[0m [0;0;90mat org.gradle.internal.operations.DefaultBuildOperationRunner.run(DefaultBuildOperationRunner.java:48)
[0m [0;0;90mat org.gradle.api.internal.artifacts.ivyservice.resolveengine.artifact.ResolvedArtifactSetResolver.visitArtifacts(ResolvedArtifactSetResolver.java:65)
[0m [0;0;90mat org.gradle.api.internal.artifacts.ivyservice.resolveengine.artifact.ResolvedArtifactSetResolver.lambda$visitInUnmanagedWorkerThread$0(ResolvedArtifactSetResolver.java:61)
[0m [0;0;90mat org.gradle.internal.work.DefaultWorkerLeaseService.runAsUnmanagedWorkerThread(DefaultWorkerLeaseService.java:139)
[0m [0;0;90mat org.gradle.api.internal.artifacts.ivyservice.resolveengine.artifact.ResolvedArtifactSetResolver.visitInUnmanagedWorkerThread(ResolvedArtifactSetResolver.java:61)
[0m [0;0;90mat org.gradle.api.internal.artifacts.ivyservice.resolveengine.artifact.DefaultSelectedArtifactSet.visitArtifacts(DefaultSelectedArtifactSet.java:59)
[0m [0;0;90mat org.gradle.api.internal.artifacts.configurations.ResolutionResultProviderBackedSelectedArtifactSet.visitArtifacts(ResolutionResultProviderBackedSelectedArtifactSet.java:52)
[0m [0;0;90mat org.gradle.api.internal.artifacts.ivyservice.resolveengine.artifact.SelectedArtifactSet.visitFiles(SelectedArtifactSet.java:34)
[0m [0;0;90mat org.gradle.api.internal.artifacts.configurations.ResolutionBackedFileCollection.visitContents(ResolutionBackedFileCollection.java:75)
[0m [0;0;90mat org.gradle.api.internal.file.AbstractFileCollection.visitStructure(AbstractFileCollection.java:361)
[0m [0;0;90mat org.gradle.api.internal.artifacts.configurations.DefaultConfiguration.visitContents(DefaultConfiguration.java:542)
[0m [0;0;90mat org.gradle.api.internal.file.AbstractFileCollection.getFiles(AbstractFileCollection.java:124)
[0m [0;0;90mat org.gradle.api.internal.artifacts.configurations.DefaultConfiguration.resolve(DefaultConfiguration.java:532)
[0m at com.github.gradle.node.NodePlugin.resolveNodeArchiveFile(NodePlugin.kt:205)
at com.github.gradle.node.NodePlugin.access$resolveNodeArchiveFile(NodePlugin.kt:29)
at com.github.gradle.node.NodePlugin$configureNodeSetupTask$1$archiveFileProvider$1.transform(NodePlugin.kt:195)
at com.github.gradle.node.NodePlugin$configureNodeSetupTask$1$archiveFileProvider$1.transform(NodePlugin.kt:29)
[0;0;90mat org.gradle.api.internal.provider.ValueSupplier$Present.transform(ValueSupplier.java:519)
[0m [0;0;90mat org.gradle.api.internal.provider.TransformBackedProvider.mapValue(TransformBackedProvider.java:92)
[0m [0;0;90mat org.gradle.api.internal.provider.TransformBackedProvider.calculateOwnValue(TransformBackedProvider.java:83)
[0m [0;0;90mat org.gradle.api.internal.provider.AbstractMinimalProvider.calculateValue(AbstractMinimalProvider.java:117)
[0m [0;0;90mat org.gradle.api.internal.provider.TransformBackedProvider.calculateOwnValue(TransformBackedProvider.java:82)
[0m [0;0;90mat org.gradle.api.internal.provider.AbstractMinimalProvider.calculateValue(AbstractMinimalProvider.java:117)
[0m [0;0;90mat org.gradle.api.internal.provider.DefaultProperty.calculateValueFrom(DefaultProperty.java:158)
[0m [0;0;90mat org.gradle.api.internal.provider.DefaultProperty.calculateValueFrom(DefaultProperty.java:34)
[0m [0;0;90mat org.gradle.api.internal.provider.AbstractProperty.doCalculateValue(AbstractProperty.java:172)
[0m[0;0;90m ... 148 more
[0m
[Incubating] Problems report is available at: file://<https://ci-builds.apache.org/job/JMeter/job/JMeter-analysis/ws/build/reports/problems/problems-report.html>
FAILURE: Build failed with an exception.
* What went wrong:
Could not determine the dependencies of task ':src:dist:nodeSetup'.
> Failed to query the value of task ':src:dist:nodeSetup' property 'nodeArchiveFile'.
> Dependency verification failed for configuration ':src:dist:detachedConfiguration2':
- On artifact jakarta.jakartaee-bom-9.1.0.pom (jakarta.platform:jakarta.jakartaee-bom:9.1.0) in repository 'MavenRepo': Artifact was signed with key '2B34821418CF19CF1F2A8352953E02E4F573B46F' (Eclipse Jakarta EE Platform <ja...@eclipse.org>) and passed verification but the key isn't in your trusted keys list.
- On artifact jakartaee-api-parent-9.1.0.pom (jakarta.platform:jakartaee-api-parent:9.1.0) in repository 'MavenRepo': Artifact was signed with key '2B34821418CF19CF1F2A8352953E02E4F573B46F' (Eclipse Jakarta EE Platform <ja...@eclipse.org>) and passed verification but the key isn't in your trusted keys list.
- On artifact mockito-bom-4.11.0.pom (org.mockito:mockito-bom:4.11.0) in repository 'MavenRepo': Artifact was signed with key '147B691A19097624902F4EA9689CBE64F4BC997F' (Szczepan Faber <sz...@gmail.com>) and passed verification but the key isn't in your trusted keys list.
- On artifact project-1.0.7.pom (org.eclipse.ee4j:project:1.0.7) in repository 'MavenRepo': Artifact was signed with key 'AA70C7C433D501636392EC02153E7A3C2B4E5118' (Eclipse EE4J Project <ee...@eclipse.org>) and passed verification but the key isn't in your trusted keys list.
If the artifacts are trustworthy, you will need to update the gradle/verification-metadata.xml file. For more on how to do this, please refer to https://docs.gradle.org/8.14.3/userguide/dependency_verification.html#sec:troubleshooting-verification in the Gradle documentation.
These files failed verification:
- GRADLE_USER_HOME/caches/modules-2/files-2.1/jakarta.platform/jakarta.jakartaee-bom/9.1.0/39a915229cabfe6bba43e0566b1a74bf8fe3eefe/jakarta.jakartaee-bom-9.1.0.pom (signature: GRADLE_USER_HOME/caches/modules-2/files-2.1/jakarta.platform/jakarta.jakartaee-bom/9.1.0/c42bffabf41f44605ce49b1a2cedd34ad524ae35/jakarta.jakartaee-bom-9.1.0.pom.asc)
- GRADLE_USER_HOME/caches/modules-2/files-2.1/jakarta.platform/jakartaee-api-parent/9.1.0/e5020a636b3c0cc4c5dd110e17213aaded1d6895/jakartaee-api-parent-9.1.0.pom (signature: GRADLE_USER_HOME/caches/modules-2/files-2.1/jakarta.platform/jakartaee-api-parent/9.1.0/757e0adf815c38b82902bb0a47af7c1a3c9a9fbe/jakartaee-api-parent-9.1.0.pom.asc)
- GRADLE_USER_HOME/caches/modules-2/files-2.1/org.eclipse.ee4j/project/1.0.7/b0f6c4bc691a0b694a377edc9bc4777871647253/project-1.0.7.pom (signature: GRADLE_USER_HOME/caches/modules-2/files-2.1/org.eclipse.ee4j/project/1.0.7/5a25d3a85b128673326ac669f26c14114dac956f/project-1.0.7.pom.asc)
- GRADLE_USER_HOME/caches/modules-2/files-2.1/org.mockito/mockito-bom/4.11.0/1c271051b650e8dd5ae2c9726ee5953887030d/mockito-bom-4.11.0.pom (signature: GRADLE_USER_HOME/caches/modules-2/files-2.1/org.mockito/mockito-bom/4.11.0/8922853080d6eff633ba48d1134160649ee1932/mockito-bom-4.11.0.pom.asc)
GRADLE_USER_HOME = /home/jenkins/.gradle
These files failed verification:
- GRADLE_USER_HOME/caches/modules-2/files-2.1/jakarta.platform/jakarta.jakartaee-bom/9.1.0/39a915229cabfe6bba43e0566b1a74bf8fe3eefe/jakarta.jakartaee-bom-9.1.0.pom (signature: GRADLE_USER_HOME/caches/modules-2/files-2.1/jakarta.platform/jakarta.jakartaee-bom/9.1.0/c42bffabf41f44605ce49b1a2cedd34ad524ae35/jakarta.jakartaee-bom-9.1.0.pom.asc)
- GRADLE_USER_HOME/caches/modules-2/files-2.1/jakarta.platform/jakartaee-api-parent/9.1.0/e5020a636b3c0cc4c5dd110e17213aaded1d6895/jakartaee-api-parent-9.1.0.pom (signature: GRADLE_USER_HOME/caches/modules-2/files-2.1/jakarta.platform/jakartaee-api-parent/9.1.0/757e0adf815c38b82902bb0a47af7c1a3c9a9fbe/jakartaee-api-parent-9.1.0.pom.asc)
- GRADLE_USER_HOME/caches/modules-2/files-2.1/org.eclipse.ee4j/project/1.0.7/b0f6c4bc691a0b694a377edc9bc4777871647253/project-1.0.7.pom (signature: GRADLE_USER_HOME/caches/modules-2/files-2.1/org.eclipse.ee4j/project/1.0.7/5a25d3a85b128673326ac669f26c14114dac956f/project-1.0.7.pom.asc)
- GRADLE_USER_HOME/caches/modules-2/files-2.1/org.mockito/mockito-bom/4.11.0/1c271051b650e8dd5ae2c9726ee5953887030d/mockito-bom-4.11.0.pom (signature: GRADLE_USER_HOME/caches/modules-2/files-2.1/org.mockito/mockito-bom/4.11.0/8922853080d6eff633ba48d1134160649ee1932/mockito-bom-4.11.0.pom.asc)
GRADLE_USER_HOME = /home/jenkins/.gradle
Open this report for more details: file://<https://ci-builds.apache.org/job/JMeter/job/JMeter-analysis/ws/build/reports/dependency-verification/at-1762549299349/dependency-verification-report.html>
* Try:
> Run with --stacktrace option to get the stack trace.
> Run with --info or --debug option to get more log output.
> Get more help at https://help.gradle.org.
Deprecated Gradle features were used in this build, making it incompatible with Gradle 9.0.
You can use '--warning-mode all' to show the individual deprecation warnings and determine if they come from your own scripts or plugins.
For more on this, please refer to https://docs.gradle.org/8.14.3/userguide/command_line_interface.html#sec:command_line_warnings in the Gradle documentation.
BUILD FAILED in 8m 6s
68 actionable tasks: 68 executed
See the profiling report at: file://<https://ci-builds.apache.org/job/JMeter/job/JMeter-analysis/ws/build/reports/profile/profile-2025-11-07-21-02-11.html>
A fine-grained performance profile is available: use the --scan option.
Build step 'Invoke Gradle script' changed build result to FAILURE
Build step 'Invoke Gradle script' marked build as failure
Xvfb stopping
Recording test results
ERROR: Step ‘Publish JUnit test result report’ failed: No test report files were found. Configuration error?
Build failed in Jenkins: JMeter » JMeter-analysis #560
Posted by Apache Jenkins Server <je...@builds.apache.org>.
See <https://ci-builds.apache.org/job/JMeter/job/JMeter-analysis/560/display/redirect?page=changes>
Changes:
[Vladimir Sitnikov] style: refactor MultipartEntityBuilder2 to Java 17 swich expression
[Vladimir Sitnikov] style: fix style for MultipartEntityBuilder2
[Vladimir Sitnikov] style: shorten the URL in MultipartEntityBuilder2's javadoc
[Vladimir Sitnikov] feat: allow to enable/disable individual arguments in HTTP Sampler
[Vladimir Sitnikov] chore: remove core -> org.apache.tika:tika-parsers dependency
[Vladimir Sitnikov] chore: remove uses of commons-codec. Java 17 has both Base64 and HexFormat
[Vladimir Sitnikov] chore: fix nodeSetup vs AutostyleTask buildscript dependency issue
------------------------------------------
[...truncated 335.06 KiB...]
Please remove the `packages` attribute from your configuration file.
See https://logging.apache.org/log4j/2.x/faq.html#package-scanning for details.
Creating summariser <summary>
Created the tree successfully using <https://ci-builds.apache.org/job/JMeter/job/JMeter-analysis/ws/bin/testfiles/TestHeaderManager.jmx>
Starting standalone test @ 2025 Nov 7 12:16:55 UTC (1762517815127)
Waiting for possible Shutdown/StopTestNow/HeapDump/ThreadDump message on port 4445
2025-11-07T12:16:55.602304892Z Thread Group 1-1 WARN The use of package scanning to locate Log4j plugins is deprecated.
Please remove the `packages` attribute from your configuration file.
See https://logging.apache.org/log4j/2.x/faq.html#package-scanning for details.
summary = 3 in 00:00:00 = 6.9/s Avg: 14 Min: 2 Max: 38 Err: 0 (0.00%)
Tidying up ... @ 2025 Nov 7 12:16:55 UTC (1762517815840)
... end of run
No errors present in the logfile <https://ci-builds.apache.org/job/JMeter/job/JMeter-analysis/ws/bin/TestHeaderManager.log> (the file is empty)
> Task :src:dist-check:batchTestHeaderManagerJava
2025-11-07T12:16:58.383110305Z main WARN The use of package scanning to locate Log4j plugins is deprecated.
Please remove the `packages` attribute from your configuration file.
See https://logging.apache.org/log4j/2.x/faq.html#package-scanning for details.
Creating summariser <summary>
Created the tree successfully using <https://ci-builds.apache.org/job/JMeter/job/JMeter-analysis/ws/bin/testfiles/TestHeaderManager.jmx>
Starting standalone test @ 2025 Nov 7 12:16:59 UTC (1762517819639)
Waiting for possible Shutdown/StopTestNow/HeapDump/ThreadDump message on port 4445
summary + 1 in 00:00:00 = 5.1/s Avg: 15 Min: 15 Max: 15 Err: 0 (0.00%) Active: 1 Started: 1 Finished: 0
summary + 2 in 00:00:00 = 125.0/s Avg: 1 Min: 1 Max: 1 Err: 0 (0.00%) Active: 0 Started: 2 Finished: 2
summary = 3 in 00:00:00 = 14.2/s Avg: 5 Min: 1 Max: 15 Err: 0 (0.00%)
Tidying up ... @ 2025 Nov 7 12:17:00 UTC (1762517820089)
... end of run
No errors present in the logfile <https://ci-builds.apache.org/job/JMeter/job/JMeter-analysis/ws/bin/TestHeaderManager.log> (the file is empty)
> Task :src:dist-check:batchTestKeepAlive SKIPPED
> Task :src:dist-check:batchTestRedirectionPolicies SKIPPED
> Task :src:dist-check:batchTestResultStatusAction
2025-11-07T12:17:02.618709883Z main WARN The use of package scanning to locate Log4j plugins is deprecated.
Please remove the `packages` attribute from your configuration file.
See https://logging.apache.org/log4j/2.x/faq.html#package-scanning for details.
Creating summariser <summary>
Created the tree successfully using <https://ci-builds.apache.org/job/JMeter/job/JMeter-analysis/ws/bin/testfiles/TestResultStatusAction.jmx>
Starting standalone test @ 2025 Nov 7 12:17:03 UTC (1762517823883)
Waiting for possible Shutdown/StopTestNow/HeapDump/ThreadDump message on port 4445
summary + 1 in 00:00:01 = 0.8/s Avg: 5 Min: 5 Max: 5 Err: 0 (0.00%) Active: 1 Started: 1 Finished: 0
summary + 134 in 00:00:00 = 323.7/s Avg: 2 Min: 0 Max: 207 Err: 18 (13.43%) Active: 0 Started: 4 Finished: 4
summary = 135 in 00:00:02 = 84.6/s Avg: 2 Min: 0 Max: 207 Err: 18 (13.33%)
Tidying up ... @ 2025 Nov 7 12:17:06 UTC (1762517826159)
... end of run
No errors present in the logfile <https://ci-builds.apache.org/job/JMeter/job/JMeter-analysis/ws/bin/TestResultStatusAction.log> (the file is empty)
> Task :src:dist-check:batchTestSchedulerWithTimer
2025-11-07T12:17:08.729290437Z main WARN The use of package scanning to locate Log4j plugins is deprecated.
Please remove the `packages` attribute from your configuration file.
See https://logging.apache.org/log4j/2.x/faq.html#package-scanning for details.
Creating summariser <summary>
Created the tree successfully using <https://ci-builds.apache.org/job/JMeter/job/JMeter-analysis/ws/bin/testfiles/TestSchedulerWithTimer.jmx>
Starting standalone test @ 2025 Nov 7 12:17:10 UTC (1762517830052)
Waiting for possible Shutdown/StopTestNow/HeapDump/ThreadDump message on port 4445
summary = 5 in 00:00:07 = 0.8/s Avg: 291 Min: 5 Max: 1134 Err: 0 (0.00%)
Tidying up ... @ 2025 Nov 7 12:17:17 UTC (1762517837262)
... end of run
No errors present in the logfile <https://ci-builds.apache.org/job/JMeter/job/JMeter-analysis/ws/bin/TestSchedulerWithTimer.log> (the file is empty)
> Task :src:dist-check:batchTests
> Task :src:dist-check:compileTestKotlin
w: file://<https://ci-builds.apache.org/job/JMeter/job/JMeter-analysis/ws/src/dist-check/src/test/kotlin/org/apache/jmeter/gui/action/HtmlReportGeneratorTest.kt>:116:35 'fun readTree(p0: URL!): JsonNode!' is deprecated. Deprecated in Java.
w: file://<https://ci-builds.apache.org/job/JMeter/job/JMeter-analysis/ws/src/dist-check/src/test/kotlin/org/apache/jmeter/report/dashboard/ReportGeneratorTest.kt>:60:35 'fun readTree(p0: URL!): JsonNode!' is deprecated. Deprecated in Java.
w: file://<https://ci-builds.apache.org/job/JMeter/job/JMeter-analysis/ws/src/dist-check/src/test/kotlin/org/apache/jmeter/report/dashboard/ReportGeneratorTest.kt>:77:35 'fun readTree(p0: URL!): JsonNode!' is deprecated. Deprecated in Java.
> Task :src:dist-check:compileTestJava
> Task :src:dist-check:testClasses
> Task :src:config:cleanLocalRepository
> Task :src:launcher:cleanLocalRepository
> Task :src:protocol:junit-sample:cleanLocalRepository
> Task :src:protocol:bolt:cleanLocalRepository
> Task :src:jorphan:cleanLocalRepository
> Task :src:protocol:java:cleanLocalRepository
> Task :src:protocol:ftp:cleanLocalRepository
> Task :src:protocol:jdbc:cleanLocalRepository
> Task :src:protocol:jms:cleanLocalRepository
> Task :src:protocol:junit:cleanLocalRepository
> Task :src:bom:cleanLocalRepository
> Task :src:functions:cleanLocalRepository
> Task :src:components:cleanLocalRepository
> Task :src:bom-thirdparty:cleanLocalRepository
> Task :src:bom-testing:cleanLocalRepository
> Task :src:protocol:native:cleanLocalRepository
> Task :src:protocol:ldap:cleanLocalRepository
> Task :src:protocol:mail:cleanLocalRepository
> Task :src:protocol:tcp:cleanLocalRepository
> Task :src:protocol:http:cleanLocalRepository
> Task :src:core:cleanLocalRepository
> Task :src:bom:publishMavenJavaPlatformPublicationToTmp-mavenRepository
> Task :src:bom-testing:publishMavenJavaPlatformPublicationToTmp-mavenRepository
> Task :src:bom-thirdparty:publishMavenJavaPlatformPublicationToTmp-mavenRepository
> Task :src:bom:publishAllPublicationsToTmp-mavenRepository
> Task :src:bom-thirdparty:publishAllPublicationsToTmp-mavenRepository
> Task :src:bom-testing:publishAllPublicationsToTmp-mavenRepository
> Task :src:bom:assemble
> Task :src:bom-thirdparty:assemble
> Task :src:bom-testing:assemble
> Task :src:protocol:http:publishMavenJavaPublicationToTmp-mavenRepository
> Task :src:protocol:http:publishAllPublicationsToTmp-mavenRepository
> Task :src:protocol:http:assemble
> Task :src:core:publishMavenJavaPublicationToTmp-mavenRepository
> Task :src:core:publishAllPublicationsToTmp-mavenRepository
> Task :src:core:assemble
> Task :src:protocol:jms:publishMavenJavaPublicationToTmp-mavenRepository
> Task :src:protocol:jms:publishAllPublicationsToTmp-mavenRepository
> Task :src:protocol:jms:assemble
> Task :src:protocol:junit:publishMavenJavaPublicationToTmp-mavenRepository
> Task :src:protocol:junit:publishAllPublicationsToTmp-mavenRepository
> Task :src:protocol:junit:assemble
> Task :src:protocol:native:publishMavenJavaPublicationToTmp-mavenRepository
> Task :src:protocol:native:publishAllPublicationsToTmp-mavenRepository
> Task :src:protocol:native:assemble
> Task :src:functions:publishMavenJavaPublicationToTmp-mavenRepository
> Task :src:functions:publishAllPublicationsToTmp-mavenRepository
> Task :src:functions:assemble
> Task :src:components:publishMavenJavaPublicationToTmp-mavenRepository
> Task :src:components:publishAllPublicationsToTmp-mavenRepository
> Task :src:components:assemble
> Task :src:protocol:java:publishMavenJavaPublicationToTmp-mavenRepository
> Task :src:protocol:java:publishAllPublicationsToTmp-mavenRepository
> Task :src:protocol:java:assemble
> Task :src:protocol:bolt:publishMavenJavaPublicationToTmp-mavenRepository
> Task :src:protocol:bolt:publishAllPublicationsToTmp-mavenRepository
> Task :src:protocol:bolt:assemble
> Task :src:jorphan:publishMavenJavaPublicationToTmp-mavenRepository
> Task :src:jorphan:publishAllPublicationsToTmp-mavenRepository
> Task :src:jorphan:assemble
> Task :src:protocol:mail:publishMavenJavaPublicationToTmp-mavenRepository
> Task :src:protocol:mail:publishAllPublicationsToTmp-mavenRepository
> Task :src:protocol:mail:assemble
> Task :src:protocol:ldap:publishMavenJavaPublicationToTmp-mavenRepository
> Task :src:protocol:ldap:publishAllPublicationsToTmp-mavenRepository
> Task :src:protocol:ldap:assemble
> Task :src:protocol:ftp:publishMavenJavaPublicationToTmp-mavenRepository
> Task :src:protocol:ftp:publishAllPublicationsToTmp-mavenRepository
> Task :src:protocol:ftp:assemble
> Task :src:protocol:tcp:publishMavenJavaPublicationToTmp-mavenRepository
> Task :src:protocol:tcp:publishAllPublicationsToTmp-mavenRepository
> Task :src:protocol:tcp:assemble
> Task :src:launcher:publishMavenJavaPublicationToTmp-mavenRepository
> Task :src:launcher:publishAllPublicationsToTmp-mavenRepository
> Task :src:launcher:assemble
> Task :src:protocol:junit-sample:publishMavenJavaPublicationToTmp-mavenRepository
> Task :src:protocol:junit-sample:publishAllPublicationsToTmp-mavenRepository
> Task :src:protocol:junit-sample:assemble
> Task :src:protocol:jdbc:publishMavenJavaPublicationToTmp-mavenRepository
> Task :src:protocol:jdbc:publishAllPublicationsToTmp-mavenRepository
> Task :src:protocol:jdbc:assemble
> Task :src:config:publishMavenJavaPublicationToTmp-mavenRepository
> Task :src:config:publishAllPublicationsToTmp-mavenRepository
> Task :src:config:assemble
> Task :src:dist-check:test
ThreadGroupLoad STANDARD_ERROR
2025-11-07T12:17:23.337816635Z ForkJoinPool-1-worker-1 WARN The use of package scanning to locate Log4j plugins is deprecated.
Please remove the `packages` attribute from your configuration file.
See https://logging.apache.org/log4j/2.x/faq.html#package-scanning for details.
ThreadGroupLoad STANDARD_OUT
Setting JMeterHome: <https://ci-builds.apache.org/job/JMeter/job/JMeter-analysis/ws/src/dist-check/../../.>
Initializing Properties: ../.././bin/jmeter.properties
JMeterVersion=6.0.0-SNAPSHOT 22349fd
java.version=21.0.4
java.vm.name=OpenJDK 64-Bit Server VM
java.vendor=Eclipse Adoptium
java.home=/usr/local/asfpackages/java/adoptium-jdk-21.0.4+7
file.encoding=UTF-8
default encoding=UTF-8
user.home=/home/jenkins
user.dir=<https://ci-builds.apache.org/job/JMeter/job/JMeter-analysis/ws/src/dist-check>
user.language=en
user.region=null
user.country=US
user.variant=
Locale=en_US
java.class.version=65.0
java.awt.headless=null
os.name=Linux
os.version=5.15.0-157-generic
os.arch=amd64
> Task :src:dist-check:spotbugsTest
SpotBugs ended with exit code 1
> Task :src:dist-check:test
[0;1m 12.5sec[0m, org.apache.jorphan.reflect.[0;1mTestClassFinder[0m > [0;1mtestFindClassesThatExtendStringArrayClassOfQArrayTrue()[0m
[0;1m 3.6sec[0m, org.apache.jorphan.reflect.[0;1mTestClassFinder[0m > [0;1mtestFindAnnotatedClasses()[0m
[0;1m 1.3sec[0m, org.apache.jorphan.reflect.[0;1mTestClassFinder[0m > [0;1mtestFindAnnotatedInnerClasses()[0m
[0;1m 18.3sec[0m, 9 completed, 0 failed, 0 skipped, org.apache.jorphan.reflect.TestClassFinder
[0;1m 2.8sec[0m, 138 completed, 0 failed, 0 skipped, org.apache.jmeter.junit.[0;1mJMeterTest[0m > [0;1mrunGUITitle(GuiComponentHolder)[0m
JMeterTest > runSerialTest(Serializable) STANDARD_ERROR
Unable to instantiate org.apache.jmeter.gui.GlobalUndoableEdit for service interface java.io.Serializable, java.lang.NoSuchMethodException: org.apache.jmeter.gui.GlobalUndoableEdit.<init>()
Unable to instantiate org.apache.jmeter.gui.JBooleanPropertyEditor for service interface java.io.Serializable, java.lang.NoSuchMethodException: org.apache.jmeter.gui.JBooleanPropertyEditor.<init>()
Unable to instantiate org.apache.jmeter.gui.logging.LogEventObject for service interface java.io.Serializable, java.lang.NoSuchMethodException: org.apache.jmeter.gui.logging.LogEventObject.<init>()
Unable to instantiate org.apache.jmeter.rmi.RMIServerSocketFactoryImpl for service interface java.io.Serializable, java.lang.NoSuchMethodException: org.apache.jmeter.rmi.RMIServerSocketFactoryImpl.<init>()
Unable to instantiate org.apache.jmeter.rmi.SSLRMIServerSocketFactory for service interface java.io.Serializable, java.lang.NoSuchMethodException: org.apache.jmeter.rmi.SSLRMIServerSocketFactory.<init>()
Unable to instantiate org.apache.jmeter.threads.RemoteThreadsListenerImpl for service interface java.io.Serializable, java.rmi.server.ExportException: Listen failed on port: 0; nested exception is:
java.io.FileNotFoundException: rmi_keystore.jks (No such file or directory)
Unable to instantiate org.apache.jmeter.threads.openmodel.ParserException for service interface java.io.Serializable, java.lang.NoSuchMethodException: org.apache.jmeter.threads.openmodel.ParserException.<init>()
Unable to instantiate org.apache.jmeter.threads.openmodel.TokenizerException for service interface java.io.Serializable, java.lang.NoSuchMethodException: org.apache.jmeter.threads.openmodel.TokenizerException.<init>()
Unable to instantiate org.apache.jmeter.util.LocaleChangeEvent for service interface java.io.Serializable, java.lang.NoSuchMethodException: org.apache.jmeter.util.LocaleChangeEvent.<init>()
[0;34;1mWARNING[0m [0;1m 10.6sec[0m, 1296 completed, 0 failed, [0;34;1m 6[0m skipped, org.apache.jmeter.junit.[0;34;1mJMeterTest[0m
[0;1m 2.0sec[0m, 384 completed, 0 failed, 0 skipped, org.apache.jmeter.testbeans.gui.[0;1mPackageTest[0m > [0;1mrunTest(Class,[0m Locale, ResourceBundle)
[0;1m 2.0sec[0m, 384 completed, 0 failed, 0 skipped, org.apache.jmeter.testbeans.gui.PackageTest
[0;1m 1.8sec[0m, org.apache.jmeter.gui.action.[0;1mHtmlReportGeneratorTest[0m > [0;1mreport[0m generation fails when format does not match and error is reported()
[0;1m 2.9sec[0m, org.apache.jmeter.gui.action.[0;1mHtmlReportGeneratorTest[0m > [0;1mcheck[0m that report generation succeeds and statistic are generated()
[0;1m 4.7sec[0m, 6 completed, 0 failed, 0 skipped, org.apache.jmeter.gui.action.HtmlReportGeneratorTest
[0;34;1mWARNING[0m [0;1m 44.9sec[0m, 2066 completed, 0 failed, [0;34;1m 6[0m skipped, [0;34;1mGradle Test Run :src:dist-check:test[0m
> Task :src:dist-check:check
> Task :sonarqube
Task 'sonarqube' is deprecated. Use 'sonar' instead.
> Task :sonarqube FAILED
[Incubating] Problems report is available at: file://<https://ci-builds.apache.org/job/JMeter/job/JMeter-analysis/ws/build/reports/problems/problems-report.html>
FAILURE: Build failed with an exception.
* What went wrong:
Execution failed for task ':sonarqube'.
> Project not found. Please check the 'sonar.projectKey' and 'sonar.organization' properties, the 'SONAR_TOKEN' environment variable, or contact the project administrator to check the permissions of the user the token belongs to
* Try:
> Run with --stacktrace option to get the stack trace.
> Run with --info or --debug option to get more log output.
> Get more help at https://help.gradle.org.
Deprecated Gradle features were used in this build, making it incompatible with Gradle 9.0.
You can use '--warning-mode all' to show the individual deprecation warnings and determine if they come from your own scripts or plugins.
For more on this, please refer to https://docs.gradle.org/8.14.3/userguide/command_line_interface.html#sec:command_line_warnings in the Gradle documentation.
BUILD FAILED in 15m 41s
632 actionable tasks: 458 executed, 174 up-to-date
See the profiling report at: file://<https://ci-builds.apache.org/job/JMeter/job/JMeter-analysis/ws/build/reports/profile/profile-2025-11-07-12-03-01.html>
A fine-grained performance profile is available: use the --scan option.
Build step 'Invoke Gradle script' changed build result to FAILURE
Build step 'Invoke Gradle script' marked build as failure
Xvfb stopping
Recording test results
[Checks API] No suitable checks publisher found.
Build failed in Jenkins: JMeter » JMeter-analysis #559
Posted by Apache Jenkins Server <je...@builds.apache.org>.
See <https://ci-builds.apache.org/job/JMeter/job/JMeter-analysis/559/display/redirect?page=changes>
Changes:
[Vladimir Sitnikov] chore: deliver fonts from Apache website rather than 3rd party CDN
[Vladimir Sitnikov] issue#556: Avoid adding "; charset=" for multipart/form-data requests
------------------------------------------
[...truncated 29.24 KiB...]
> Task :src:protocol:junit-sample:cleanTest UP-TO-DATE
> Task :src:examples:cleanTest UP-TO-DATE
> Task :src:protocol:jms:cleanTest UP-TO-DATE
> Task :src:testkit:cleanTest UP-TO-DATE
> Task :src:generator:cleanTest UP-TO-DATE
> Task :src:launcher:cleanTest UP-TO-DATE
> Task :src:components:checkKotlinGradlePluginConfigurationErrors SKIPPED
> Task :src:jorphan:cleanTest UP-TO-DATE
> Task :src:bshclient:cleanTest UP-TO-DATE
> Task :src:protocol:ftp:cleanTest UP-TO-DATE
> Task :src:protocol:java:cleanTest UP-TO-DATE
> Task :src:protocol:ldap:cleanTest UP-TO-DATE
> Task :cleanTest UP-TO-DATE
> Task :src:core:cleanTest UP-TO-DATE
> Task :src:protocol:http:cleanTest UP-TO-DATE
> Task :src:dist:cleanTest UP-TO-DATE
> Task :src:protocol:jdbc:cleanTest UP-TO-DATE
> Task :src:protocol:junit:cleanTest UP-TO-DATE
> Task :src:test-services:cleanTest UP-TO-DATE
> Task :src:protocol:bolt:checkKotlinGradlePluginConfigurationErrors SKIPPED
> Task :src:protocol:tcp:cleanTest UP-TO-DATE
> Task :src:protocol:mail:cleanTest UP-TO-DATE
> Task :src:jorphan:checkKotlinGradlePluginConfigurationErrors SKIPPED
> Task :src:protocol:java:checkKotlinGradlePluginConfigurationErrors SKIPPED
> Task :src:bom-testing:check UP-TO-DATE
> Task :src:core:checkKotlinGradlePluginConfigurationErrors SKIPPED
> Task :src:licenses:check UP-TO-DATE
> Task :src:bom-thirdparty:check UP-TO-DATE
> Task :src:functions:checkKotlinGradlePluginConfigurationErrors SKIPPED
> Task :src:bom:check UP-TO-DATE
> Task :src:protocol:jdbc:checkKotlinGradlePluginConfigurationErrors SKIPPED
> Task :src:test-services:checkKotlinGradlePluginConfigurationErrors SKIPPED
> Task :src:protocol:native:cleanTest UP-TO-DATE
> Task :src:protocol:http:checkKotlinGradlePluginConfigurationErrors SKIPPED
> Task :src:protocol:native:processResources NO-SOURCE
> Task :src:protocol:tcp:processResources NO-SOURCE
> Task :src:protocol:junit-sample:processResources NO-SOURCE
> Task :src:protocol:ldap:processResources NO-SOURCE
> Task :src:generator:processResources NO-SOURCE
> Task :src:protocol:junit:processResources NO-SOURCE
> Task :src:protocol:jms:processResources NO-SOURCE
> Task :src:protocol:mail:processResources UP-TO-DATE
> Task :src:protocol:ftp:processResources NO-SOURCE
> Task :src:config:compileJava NO-SOURCE
> Task :src:protocol:java:processResources UP-TO-DATE
> Task :src:functions:processResources UP-TO-DATE
> Task :src:protocol:bolt:processResources UP-TO-DATE
> Task :src:protocol:jdbc:processResources UP-TO-DATE
> Task :src:protocol:http:processResources UP-TO-DATE
> Task :src:core:versionClass
> Task :src:config:processResources NO-SOURCE
> Task :src:protocol:junit-sample:autostyleConfigsProcess NO-SOURCE
> Task :src:config:classes UP-TO-DATE
> Task :src:protocol:junit-sample:autostyleConfigsCheck NO-SOURCE
> Task :src:config:autostyleConfigsProcess NO-SOURCE
> Task :src:config:autostyleConfigsCheck NO-SOURCE
> Task :src:config:autostyleJavaProcess NO-SOURCE
> Task :src:config:autostyleJavaCheck NO-SOURCE
> Task :src:generator:autostyleConfigsProcess NO-SOURCE
> Task :src:dist:autostyleConfigsProcess NO-SOURCE
> Task :src:test-services:autostyleConfigsProcess NO-SOURCE
> Task :src:protocol:junit:autostyleConfigsProcess NO-SOURCE
> Task :src:dist:autostyleConfigsCheck NO-SOURCE
> Task :src:generator:autostyleConfigsCheck NO-SOURCE
> Task :src:test-services:autostyleConfigsCheck NO-SOURCE
> Task :src:protocol:jms:autostyleConfigsProcess NO-SOURCE
> Task :src:protocol:junit:autostyleConfigsCheck NO-SOURCE
> Task :src:protocol:jms:autostyleConfigsCheck NO-SOURCE
> Task :src:dist:autostyleJavaProcess NO-SOURCE
> Task :src:dist:autostyleJavaCheck NO-SOURCE
> Task :src:protocol:ftp:autostyleConfigsProcess NO-SOURCE
> Task :src:test-services:autostyleJavaProcess NO-SOURCE
> Task :src:test-services:autostyleJavaCheck NO-SOURCE
> Task :src:protocol:ftp:autostyleConfigsCheck NO-SOURCE
> Task :src:components:processResources UP-TO-DATE
> Task :src:functions:autostyleConfigsProcess
> Task :src:examples:autostyleConfigsProcess
> Task :src:protocol:bolt:autostyleConfigsProcess
> Task :src:functions:autostyleConfigsCheck NO-SOURCE
> Task :src:examples:autostyleConfigsCheck NO-SOURCE
> Task :src:protocol:bolt:autostyleConfigsCheck NO-SOURCE
> Task :src:protocol:http:autostyleConfigsProcess
> Task :src:protocol:http:autostyleConfigsCheck NO-SOURCE
> Task :src:generator:autostyleJavaProcess
> Task :src:generator:autostyleJavaCheck NO-SOURCE
> Task :src:protocol:jdbc:autostyleConfigsProcess
> Task :src:protocol:jdbc:autostyleConfigsCheck NO-SOURCE
> Task :src:core:processResources UP-TO-DATE
> Task :src:protocol:junit-sample:autostyleJavaProcess
> Task :src:protocol:junit-sample:autostyleJavaCheck NO-SOURCE
> Task :src:protocol:junit:autostyleJavaProcess
> Task :src:protocol:junit:autostyleJavaCheck NO-SOURCE
> Task :src:examples:autostyleJavaProcess
> Task :src:examples:autostyleJavaCheck NO-SOURCE
> Task :src:protocol:java:autostyleConfigsProcess
> Task :src:protocol:java:autostyleConfigsCheck NO-SOURCE
> Task :src:protocol:ftp:autostyleJavaProcess
> Task :src:protocol:ftp:autostyleJavaCheck NO-SOURCE
> Task :src:core:processTestFixturesResources UP-TO-DATE
> Task :gitProps
> Task :checkKotlinGradlePluginConfigurationErrors SKIPPED
> Task :src:protocol:bolt:autostyleJavaProcess
> Task :src:protocol:bolt:autostyleJavaCheck NO-SOURCE
> Task :src:components:autostyleConfigsProcess
> Task :src:components:autostyleConfigsCheck NO-SOURCE
> Task :src:protocol:jms:autostyleJavaProcess
> Task :src:protocol:jms:autostyleJavaCheck NO-SOURCE
> Task :src:protocol:jdbc:autostyleJavaProcess
> Task :src:protocol:jdbc:autostyleJavaCheck NO-SOURCE
> Task :src:protocol:java:autostyleJavaProcess
> Task :src:protocol:java:autostyleJavaCheck NO-SOURCE
> Task :compileKotlin NO-SOURCE
> Task :compileJava NO-SOURCE
> Task :src:licenses:gatherSourceLicenses
> Task :processResources NO-SOURCE
> Task :classes UP-TO-DATE
> Task :src:functions:autostyleJavaProcess
> Task :src:functions:autostyleJavaCheck NO-SOURCE
> Task :jar UP-TO-DATE
> Task :compileTestKotlin NO-SOURCE
> Task :compileTestJava NO-SOURCE
> Task :processTestResources NO-SOURCE
> Task :testClasses UP-TO-DATE
> Task :test NO-SOURCE
> Task :src:protocol:ldap:autostyleConfigsProcess NO-SOURCE
> Task :src:protocol:ldap:autostyleConfigsCheck NO-SOURCE
> Task :src:protocol:ldap:autostyleJavaProcess
> Task :src:protocol:ldap:autostyleJavaCheck NO-SOURCE
> Task :src:licenses:renderLicenseForSource
Dependencies of license category B are not allowed for SOURCE artifacts
=======================================================================
CC-BY-SA-3.0
* openiconlibrary:openiconlibrary:
OFL-1.1
* font-awesome-font:font-awesome-font:4.2.0
> Task :src:licenses:renderLicenseForSourceCopySpec
> Task :src:licenses:srcLicenseDir UP-TO-DATE
> Task :src:protocol:mail:autostyleConfigsProcess NO-SOURCE
> Task :src:protocol:mail:autostyleConfigsCheck NO-SOURCE
> Task :src:protocol:mail:autostyleJavaProcess
> Task :src:protocol:mail:autostyleJavaCheck NO-SOURCE
> Task :src:protocol:http:autostyleJavaProcess
> Task :src:protocol:http:autostyleJavaCheck FAILED
> Task :src:core:autostyleConfigsProcess
> Task :src:components:autostyleJavaProcess
> Task :src:dist-check:populateLibs
> Task :src:protocol:junit:autostyleKotlinGradleProcess
> Task :src:protocol:jms:autostyleKotlinGradleProcess
> Task :src:protocol:ftp:autostyleKotlinGradleProcess
> Task :src:examples:autostyleKotlinGradleProcess
> Task :src:generator:autostyleKotlinGradleProcess
> Task :src:protocol:junit-sample:autostyleKotlinGradleProcess
> Task :src:protocol:ldap:autostyleKotlinGradleProcess
> Task :src:protocol:mail:autostyleKotlinGradleProcess
> Task :src:config:autostyleKotlinGradleProcess
> Task :src:protocol:java:autostyleKotlinProcess
> Task :src:protocol:jdbc:autostyleKotlinProcess
> Task :src:protocol:bolt:autostyleKotlinProcess
> Task :src:test-services:autostyleKotlinProcess
> Task :src:functions:autostyleKotlinProcess
> Task :src:dist:autostyleKotlinGradleProcess
> Task :src:bshclient:compileJava
> Task :src:testkit:compileJava
> Task :src:testkit-wiremock:compileJava
> Task :src:launcher:compileJava
> Task :src:jorphan:kaptGenerateStubsKotlin
w: API version 1.9 is deprecated and its support will be removed in a future version of Kotlin
[Incubating] Problems report is available at: file://<https://ci-builds.apache.org/job/JMeter/job/JMeter-analysis/ws/build/reports/problems/problems-report.html>
FAILURE: Build failed with an exception.
* What went wrong:
Execution failed for task ':src:protocol:http:autostyleJavaCheck'.
> The following files have format violations:
src/main/java/org/apache/http/entity/mime/MultipartEntityBuilder2.java
@@ -1,28 +1,18 @@
/*
-·*·====================================================================␊
-·*·Licensed·to·the·Apache·Software·Foundation·(ASF)·under·one␊
-·*·or·more·contributor·license·agreements.··See·the·NOTICE·file␊
-·*·distributed·with·this·work·for·additional·information␊
-·*·regarding·copyright·ownership.··The·ASF·licenses·this·file␊
-·*·to·you·under·the·Apache·License,·Version·2.0·(the␊
-·*·"License");·you·may·not·use·this·file·except·in·compliance␊
-·*·with·the·License.··You·may·obtain·a·copy·of·the·License·at␊
+·*·Licensed·to·the·Apache·Software·Foundation·(ASF)·under·one·or·more␊
+·*·contributor·license·agreements.··See·the·NOTICE·file·distributed·with␊
+·*·this·work·for·additional·information·regarding·copyright·ownership.␊
+·*·The·ASF·licenses·this·file·to·you·under·the·Apache·License,·Version·2.0␊
+·*·(the·"License");·you·may·not·use·this·file·except·in·compliance·with␊
+·*·the·License.··You·may·obtain·a·copy·of·the·License·at␊
*
-·*···http://www.apache.org/licenses/LICENSE-2.0␊
+·*·http://www.apache.org/licenses/LICENSE-2.0␊
*
-·*·Unless·required·by·applicable·law·or·agreed·to·in·writing,␊
-·*·software·distributed·under·the·License·is·distributed·on·an␊
-·*·"AS·IS"·BASIS,·WITHOUT·WARRANTIES·OR·CONDITIONS·OF·ANY␊
-·*·KIND,·either·express·or·implied.··See·the·License·for·the␊
-·*·specific·language·governing·permissions·and·limitations␊
-·*·under·the·License.␊
-·*·====================================================================␊
-·*␊
-·*·This·software·consists·of·voluntary·contributions·made·by·many␊
-·*·individuals·on·behalf·of·the·Apache·Software·Foundation.··For·more␊
-·*·information·on·the·Apache·Software·Foundation,·please·see␊
-·*·<http://www.apache.org/>.␊
-·*␊
+·*·Unless·required·by·applicable·law·or·agreed·to·in·writing,·software␊
+·*·distributed·under·the·License·is·distributed·on·an·"AS·IS"·BASIS,␊
+·*·WITHOUT·WARRANTIES·OR·CONDITIONS·OF·ANY·KIND,·either·express·or·implied.␊
+·*·See·the·License·for·the·specific·language·governing·permissions·and␊
+·*·limitations·under·the·License.␊
*/
package org.apache.http.entity.mime;
You might want to adjust -PmaxCheckMessageLines=50
-PmaxFilesToList=10
-PminLinesPerFile=4
to see more violations
Run './gradlew autostyleApply' to fix the violations.
* Try:
> Run with --stacktrace option to get the stack trace.
> Run with --info or --debug option to get more log output.
> Get more help at https://help.gradle.org.
Deprecated Gradle features were used in this build, making it incompatible with Gradle 9.0.
You can use '--warning-mode all' to show the individual deprecation warnings and determine if they come from your own scripts or plugins.
For more on this, please refer to https://docs.gradle.org/8.14.3/userguide/command_line_interface.html#sec:command_line_warnings in the Gradle documentation.
BUILD FAILED in 6m 22s
155 actionable tasks: 86 executed, 69 up-to-date
See the profiling report at: file://<https://ci-builds.apache.org/job/JMeter/job/JMeter-analysis/ws/build/reports/profile/profile-2025-11-03-19-19-50.html>
A fine-grained performance profile is available: use the --scan option.
Build step 'Invoke Gradle script' changed build result to FAILURE
Build step 'Invoke Gradle script' marked build as failure
Xvfb stopping
Recording test results
ERROR: Step ‘Publish JUnit test result report’ failed: No test report files were found. Configuration error?
Build failed in Jenkins: JMeter » JMeter-analysis #558
Posted by Apache Jenkins Server <je...@builds.apache.org>.
See <https://ci-builds.apache.org/job/JMeter/job/JMeter-analysis/558/display/redirect?page=changes>
Changes:
[Vladimir Sitnikov] fix(deps): update dependency org.apache.commons:commons-jexl3 to v3.5.0
------------------------------------------
[...truncated 344.33 KiB...]
Tidying up ... @ 2025 Nov 1 15:31:26 UTC (1762011086900)
... end of run
No errors present in the logfile <https://ci-builds.apache.org/job/JMeter/job/JMeter-analysis/ws/bin/TestHeaderManager.log> (the file is empty)
> Task :src:dist-check:batchTestHeaderManagerJava
2025-11-01T15:31:29.408620457Z main WARN The use of package scanning to locate Log4j plugins is deprecated.
Please remove the `packages` attribute from your configuration file.
See https://logging.apache.org/log4j/2.x/faq.html#package-scanning for details.
Creating summariser <summary>
Created the tree successfully using <https://ci-builds.apache.org/job/JMeter/job/JMeter-analysis/ws/bin/testfiles/TestHeaderManager.jmx>
Starting standalone test @ 2025 Nov 1 15:31:30 UTC (1762011090624)
Waiting for possible Shutdown/StopTestNow/HeapDump/ThreadDump message on port 4445
summary + 1 in 00:00:00 = 5.3/s Avg: 14 Min: 14 Max: 14 Err: 0 (0.00%) Active: 1 Started: 1 Finished: 0
summary + 2 in 00:00:00 = 111.1/s Avg: 1 Min: 1 Max: 1 Err: 0 (0.00%) Active: 0 Started: 2 Finished: 2
summary = 3 in 00:00:00 = 14.6/s Avg: 5 Min: 1 Max: 14 Err: 0 (0.00%)
Tidying up ... @ 2025 Nov 1 15:31:31 UTC (1762011091074)
... end of run
No errors present in the logfile <https://ci-builds.apache.org/job/JMeter/job/JMeter-analysis/ws/bin/TestHeaderManager.log> (the file is empty)
> Task :src:dist-check:batchTestKeepAlive SKIPPED
> Task :src:dist-check:batchTestRedirectionPolicies SKIPPED
> Task :src:dist-check:batchTestResultStatusAction
2025-11-01T15:31:33.588286762Z main WARN The use of package scanning to locate Log4j plugins is deprecated.
Please remove the `packages` attribute from your configuration file.
See https://logging.apache.org/log4j/2.x/faq.html#package-scanning for details.
Creating summariser <summary>
Created the tree successfully using <https://ci-builds.apache.org/job/JMeter/job/JMeter-analysis/ws/bin/testfiles/TestResultStatusAction.jmx>
Starting standalone test @ 2025 Nov 1 15:31:34 UTC (1762011094858)
Waiting for possible Shutdown/StopTestNow/HeapDump/ThreadDump message on port 4445
summary = 135 in 00:00:01 = 94.0/s Avg: 1 Min: 0 Max: 132 Err: 18 (13.33%)
Tidying up ... @ 2025 Nov 1 15:31:36 UTC (1762011096949)
... end of run
No errors present in the logfile <https://ci-builds.apache.org/job/JMeter/job/JMeter-analysis/ws/bin/TestResultStatusAction.log> (the file is empty)
> Task :src:dist-check:batchTestSchedulerWithTimer
2025-11-01T15:31:39.475842963Z main WARN The use of package scanning to locate Log4j plugins is deprecated.
Please remove the `packages` attribute from your configuration file.
See https://logging.apache.org/log4j/2.x/faq.html#package-scanning for details.
Creating summariser <summary>
Created the tree successfully using <https://ci-builds.apache.org/job/JMeter/job/JMeter-analysis/ws/bin/testfiles/TestSchedulerWithTimer.jmx>
Starting standalone test @ 2025 Nov 1 15:31:40 UTC (1762011100684)
Waiting for possible Shutdown/StopTestNow/HeapDump/ThreadDump message on port 4445
summary = 5 in 00:00:07 = 0.8/s Avg: 282 Min: 6 Max: 1113 Err: 0 (0.00%)
Tidying up ... @ 2025 Nov 1 15:31:47 UTC (1762011107860)
... end of run
No errors present in the logfile <https://ci-builds.apache.org/job/JMeter/job/JMeter-analysis/ws/bin/TestSchedulerWithTimer.log> (the file is empty)
> Task :src:dist-check:batchTests
> Task :src:dist-check:kaptGenerateStubsKotlin UP-TO-DATE
> Task :src:dist-check:kaptKotlin UP-TO-DATE
> Task :src:dist-check:compileKotlin NO-SOURCE
> Task :src:dist-check:compileJava NO-SOURCE
> Task :src:dist-check:classes UP-TO-DATE
> Task :src:dist-check:spotbugsMain NO-SOURCE
> Task :src:dist-check:jar UP-TO-DATE
> Task :src:dist-check:kaptGenerateStubsTestFixturesKotlin UP-TO-DATE
> Task :src:dist-check:kaptTestFixturesKotlin UP-TO-DATE
> Task :src:dist-check:compileTestFixturesKotlin NO-SOURCE
> Task :src:dist-check:compileTestFixturesJava NO-SOURCE
> Task :src:dist-check:testFixturesClasses UP-TO-DATE
> Task :src:dist-check:testFixturesJar UP-TO-DATE
> Task :src:dist-check:kaptGenerateStubsTestKotlin UP-TO-DATE
> Task :src:dist-check:kaptTestKotlin UP-TO-DATE
> Task :src:dist-check:compileTestKotlin UP-TO-DATE
> Task :src:dist-check:compileTestJava UP-TO-DATE
> Task :src:dist-check:testClasses UP-TO-DATE
> Task :src:dist-check:spotbugsTestFixtures NO-SOURCE
> Task :src:bom-thirdparty:cleanLocalRepository
> Task :src:launcher:cleanLocalRepository
> Task :src:config:cleanLocalRepository
> Task :src:protocol:java:cleanLocalRepository
> Task :src:protocol:jdbc:cleanLocalRepository
> Task :src:protocol:bolt:cleanLocalRepository
> Task :src:protocol:junit:cleanLocalRepository
> Task :src:protocol:ldap:cleanLocalRepository
> Task :src:protocol:junit-sample:cleanLocalRepository
> Task :src:components:cleanLocalRepository
> Task :src:bom-testing:cleanLocalRepository
> Task :src:protocol:native:cleanLocalRepository
> Task :src:jorphan:cleanLocalRepository
> Task :src:protocol:http:cleanLocalRepository
> Task :src:protocol:jms:cleanLocalRepository
> Task :src:protocol:tcp:cleanLocalRepository
> Task :src:protocol:ftp:cleanLocalRepository
> Task :src:bom:cleanLocalRepository
> Task :src:functions:cleanLocalRepository
> Task :src:core:cleanLocalRepository
> Task :src:protocol:mail:cleanLocalRepository
> Task :src:bom:publishMavenJavaPlatformPublicationToTmp-mavenRepository
> Task :src:bom-thirdparty:publishMavenJavaPlatformPublicationToTmp-mavenRepository
> Task :src:bom-testing:publishMavenJavaPlatformPublicationToTmp-mavenRepository
> Task :src:bom-thirdparty:publishAllPublicationsToTmp-mavenRepository
> Task :src:bom:publishAllPublicationsToTmp-mavenRepository
> Task :src:bom-testing:publishAllPublicationsToTmp-mavenRepository
> Task :src:bom-thirdparty:assemble
> Task :src:bom:assemble
> Task :src:bom-testing:assemble
> Task :src:protocol:ftp:publishMavenJavaPublicationToTmp-mavenRepository
> Task :src:protocol:ftp:publishAllPublicationsToTmp-mavenRepository
> Task :src:protocol:ftp:assemble
> Task :src:protocol:native:publishMavenJavaPublicationToTmp-mavenRepository
> Task :src:protocol:native:publishAllPublicationsToTmp-mavenRepository
> Task :src:protocol:native:assemble
> Task :src:protocol:bolt:publishMavenJavaPublicationToTmp-mavenRepository
> Task :src:protocol:bolt:publishAllPublicationsToTmp-mavenRepository
> Task :src:protocol:bolt:assemble
> Task :src:launcher:publishMavenJavaPublicationToTmp-mavenRepository
> Task :src:launcher:publishAllPublicationsToTmp-mavenRepository
> Task :src:launcher:assemble
> Task :src:protocol:junit-sample:publishMavenJavaPublicationToTmp-mavenRepository
> Task :src:protocol:junit-sample:publishAllPublicationsToTmp-mavenRepository
> Task :src:protocol:junit-sample:assemble
> Task :src:protocol:junit:publishMavenJavaPublicationToTmp-mavenRepository
> Task :src:protocol:junit:publishAllPublicationsToTmp-mavenRepository
> Task :src:protocol:junit:assemble
> Task :src:config:publishMavenJavaPublicationToTmp-mavenRepository
> Task :src:config:publishAllPublicationsToTmp-mavenRepository
> Task :src:config:assemble
> Task :src:protocol:ldap:publishMavenJavaPublicationToTmp-mavenRepository
> Task :src:protocol:ldap:publishAllPublicationsToTmp-mavenRepository
> Task :src:protocol:ldap:assemble
> Task :src:protocol:jdbc:publishMavenJavaPublicationToTmp-mavenRepository
> Task :src:protocol:jdbc:publishAllPublicationsToTmp-mavenRepository
> Task :src:protocol:jdbc:assemble
> Task :src:protocol:jms:publishMavenJavaPublicationToTmp-mavenRepository
> Task :src:protocol:jms:publishAllPublicationsToTmp-mavenRepository
> Task :src:functions:publishMavenJavaPublicationToTmp-mavenRepository
> Task :src:functions:publishAllPublicationsToTmp-mavenRepository
> Task :src:protocol:jms:assemble
> Task :src:functions:assemble
> Task :src:protocol:tcp:publishMavenJavaPublicationToTmp-mavenRepository
> Task :src:protocol:tcp:publishAllPublicationsToTmp-mavenRepository
> Task :src:protocol:tcp:assemble
> Task :src:components:publishMavenJavaPublicationToTmp-mavenRepository
> Task :src:components:publishAllPublicationsToTmp-mavenRepository
> Task :src:components:assemble
> Task :src:protocol:java:publishMavenJavaPublicationToTmp-mavenRepository
> Task :src:protocol:java:publishAllPublicationsToTmp-mavenRepository
> Task :src:protocol:java:assemble
> Task :src:protocol:mail:publishMavenJavaPublicationToTmp-mavenRepository
> Task :src:protocol:mail:publishAllPublicationsToTmp-mavenRepository
> Task :src:protocol:mail:assemble
> Task :src:jorphan:publishMavenJavaPublicationToTmp-mavenRepository
> Task :src:jorphan:publishAllPublicationsToTmp-mavenRepository
> Task :src:jorphan:assemble
> Task :src:protocol:http:publishMavenJavaPublicationToTmp-mavenRepository
> Task :src:protocol:http:publishAllPublicationsToTmp-mavenRepository
> Task :src:protocol:http:assemble
> Task :src:core:publishMavenJavaPublicationToTmp-mavenRepository
> Task :src:core:publishAllPublicationsToTmp-mavenRepository
> Task :src:core:assemble
> Task :src:dist-check:test
ThreadGroupLoad STANDARD_ERROR
2025-11-01T15:31:52.261430077Z ForkJoinPool-1-worker-1 WARN The use of package scanning to locate Log4j plugins is deprecated.
Please remove the `packages` attribute from your configuration file.
See https://logging.apache.org/log4j/2.x/faq.html#package-scanning for details.
ThreadGroupLoad STANDARD_OUT
Setting JMeterHome: <https://ci-builds.apache.org/job/JMeter/job/JMeter-analysis/ws/src/dist-check/../../.>
Initializing Properties: ../.././bin/jmeter.properties
JMeterVersion=6.0.0-SNAPSHOT 642a1e2
java.version=21.0.4
java.vm.name=OpenJDK 64-Bit Server VM
java.vendor=Eclipse Adoptium
java.home=/usr/local/asfpackages/java/adoptium-jdk-21.0.4+7
file.encoding=UTF-8
default encoding=UTF-8
user.home=/home/jenkins
user.dir=<https://ci-builds.apache.org/job/JMeter/job/JMeter-analysis/ws/src/dist-check>
user.language=en
user.region=null
user.country=US
user.variant=
Locale=en_US
java.class.version=65.0
java.awt.headless=null
os.name=Linux
os.version=5.15.0-157-generic
os.arch=amd64
> Task :src:dist-check:spotbugsTest
SpotBugs ended with exit code 1
> Task :src:dist-check:test
[0;1m 13.5sec[0m, org.apache.jorphan.reflect.[0;1mTestClassFinder[0m > [0;1mtestFindClassesThatExtendStringArrayClassOfQArrayTrue()[0m
[0;1m 3.7sec[0m, org.apache.jorphan.reflect.[0;1mTestClassFinder[0m > [0;1mtestFindAnnotatedClasses()[0m
[0;1m 1.4sec[0m, org.apache.jorphan.reflect.[0;1mTestClassFinder[0m > [0;1mtestFindAnnotatedInnerClasses()[0m
[0;1m 19.7sec[0m, 9 completed, 0 failed, 0 skipped, org.apache.jorphan.reflect.TestClassFinder
[0;1m 2.9sec[0m, 138 completed, 0 failed, 0 skipped, org.apache.jmeter.junit.[0;1mJMeterTest[0m > [0;1mrunGUITitle(GuiComponentHolder)[0m
JMeterTest > runSerialTest(Serializable) STANDARD_ERROR
Unable to instantiate org.apache.jmeter.gui.GlobalUndoableEdit for service interface java.io.Serializable, java.lang.NoSuchMethodException: org.apache.jmeter.gui.GlobalUndoableEdit.<init>()
Unable to instantiate org.apache.jmeter.gui.JBooleanPropertyEditor for service interface java.io.Serializable, java.lang.NoSuchMethodException: org.apache.jmeter.gui.JBooleanPropertyEditor.<init>()
Unable to instantiate org.apache.jmeter.gui.logging.LogEventObject for service interface java.io.Serializable, java.lang.NoSuchMethodException: org.apache.jmeter.gui.logging.LogEventObject.<init>()
Unable to instantiate org.apache.jmeter.rmi.RMIServerSocketFactoryImpl for service interface java.io.Serializable, java.lang.NoSuchMethodException: org.apache.jmeter.rmi.RMIServerSocketFactoryImpl.<init>()
Unable to instantiate org.apache.jmeter.rmi.SSLRMIServerSocketFactory for service interface java.io.Serializable, java.lang.NoSuchMethodException: org.apache.jmeter.rmi.SSLRMIServerSocketFactory.<init>()
Unable to instantiate org.apache.jmeter.threads.RemoteThreadsListenerImpl for service interface java.io.Serializable, java.rmi.server.ExportException: Listen failed on port: 0; nested exception is:
java.io.FileNotFoundException: rmi_keystore.jks (No such file or directory)
Unable to instantiate org.apache.jmeter.threads.openmodel.ParserException for service interface java.io.Serializable, java.lang.NoSuchMethodException: org.apache.jmeter.threads.openmodel.ParserException.<init>()
Unable to instantiate org.apache.jmeter.threads.openmodel.TokenizerException for service interface java.io.Serializable, java.lang.NoSuchMethodException: org.apache.jmeter.threads.openmodel.TokenizerException.<init>()
Unable to instantiate org.apache.jmeter.util.LocaleChangeEvent for service interface java.io.Serializable, java.lang.NoSuchMethodException: org.apache.jmeter.util.LocaleChangeEvent.<init>()
[0;34;1mWARNING[0m [0;1m 10.5sec[0m, 1296 completed, 0 failed, [0;34;1m 6[0m skipped, org.apache.jmeter.junit.[0;34;1mJMeterTest[0m
[0;1m 2.1sec[0m, 384 completed, 0 failed, 0 skipped, org.apache.jmeter.testbeans.gui.[0;1mPackageTest[0m > [0;1mrunTest(Class,[0m Locale, ResourceBundle)
[0;1m 2.1sec[0m, 384 completed, 0 failed, 0 skipped, org.apache.jmeter.testbeans.gui.PackageTest
[0;1m 1.9sec[0m, org.apache.jmeter.gui.action.[0;1mHtmlReportGeneratorTest[0m > [0;1mreport[0m generation fails when format does not match and error is reported()
[0;1m 2.9sec[0m, org.apache.jmeter.gui.action.[0;1mHtmlReportGeneratorTest[0m > [0;1mcheck[0m that report generation succeeds and statistic are generated()
[0;1m 4.8sec[0m, 6 completed, 0 failed, 0 skipped, org.apache.jmeter.gui.action.HtmlReportGeneratorTest
[0;34;1mWARNING[0m [0;1m 45.9sec[0m, 2066 completed, 0 failed, [0;34;1m 6[0m skipped, [0;34;1mGradle Test Run :src:dist-check:test[0m
> Task :src:dist-check:check
> Task :src:dist-check:assemble UP-TO-DATE
> Task :sonarqube
Task 'sonarqube' is deprecated. Use 'sonar' instead.
> Task :sonarqube FAILED
[Incubating] Problems report is available at: file://<https://ci-builds.apache.org/job/JMeter/job/JMeter-analysis/ws/build/reports/problems/problems-report.html>
FAILURE: Build failed with an exception.
* What went wrong:
Execution failed for task ':sonarqube'.
> Project not found. Please check the 'sonar.projectKey' and 'sonar.organization' properties, the 'SONAR_TOKEN' environment variable, or contact the project administrator to check the permissions of the user the token belongs to
* Try:
> Run with --stacktrace option to get the stack trace.
> Run with --info or --debug option to get more log output.
> Get more help at https://help.gradle.org.
Deprecated Gradle features were used in this build, making it incompatible with Gradle 9.0.
You can use '--warning-mode all' to show the individual deprecation warnings and determine if they come from your own scripts or plugins.
For more on this, please refer to https://docs.gradle.org/8.14.3/userguide/command_line_interface.html#sec:command_line_warnings in the Gradle documentation.
BUILD FAILED in 9m 57s
629 actionable tasks: 252 executed, 377 up-to-date
See the profiling report at: file://<https://ci-builds.apache.org/job/JMeter/job/JMeter-analysis/ws/build/reports/profile/profile-2025-11-01-15-22-50.html>
A fine-grained performance profile is available: use the --scan option.
Build step 'Invoke Gradle script' changed build result to FAILURE
Build step 'Invoke Gradle script' marked build as failure
Xvfb stopping
Recording test results
[Checks API] No suitable checks publisher found.