You are viewing a plain text version of this content. The canonical link for it is here.
Posted to dev@brooklyn.apache.org by Apache Jenkins Server <je...@builds.apache.org> on 2023/08/17 16:46:42 UTC
Build failed in Jenkins: Brooklyn » Brooklyn - Server module » master #497
See <https://ci-builds.apache.org/job/Brooklyn/job/brooklyn-server/job/master/497/display/redirect>
Changes:
------------------------------------------
[...truncated 67571 lines...]
2023-08-17 16:46:20,012 INFO o.a.b.t.s.LoggingVerboseReporter TESTNG PASSED: "Surefire test" - org.apache.brooklyn.core.network.OnSubnetNetworkEnricherTest.testSensorTransformed(org.apache.brooklyn.core.network.OnSubnetNetworkEnricherTest$Timing, org.apache.brooklyn.core.network.OnSubnetNetworkEnricherTest$Timing, org.apache.brooklyn.api.sensor.AttributeSensor, java.lang.Object, java.lang.String, java.lang.String)(value(s): BEFORE, AFTER, Sensor: test.name (java.lang.String), 54.158.173.158:1234, "test.name.mapped.subnet", "10.179.184.237:1234") finished in 3 ms
2023-08-17 16:46:20,013 INFO o.a.b.t.s.LoggingVerboseReporter TESTNG INVOKING CONFIGURATION: "Surefire test" - @AfterMethod org.apache.brooklyn.core.test.BrooklynMgmtUnitTestSupport.tearDown()
2023-08-17 16:46:20,019 INFO o.a.b.t.s.LoggingVerboseReporter TESTNG PASSED CONFIGURATION: "Surefire test" - @AfterMethod org.apache.brooklyn.core.test.BrooklynMgmtUnitTestSupport.tearDown() finished in 6 ms
2023-08-17 16:46:20,020 INFO o.a.b.t.s.LoggingVerboseReporter TESTNG INVOKING CONFIGURATION: "Surefire test" - @BeforeMethod org.apache.brooklyn.core.network.OnSubnetNetworkEnricherTest.setUp()
2023-08-17 16:46:20,050 INFO o.a.b.t.s.LoggingVerboseReporter TESTNG PASSED CONFIGURATION: "Surefire test" - @BeforeMethod org.apache.brooklyn.core.network.OnSubnetNetworkEnricherTest.setUp() finished in 30 ms
2023-08-17 16:46:20,050 INFO o.a.b.t.s.LoggingVerboseReporter TESTNG INVOKING: "Surefire test" - org.apache.brooklyn.core.network.OnSubnetNetworkEnricherTest.testSensorTransformed(org.apache.brooklyn.core.network.OnSubnetNetworkEnricherTest$Timing, org.apache.brooklyn.core.network.OnSubnetNetworkEnricherTest$Timing, org.apache.brooklyn.api.sensor.AttributeSensor, java.lang.Object, java.lang.String, java.lang.String)(value(s): BEFORE, AFTER, Sensor: test.endpoint (com.google.common.net.HostAndPort), 54.158.173.158:1234, "test.endpoint.mapped.subnet", "10.179.184.237:1234")
2023-08-17 16:46:20,053 INFO o.a.b.t.s.LoggingVerboseReporter TESTNG PASSED: "Surefire test" - org.apache.brooklyn.core.network.OnSubnetNetworkEnricherTest.testSensorTransformed(org.apache.brooklyn.core.network.OnSubnetNetworkEnricherTest$Timing, org.apache.brooklyn.core.network.OnSubnetNetworkEnricherTest$Timing, org.apache.brooklyn.api.sensor.AttributeSensor, java.lang.Object, java.lang.String, java.lang.String)(value(s): BEFORE, AFTER, Sensor: test.endpoint (com.google.common.net.HostAndPort), 54.158.173.158:1234, "test.endpoint.mapped.subnet", "10.179.184.237:1234") finished in 3 ms
2023-08-17 16:46:20,054 INFO o.a.b.t.s.LoggingVerboseReporter TESTNG INVOKING CONFIGURATION: "Surefire test" - @AfterMethod org.apache.brooklyn.core.test.BrooklynMgmtUnitTestSupport.tearDown()
2023-08-17 16:46:20,062 INFO o.a.b.t.s.LoggingVerboseReporter TESTNG PASSED CONFIGURATION: "Surefire test" - @AfterMethod org.apache.brooklyn.core.test.BrooklynMgmtUnitTestSupport.tearDown() finished in 9 ms
2023-08-17 16:46:20,062 INFO o.a.b.t.s.LoggingVerboseReporter TESTNG INVOKING CONFIGURATION: "Surefire test" - @BeforeMethod org.apache.brooklyn.core.network.OnSubnetNetworkEnricherTest.setUp()
2023-08-17 16:46:20,089 INFO o.a.b.t.s.LoggingVerboseReporter TESTNG PASSED CONFIGURATION: "Surefire test" - @BeforeMethod org.apache.brooklyn.core.network.OnSubnetNetworkEnricherTest.setUp() finished in 27 ms
2023-08-17 16:46:20,089 INFO o.a.b.t.s.LoggingVerboseReporter TESTNG INVOKING: "Surefire test" - org.apache.brooklyn.core.network.OnSubnetNetworkEnricherTest.testSensorTransformed(org.apache.brooklyn.core.network.OnSubnetNetworkEnricherTest$Timing, org.apache.brooklyn.core.network.OnSubnetNetworkEnricherTest$Timing, org.apache.brooklyn.api.sensor.AttributeSensor, java.lang.Object, java.lang.String, java.lang.String)(value(s): AFTER, BEFORE, Sensor: main.uri (java.net.URI), http://54.158.173.158:1234/my/path, "main.uri.mapped.subnet", "http://10.179.184.237:1234/my/path")
2023-08-17 16:46:20,092 INFO o.a.b.t.s.LoggingVerboseReporter TESTNG PASSED: "Surefire test" - org.apache.brooklyn.core.network.OnSubnetNetworkEnricherTest.testSensorTransformed(org.apache.brooklyn.core.network.OnSubnetNetworkEnricherTest$Timing, org.apache.brooklyn.core.network.OnSubnetNetworkEnricherTest$Timing, org.apache.brooklyn.api.sensor.AttributeSensor, java.lang.Object, java.lang.String, java.lang.String)(value(s): AFTER, BEFORE, Sensor: main.uri (java.net.URI), http://54.158.173.158:1234/my/path, "main.uri.mapped.subnet", "http://10.179.184.237:1234/my/path") finished in 3 ms
2023-08-17 16:46:20,093 INFO o.a.b.t.s.LoggingVerboseReporter TESTNG INVOKING CONFIGURATION: "Surefire test" - @AfterMethod org.apache.brooklyn.core.test.BrooklynMgmtUnitTestSupport.tearDown()
2023-08-17 16:46:20,099 INFO o.a.b.t.s.LoggingVerboseReporter TESTNG PASSED CONFIGURATION: "Surefire test" - @AfterMethod org.apache.brooklyn.core.test.BrooklynMgmtUnitTestSupport.tearDown() finished in 6 ms
2023-08-17 16:46:20,099 INFO o.a.b.t.s.LoggingVerboseReporter TESTNG INVOKING CONFIGURATION: "Surefire test" - @BeforeMethod org.apache.brooklyn.core.network.OnSubnetNetworkEnricherTest.setUp()
2023-08-17 16:46:20,126 INFO o.a.b.t.s.LoggingVerboseReporter TESTNG PASSED CONFIGURATION: "Surefire test" - @BeforeMethod org.apache.brooklyn.core.network.OnSubnetNetworkEnricherTest.setUp() finished in 27 ms
2023-08-17 16:46:20,126 INFO o.a.b.t.s.LoggingVerboseReporter TESTNG INVOKING: "Surefire test" - org.apache.brooklyn.core.network.OnSubnetNetworkEnricherTest.testSensorTransformed(org.apache.brooklyn.core.network.OnSubnetNetworkEnricherTest$Timing, org.apache.brooklyn.core.network.OnSubnetNetworkEnricherTest$Timing, org.apache.brooklyn.api.sensor.AttributeSensor, java.lang.Object, java.lang.String, java.lang.String)(value(s): AFTER, BEFORE, Sensor: test.name (java.lang.String), http://54.158.173.158:1234/my/path, "test.name.mapped.subnet", "http://10.179.184.237:1234/my/path")
2023-08-17 16:46:20,129 INFO o.a.b.t.s.LoggingVerboseReporter TESTNG PASSED: "Surefire test" - org.apache.brooklyn.core.network.OnSubnetNetworkEnricherTest.testSensorTransformed(org.apache.brooklyn.core.network.OnSubnetNetworkEnricherTest$Timing, org.apache.brooklyn.core.network.OnSubnetNetworkEnricherTest$Timing, org.apache.brooklyn.api.sensor.AttributeSensor, java.lang.Object, java.lang.String, java.lang.String)(value(s): AFTER, BEFORE, Sensor: test.name (java.lang.String), http://54.158.173.158:1234/my/path, "test.name.mapped.subnet", "http://10.179.184.237:1234/my/path") finished in 3 ms
2023-08-17 16:46:20,129 INFO o.a.b.t.s.LoggingVerboseReporter TESTNG INVOKING CONFIGURATION: "Surefire test" - @AfterMethod org.apache.brooklyn.core.test.BrooklynMgmtUnitTestSupport.tearDown()
2023-08-17 16:46:20,136 INFO o.a.b.t.s.LoggingVerboseReporter TESTNG PASSED CONFIGURATION: "Surefire test" - @AfterMethod org.apache.brooklyn.core.test.BrooklynMgmtUnitTestSupport.tearDown() finished in 7 ms
2023-08-17 16:46:20,136 INFO o.a.b.t.s.LoggingVerboseReporter TESTNG INVOKING CONFIGURATION: "Surefire test" - @BeforeMethod org.apache.brooklyn.core.network.OnSubnetNetworkEnricherTest.setUp()
2023-08-17 16:46:20,163 INFO o.a.b.t.s.LoggingVerboseReporter TESTNG PASSED CONFIGURATION: "Surefire test" - @BeforeMethod org.apache.brooklyn.core.network.OnSubnetNetworkEnricherTest.setUp() finished in 27 ms
2023-08-17 16:46:20,163 INFO o.a.b.t.s.LoggingVerboseReporter TESTNG INVOKING: "Surefire test" - org.apache.brooklyn.core.network.OnSubnetNetworkEnricherTest.testSensorTransformed(org.apache.brooklyn.core.network.OnSubnetNetworkEnricherTest$Timing, org.apache.brooklyn.core.network.OnSubnetNetworkEnricherTest$Timing, org.apache.brooklyn.api.sensor.AttributeSensor, java.lang.Object, java.lang.String, java.lang.String)(value(s): AFTER, BEFORE, Sensor: http.port (java.lang.Integer), 1234, "http.endpoint.mapped.subnet", "10.179.184.237:1234")
2023-08-17 16:46:20,167 INFO o.a.b.t.s.LoggingVerboseReporter TESTNG PASSED: "Surefire test" - org.apache.brooklyn.core.network.OnSubnetNetworkEnricherTest.testSensorTransformed(org.apache.brooklyn.core.network.OnSubnetNetworkEnricherTest$Timing, org.apache.brooklyn.core.network.OnSubnetNetworkEnricherTest$Timing, org.apache.brooklyn.api.sensor.AttributeSensor, java.lang.Object, java.lang.String, java.lang.String)(value(s): AFTER, BEFORE, Sensor: http.port (java.lang.Integer), 1234, "http.endpoint.mapped.subnet", "10.179.184.237:1234") finished in 3 ms
2023-08-17 16:46:20,167 INFO o.a.b.t.s.LoggingVerboseReporter TESTNG INVOKING CONFIGURATION: "Surefire test" - @AfterMethod org.apache.brooklyn.core.test.BrooklynMgmtUnitTestSupport.tearDown()
2023-08-17 16:46:20,172 INFO o.a.b.t.s.LoggingVerboseReporter TESTNG PASSED CONFIGURATION: "Surefire test" - @AfterMethod org.apache.brooklyn.core.test.BrooklynMgmtUnitTestSupport.tearDown() finished in 5 ms
2023-08-17 16:46:20,173 INFO o.a.b.t.s.LoggingVerboseReporter TESTNG INVOKING CONFIGURATION: "Surefire test" - @BeforeMethod org.apache.brooklyn.core.network.OnSubnetNetworkEnricherTest.setUp()
2023-08-17 16:46:20,200 INFO o.a.b.t.s.LoggingVerboseReporter TESTNG PASSED CONFIGURATION: "Surefire test" - @BeforeMethod org.apache.brooklyn.core.network.OnSubnetNetworkEnricherTest.setUp() finished in 27 ms
2023-08-17 16:46:20,200 INFO o.a.b.t.s.LoggingVerboseReporter TESTNG INVOKING: "Surefire test" - org.apache.brooklyn.core.network.OnSubnetNetworkEnricherTest.testSensorTransformed(org.apache.brooklyn.core.network.OnSubnetNetworkEnricherTest$Timing, org.apache.brooklyn.core.network.OnSubnetNetworkEnricherTest$Timing, org.apache.brooklyn.api.sensor.AttributeSensor, java.lang.Object, java.lang.String, java.lang.String)(value(s): AFTER, BEFORE, Sensor: test.name (java.lang.String), 1234, "test.name.mapped.subnet", "10.179.184.237:1234")
2023-08-17 16:46:20,204 INFO o.a.b.t.s.LoggingVerboseReporter TESTNG PASSED: "Surefire test" - org.apache.brooklyn.core.network.OnSubnetNetworkEnricherTest.testSensorTransformed(org.apache.brooklyn.core.network.OnSubnetNetworkEnricherTest$Timing, org.apache.brooklyn.core.network.OnSubnetNetworkEnricherTest$Timing, org.apache.brooklyn.api.sensor.AttributeSensor, java.lang.Object, java.lang.String, java.lang.String)(value(s): AFTER, BEFORE, Sensor: test.name (java.lang.String), 1234, "test.name.mapped.subnet", "10.179.184.237:1234") finished in 4 ms
2023-08-17 16:46:20,204 INFO o.a.b.t.s.LoggingVerboseReporter TESTNG INVOKING CONFIGURATION: "Surefire test" - @AfterMethod org.apache.brooklyn.core.test.BrooklynMgmtUnitTestSupport.tearDown()
2023-08-17 16:46:20,211 INFO o.a.b.t.s.LoggingVerboseReporter TESTNG PASSED CONFIGURATION: "Surefire test" - @AfterMethod org.apache.brooklyn.core.test.BrooklynMgmtUnitTestSupport.tearDown() finished in 7 ms
2023-08-17 16:46:20,211 INFO o.a.b.t.s.LoggingVerboseReporter TESTNG INVOKING CONFIGURATION: "Surefire test" - @BeforeMethod org.apache.brooklyn.core.network.OnSubnetNetworkEnricherTest.setUp()
2023-08-17 16:46:20,238 INFO o.a.b.t.s.LoggingVerboseReporter TESTNG PASSED CONFIGURATION: "Surefire test" - @BeforeMethod org.apache.brooklyn.core.network.OnSubnetNetworkEnricherTest.setUp() finished in 27 ms
2023-08-17 16:46:20,238 INFO o.a.b.t.s.LoggingVerboseReporter TESTNG INVOKING: "Surefire test" - org.apache.brooklyn.core.network.OnSubnetNetworkEnricherTest.testSensorTransformed(org.apache.brooklyn.core.network.OnSubnetNetworkEnricherTest$Timing, org.apache.brooklyn.core.network.OnSubnetNetworkEnricherTest$Timing, org.apache.brooklyn.api.sensor.AttributeSensor, java.lang.Object, java.lang.String, java.lang.String)(value(s): AFTER, BEFORE, Sensor: test.name (java.lang.String), 54.158.173.158:1234, "test.name.mapped.subnet", "10.179.184.237:1234")
2023-08-17 16:46:20,241 INFO o.a.b.t.s.LoggingVerboseReporter TESTNG PASSED: "Surefire test" - org.apache.brooklyn.core.network.OnSubnetNetworkEnricherTest.testSensorTransformed(org.apache.brooklyn.core.network.OnSubnetNetworkEnricherTest$Timing, org.apache.brooklyn.core.network.OnSubnetNetworkEnricherTest$Timing, org.apache.brooklyn.api.sensor.AttributeSensor, java.lang.Object, java.lang.String, java.lang.String)(value(s): AFTER, BEFORE, Sensor: test.name (java.lang.String), 54.158.173.158:1234, "test.name.mapped.subnet", "10.179.184.237:1234") finished in 3 ms
2023-08-17 16:46:20,242 INFO o.a.b.t.s.LoggingVerboseReporter TESTNG INVOKING CONFIGURATION: "Surefire test" - @AfterMethod org.apache.brooklyn.core.test.BrooklynMgmtUnitTestSupport.tearDown()
2023-08-17 16:46:20,248 INFO o.a.b.t.s.LoggingVerboseReporter TESTNG PASSED CONFIGURATION: "Surefire test" - @AfterMethod org.apache.brooklyn.core.test.BrooklynMgmtUnitTestSupport.tearDown() finished in 5 ms
2023-08-17 16:46:20,248 INFO o.a.b.t.s.LoggingVerboseReporter TESTNG INVOKING CONFIGURATION: "Surefire test" - @BeforeMethod org.apache.brooklyn.core.network.OnSubnetNetworkEnricherTest.setUp()
2023-08-17 16:46:20,285 INFO o.a.b.t.s.LoggingVerboseReporter TESTNG PASSED CONFIGURATION: "Surefire test" - @BeforeMethod org.apache.brooklyn.core.network.OnSubnetNetworkEnricherTest.setUp() finished in 37 ms
2023-08-17 16:46:20,285 INFO o.a.b.t.s.LoggingVerboseReporter TESTNG INVOKING: "Surefire test" - org.apache.brooklyn.core.network.OnSubnetNetworkEnricherTest.testSensorTransformed(org.apache.brooklyn.core.network.OnSubnetNetworkEnricherTest$Timing, org.apache.brooklyn.core.network.OnSubnetNetworkEnricherTest$Timing, org.apache.brooklyn.api.sensor.AttributeSensor, java.lang.Object, java.lang.String, java.lang.String)(value(s): AFTER, BEFORE, Sensor: test.endpoint (com.google.common.net.HostAndPort), 54.158.173.158:1234, "test.endpoint.mapped.subnet", "10.179.184.237:1234")
2023-08-17 16:46:20,289 INFO o.a.b.t.s.LoggingVerboseReporter TESTNG PASSED: "Surefire test" - org.apache.brooklyn.core.network.OnSubnetNetworkEnricherTest.testSensorTransformed(org.apache.brooklyn.core.network.OnSubnetNetworkEnricherTest$Timing, org.apache.brooklyn.core.network.OnSubnetNetworkEnricherTest$Timing, org.apache.brooklyn.api.sensor.AttributeSensor, java.lang.Object, java.lang.String, java.lang.String)(value(s): AFTER, BEFORE, Sensor: test.endpoint (com.google.common.net.HostAndPort), 54.158.173.158:1234, "test.endpoint.mapped.subnet", "10.179.184.237:1234") finished in 4 ms
2023-08-17 16:46:20,289 INFO o.a.b.t.s.LoggingVerboseReporter TESTNG INVOKING CONFIGURATION: "Surefire test" - @AfterMethod org.apache.brooklyn.core.test.BrooklynMgmtUnitTestSupport.tearDown()
2023-08-17 16:46:20,295 INFO o.a.b.t.s.LoggingVerboseReporter TESTNG PASSED CONFIGURATION: "Surefire test" - @AfterMethod org.apache.brooklyn.core.test.BrooklynMgmtUnitTestSupport.tearDown() finished in 6 ms
2023-08-17 16:46:20,295 INFO o.a.b.t.s.LoggingVerboseReporter TESTNG INVOKING CONFIGURATION: "Surefire test" - @BeforeMethod org.apache.brooklyn.core.network.OnSubnetNetworkEnricherTest.setUp()
2023-08-17 16:46:20,323 INFO o.a.b.t.s.LoggingVerboseReporter TESTNG PASSED CONFIGURATION: "Surefire test" - @BeforeMethod org.apache.brooklyn.core.network.OnSubnetNetworkEnricherTest.setUp() finished in 28 ms
2023-08-17 16:46:20,323 INFO o.a.b.t.s.LoggingVerboseReporter TESTNG INVOKING: "Surefire test" - org.apache.brooklyn.core.network.OnSubnetNetworkEnricherTest.testSensorTransformed(org.apache.brooklyn.core.network.OnSubnetNetworkEnricherTest$Timing, org.apache.brooklyn.core.network.OnSubnetNetworkEnricherTest$Timing, org.apache.brooklyn.api.sensor.AttributeSensor, java.lang.Object, java.lang.String, java.lang.String)(value(s): AFTER, AFTER, Sensor: main.uri (java.net.URI), http://54.158.173.158:1234/my/path, "main.uri.mapped.subnet", "http://10.179.184.237:1234/my/path")
2023-08-17 16:46:20,326 INFO o.a.b.t.s.LoggingVerboseReporter TESTNG PASSED: "Surefire test" - org.apache.brooklyn.core.network.OnSubnetNetworkEnricherTest.testSensorTransformed(org.apache.brooklyn.core.network.OnSubnetNetworkEnricherTest$Timing, org.apache.brooklyn.core.network.OnSubnetNetworkEnricherTest$Timing, org.apache.brooklyn.api.sensor.AttributeSensor, java.lang.Object, java.lang.String, java.lang.String)(value(s): AFTER, AFTER, Sensor: main.uri (java.net.URI), http://54.158.173.158:1234/my/path, "main.uri.mapped.subnet", "http://10.179.184.237:1234/my/path") finished in 3 ms
2023-08-17 16:46:20,326 INFO o.a.b.t.s.LoggingVerboseReporter TESTNG INVOKING CONFIGURATION: "Surefire test" - @AfterMethod org.apache.brooklyn.core.test.BrooklynMgmtUnitTestSupport.tearDown()
2023-08-17 16:46:20,332 INFO o.a.b.t.s.LoggingVerboseReporter TESTNG PASSED CONFIGURATION: "Surefire test" - @AfterMethod org.apache.brooklyn.core.test.BrooklynMgmtUnitTestSupport.tearDown() finished in 6 ms
2023-08-17 16:46:20,333 INFO o.a.b.t.s.LoggingVerboseReporter TESTNG INVOKING CONFIGURATION: "Surefire test" - @BeforeMethod org.apache.brooklyn.core.network.OnSubnetNetworkEnricherTest.setUp()
2023-08-17 16:46:20,360 INFO o.a.b.t.s.LoggingVerboseReporter TESTNG PASSED CONFIGURATION: "Surefire test" - @BeforeMethod org.apache.brooklyn.core.network.OnSubnetNetworkEnricherTest.setUp() finished in 27 ms
2023-08-17 16:46:20,360 INFO o.a.b.t.s.LoggingVerboseReporter TESTNG INVOKING: "Surefire test" - org.apache.brooklyn.core.network.OnSubnetNetworkEnricherTest.testSensorTransformed(org.apache.brooklyn.core.network.OnSubnetNetworkEnricherTest$Timing, org.apache.brooklyn.core.network.OnSubnetNetworkEnricherTest$Timing, org.apache.brooklyn.api.sensor.AttributeSensor, java.lang.Object, java.lang.String, java.lang.String)(value(s): AFTER, AFTER, Sensor: test.name (java.lang.String), http://54.158.173.158:1234/my/path, "test.name.mapped.subnet", "http://10.179.184.237:1234/my/path")
2023-08-17 16:46:20,363 INFO o.a.b.t.s.LoggingVerboseReporter TESTNG PASSED: "Surefire test" - org.apache.brooklyn.core.network.OnSubnetNetworkEnricherTest.testSensorTransformed(org.apache.brooklyn.core.network.OnSubnetNetworkEnricherTest$Timing, org.apache.brooklyn.core.network.OnSubnetNetworkEnricherTest$Timing, org.apache.brooklyn.api.sensor.AttributeSensor, java.lang.Object, java.lang.String, java.lang.String)(value(s): AFTER, AFTER, Sensor: test.name (java.lang.String), http://54.158.173.158:1234/my/path, "test.name.mapped.subnet", "http://10.179.184.237:1234/my/path") finished in 3 ms
2023-08-17 16:46:20,364 INFO o.a.b.t.s.LoggingVerboseReporter TESTNG INVOKING CONFIGURATION: "Surefire test" - @AfterMethod org.apache.brooklyn.core.test.BrooklynMgmtUnitTestSupport.tearDown()
2023-08-17 16:46:20,370 INFO o.a.b.t.s.LoggingVerboseReporter TESTNG PASSED CONFIGURATION: "Surefire test" - @AfterMethod org.apache.brooklyn.core.test.BrooklynMgmtUnitTestSupport.tearDown() finished in 6 ms
2023-08-17 16:46:20,370 INFO o.a.b.t.s.LoggingVerboseReporter TESTNG INVOKING CONFIGURATION: "Surefire test" - @BeforeMethod org.apache.brooklyn.core.network.OnSubnetNetworkEnricherTest.setUp()
[GC (Allocation Failure) 362637K->164949K(757248K), 0.0278048 secs]
2023-08-17 16:46:20,428 INFO o.a.b.t.s.LoggingVerboseReporter TESTNG PASSED CONFIGURATION: "Surefire test" - @BeforeMethod org.apache.brooklyn.core.network.OnSubnetNetworkEnricherTest.setUp() finished in 58 ms
2023-08-17 16:46:20,428 INFO o.a.b.t.s.LoggingVerboseReporter TESTNG INVOKING: "Surefire test" - org.apache.brooklyn.core.network.OnSubnetNetworkEnricherTest.testSensorTransformed(org.apache.brooklyn.core.network.OnSubnetNetworkEnricherTest$Timing, org.apache.brooklyn.core.network.OnSubnetNetworkEnricherTest$Timing, org.apache.brooklyn.api.sensor.AttributeSensor, java.lang.Object, java.lang.String, java.lang.String)(value(s): AFTER, AFTER, Sensor: http.port (java.lang.Integer), 1234, "http.endpoint.mapped.subnet", "10.179.184.237:1234")
2023-08-17 16:46:20,432 INFO o.a.b.t.s.LoggingVerboseReporter TESTNG PASSED: "Surefire test" - org.apache.brooklyn.core.network.OnSubnetNetworkEnricherTest.testSensorTransformed(org.apache.brooklyn.core.network.OnSubnetNetworkEnricherTest$Timing, org.apache.brooklyn.core.network.OnSubnetNetworkEnricherTest$Timing, org.apache.brooklyn.api.sensor.AttributeSensor, java.lang.Object, java.lang.String, java.lang.String)(value(s): AFTER, AFTER, Sensor: http.port (java.lang.Integer), 1234, "http.endpoint.mapped.subnet", "10.179.184.237:1234") finished in 4 ms
2023-08-17 16:46:20,432 INFO o.a.b.t.s.LoggingVerboseReporter TESTNG INVOKING CONFIGURATION: "Surefire test" - @AfterMethod org.apache.brooklyn.core.test.BrooklynMgmtUnitTestSupport.tearDown()
2023-08-17 16:46:20,439 INFO o.a.b.t.s.LoggingVerboseReporter TESTNG PASSED CONFIGURATION: "Surefire test" - @AfterMethod org.apache.brooklyn.core.test.BrooklynMgmtUnitTestSupport.tearDown() finished in 7 ms
2023-08-17 16:46:20,439 INFO o.a.b.t.s.LoggingVerboseReporter TESTNG INVOKING CONFIGURATION: "Surefire test" - @BeforeMethod org.apache.brooklyn.core.network.OnSubnetNetworkEnricherTest.setUp()
2023-08-17 16:46:20,468 INFO o.a.b.t.s.LoggingVerboseReporter TESTNG PASSED CONFIGURATION: "Surefire test" - @BeforeMethod org.apache.brooklyn.core.network.OnSubnetNetworkEnricherTest.setUp() finished in 29 ms
2023-08-17 16:46:20,468 INFO o.a.b.t.s.LoggingVerboseReporter TESTNG INVOKING: "Surefire test" - org.apache.brooklyn.core.network.OnSubnetNetworkEnricherTest.testSensorTransformed(org.apache.brooklyn.core.network.OnSubnetNetworkEnricherTest$Timing, org.apache.brooklyn.core.network.OnSubnetNetworkEnricherTest$Timing, org.apache.brooklyn.api.sensor.AttributeSensor, java.lang.Object, java.lang.String, java.lang.String)(value(s): AFTER, AFTER, Sensor: test.name (java.lang.String), 1234, "test.name.mapped.subnet", "10.179.184.237:1234")
2023-08-17 16:46:20,472 INFO o.a.b.t.s.LoggingVerboseReporter TESTNG PASSED: "Surefire test" - org.apache.brooklyn.core.network.OnSubnetNetworkEnricherTest.testSensorTransformed(org.apache.brooklyn.core.network.OnSubnetNetworkEnricherTest$Timing, org.apache.brooklyn.core.network.OnSubnetNetworkEnricherTest$Timing, org.apache.brooklyn.api.sensor.AttributeSensor, java.lang.Object, java.lang.String, java.lang.String)(value(s): AFTER, AFTER, Sensor: test.name (java.lang.String), 1234, "test.name.mapped.subnet", "10.179.184.237:1234") finished in 4 ms
2023-08-17 16:46:20,472 INFO o.a.b.t.s.LoggingVerboseReporter TESTNG INVOKING CONFIGURATION: "Surefire test" - @AfterMethod org.apache.brooklyn.core.test.BrooklynMgmtUnitTestSupport.tearDown()
2023-08-17 16:46:20,478 INFO o.a.b.t.s.LoggingVerboseReporter TESTNG PASSED CONFIGURATION: "Surefire test" - @AfterMethod org.apache.brooklyn.core.test.BrooklynMgmtUnitTestSupport.tearDown() finished in 6 ms
2023-08-17 16:46:20,479 INFO o.a.b.t.s.LoggingVerboseReporter TESTNG INVOKING CONFIGURATION: "Surefire test" - @BeforeMethod org.apache.brooklyn.core.network.OnSubnetNetworkEnricherTest.setUp()
2023-08-17 16:46:20,508 INFO o.a.b.t.s.LoggingVerboseReporter TESTNG PASSED CONFIGURATION: "Surefire test" - @BeforeMethod org.apache.brooklyn.core.network.OnSubnetNetworkEnricherTest.setUp() finished in 30 ms
2023-08-17 16:46:20,508 INFO o.a.b.t.s.LoggingVerboseReporter TESTNG INVOKING: "Surefire test" - org.apache.brooklyn.core.network.OnSubnetNetworkEnricherTest.testSensorTransformed(org.apache.brooklyn.core.network.OnSubnetNetworkEnricherTest$Timing, org.apache.brooklyn.core.network.OnSubnetNetworkEnricherTest$Timing, org.apache.brooklyn.api.sensor.AttributeSensor, java.lang.Object, java.lang.String, java.lang.String)(value(s): AFTER, AFTER, Sensor: test.name (java.lang.String), 54.158.173.158:1234, "test.name.mapped.subnet", "10.179.184.237:1234")
2023-08-17 16:46:20,511 INFO o.a.b.t.s.LoggingVerboseReporter TESTNG PASSED: "Surefire test" - org.apache.brooklyn.core.network.OnSubnetNetworkEnricherTest.testSensorTransformed(org.apache.brooklyn.core.network.OnSubnetNetworkEnricherTest$Timing, org.apache.brooklyn.core.network.OnSubnetNetworkEnricherTest$Timing, org.apache.brooklyn.api.sensor.AttributeSensor, java.lang.Object, java.lang.String, java.lang.String)(value(s): AFTER, AFTER, Sensor: test.name (java.lang.String), 54.158.173.158:1234, "test.name.mapped.subnet", "10.179.184.237:1234") finished in 3 ms
2023-08-17 16:46:20,512 INFO o.a.b.t.s.LoggingVerboseReporter TESTNG INVOKING CONFIGURATION: "Surefire test" - @AfterMethod org.apache.brooklyn.core.test.BrooklynMgmtUnitTestSupport.tearDown()
2023-08-17 16:46:20,518 INFO o.a.b.t.s.LoggingVerboseReporter TESTNG PASSED CONFIGURATION: "Surefire test" - @AfterMethod org.apache.brooklyn.core.test.BrooklynMgmtUnitTestSupport.tearDown() finished in 6 ms
2023-08-17 16:46:20,518 INFO o.a.b.t.s.LoggingVerboseReporter TESTNG INVOKING CONFIGURATION: "Surefire test" - @BeforeMethod org.apache.brooklyn.core.network.OnSubnetNetworkEnricherTest.setUp()
2023-08-17 16:46:20,547 INFO o.a.b.t.s.LoggingVerboseReporter TESTNG PASSED CONFIGURATION: "Surefire test" - @BeforeMethod org.apache.brooklyn.core.network.OnSubnetNetworkEnricherTest.setUp() finished in 29 ms
2023-08-17 16:46:20,547 INFO o.a.b.t.s.LoggingVerboseReporter TESTNG INVOKING: "Surefire test" - org.apache.brooklyn.core.network.OnSubnetNetworkEnricherTest.testSensorTransformed(org.apache.brooklyn.core.network.OnSubnetNetworkEnricherTest$Timing, org.apache.brooklyn.core.network.OnSubnetNetworkEnricherTest$Timing, org.apache.brooklyn.api.sensor.AttributeSensor, java.lang.Object, java.lang.String, java.lang.String)(value(s): AFTER, AFTER, Sensor: test.endpoint (com.google.common.net.HostAndPort), 54.158.173.158:1234, "test.endpoint.mapped.subnet", "10.179.184.237:1234")
2023-08-17 16:46:20,550 INFO o.a.b.t.s.LoggingVerboseReporter TESTNG PASSED: "Surefire test" - org.apache.brooklyn.core.network.OnSubnetNetworkEnricherTest.testSensorTransformed(org.apache.brooklyn.core.network.OnSubnetNetworkEnricherTest$Timing, org.apache.brooklyn.core.network.OnSubnetNetworkEnricherTest$Timing, org.apache.brooklyn.api.sensor.AttributeSensor, java.lang.Object, java.lang.String, java.lang.String)(value(s): AFTER, AFTER, Sensor: test.endpoint (com.google.common.net.HostAndPort), 54.158.173.158:1234, "test.endpoint.mapped.subnet", "10.179.184.237:1234") finished in 3 ms
2023-08-17 16:46:20,551 INFO o.a.b.t.s.LoggingVerboseReporter TESTNG INVOKING CONFIGURATION: "Surefire test" - @AfterMethod org.apache.brooklyn.core.test.BrooklynMgmtUnitTestSupport.tearDown()
2023-08-17 16:46:20,557 INFO o.a.b.t.s.LoggingVerboseReporter TESTNG PASSED CONFIGURATION: "Surefire test" - @AfterMethod org.apache.brooklyn.core.test.BrooklynMgmtUnitTestSupport.tearDown() finished in 6 ms
2023-08-17 16:46:20,557 INFO o.a.b.t.s.LoggingVerboseReporter TESTNG INVOKING CONFIGURATION: "Surefire test" - @BeforeMethod org.apache.brooklyn.core.network.OnSubnetNetworkEnricherTest.setUp()
2023-08-17 16:46:20,585 INFO o.a.b.t.s.LoggingVerboseReporter TESTNG PASSED CONFIGURATION: "Surefire test" - @BeforeMethod org.apache.brooklyn.core.network.OnSubnetNetworkEnricherTest.setUp() finished in 28 ms
2023-08-17 16:46:20,585 INFO o.a.b.t.s.LoggingVerboseReporter TESTNG INVOKING: "Surefire test" - org.apache.brooklyn.core.network.OnSubnetNetworkEnricherTest.testTransformsAllMatchingSensors()
2023-08-17 16:46:20,589 INFO o.a.b.t.s.LoggingVerboseReporter TESTNG PASSED: "Surefire test" - org.apache.brooklyn.core.network.OnSubnetNetworkEnricherTest.testTransformsAllMatchingSensors() finished in 4 ms
2023-08-17 16:46:20,589 INFO o.a.b.t.s.LoggingVerboseReporter TESTNG INVOKING CONFIGURATION: "Surefire test" - @AfterMethod org.apache.brooklyn.core.test.BrooklynMgmtUnitTestSupport.tearDown()
2023-08-17 16:46:20,595 INFO o.a.b.t.s.LoggingVerboseReporter TESTNG PASSED CONFIGURATION: "Surefire test" - @AfterMethod org.apache.brooklyn.core.test.BrooklynMgmtUnitTestSupport.tearDown() finished in 6 ms
2023-08-17 16:46:20,596 INFO o.a.b.t.s.LoggingVerboseReporter TESTNG INVOKING CONFIGURATION: "Surefire test" - @BeforeMethod org.apache.brooklyn.core.network.OnPublicNetworkEnricherRebindTest.setUp()
2023-08-17 16:46:20,622 INFO o.a.b.c.m.r.InitialFullRebindIteration Rebind check: no existing state; will persist new items to /tmp/OnPublicNetworkEnricherRebindTest-kVh0
2023-08-17 16:46:20,709 INFO o.a.b.c.m.r.RebindTestFixture Test class org.apache.brooklyn.core.network.OnPublicNetworkEnricherRebindTest persisting to /tmp/OnPublicNetworkEnricherRebindTest-kVh0
2023-08-17 16:46:20,809 INFO o.a.b.t.s.LoggingVerboseReporter TESTNG PASSED CONFIGURATION: "Surefire test" - @BeforeMethod org.apache.brooklyn.core.network.OnPublicNetworkEnricherRebindTest.setUp() finished in 213 ms
2023-08-17 16:46:20,809 INFO o.a.b.t.s.LoggingVerboseReporter TESTNG INVOKING: "Surefire test" - org.apache.brooklyn.core.network.OnPublicNetworkEnricherRebindTest.testRebind()
2023-08-17 16:46:20,812 INFO o.a.b.c.l.a.PortForwardManagerLocationResolver Creating PortForwardManager(scope=global)
2023-08-17 16:46:20,894 INFO o.a.b.c.m.r.RebindTestUtils Rebinding app, using mementoDir /tmp/OnPublicNetworkEnricherRebindTest-kVh0; object store null
2023-08-17 16:46:20,932 INFO o.a.b.c.m.r.InitialFullRebindIteration Rebinding from /tmp/OnPublicNetworkEnricherRebindTest-kVh0 for master bEirUMFU...
2023-08-17 16:46:20,967 INFO o.a.b.c.l.a.PortForwardManagerLocationResolver Creating PortForwardManager(scope=global)
2023-08-17 16:46:20,969 INFO o.a.b.c.m.r.RebindIteration Rebind complete (MASTER) in 74ms: 1 app, 2 entities, 3 locations, 0 policies, 3 enrichers, 0 feeds, 0 catalog items, 0 catalog bundles
2023-08-17 16:46:21,103 INFO o.a.b.c.m.p.BrooklynPersistenceUtils Back-up of persisted state created on promotion, in /var/maven/.brooklyn/brooklyn-persisted-state/backups/2023-08-17-1646-bEirUMFU-promotion-f6Sk
2023-08-17 16:46:21,106 INFO o.a.b.t.s.LoggingVerboseReporter TESTNG PASSED: "Surefire test" - org.apache.brooklyn.core.network.OnPublicNetworkEnricherRebindTest.testRebind() finished in 297 ms
2023-08-17 16:46:21,106 INFO o.a.b.t.s.LoggingVerboseReporter TESTNG INVOKING CONFIGURATION: "Surefire test" - @AfterMethod org.apache.brooklyn.core.mgmt.rebind.RebindTestFixture.tearDown()
2023-08-17 16:46:21,123 INFO o.a.b.t.s.LoggingVerboseReporter TESTNG PASSED CONFIGURATION: "Surefire test" - @AfterMethod org.apache.brooklyn.core.mgmt.rebind.RebindTestFixture.tearDown() finished in 17 ms
[GC (Allocation Failure) 366736K->164221K(756224K), 0.0236258 secs]
2023-08-17 16:46:21,433 INFO o.a.b.t.s.LoggingVerboseReporter TESTNG
===============================================
Surefire test
Tests run: 2704, Failures: 1, Skips: 0
===============================================
[GC (Allocation Failure) 366702K->163918K(759296K), 0.0214292 secs]
[GC (Allocation Failure) 370766K->164538K(758272K), 0.0236869 secs]
2023-08-17 16:46:23,112 INFO o.a.b.t.s.LoggingVerboseReporter TESTNG RUNNING: Suite: "Surefire test" containing "0" Tests (config: null)
2023-08-17 16:46:23,175 INFO o.a.b.t.s.LoggingVerboseReporter TESTNG INVOKING: "Surefire test" - org.apache.brooklyn.util.core.logbook.opensearch.OpenSearchLogStoreTest.queryWithDateTimeTo()
2023-08-17 16:46:23,179 INFO o.a.b.t.s.LoggingVerboseReporter TESTNG PASSED: "Surefire test" - org.apache.brooklyn.util.core.logbook.opensearch.OpenSearchLogStoreTest.queryWithDateTimeTo() finished in 14 ms
2023-08-17 16:46:23,180 INFO o.a.b.t.s.LoggingVerboseReporter TESTNG INVOKING: "Surefire test" - org.apache.brooklyn.util.core.logbook.opensearch.OpenSearchLogStoreTest.queryWithEntityId()
2023-08-17 16:46:23,180 INFO o.a.b.t.s.LoggingVerboseReporter TESTNG PASSED: "Surefire test" - org.apache.brooklyn.util.core.logbook.opensearch.OpenSearchLogStoreTest.queryWithEntityId() finished in 15 ms
2023-08-17 16:46:23,180 INFO o.a.b.t.s.LoggingVerboseReporter TESTNG INVOKING: "Surefire test" - org.apache.brooklyn.util.core.logbook.opensearch.OpenSearchLogStoreTest.queryWithSearchSinglePhrase()
2023-08-17 16:46:23,180 INFO o.a.b.t.s.LoggingVerboseReporter TESTNG PASSED: "Surefire test" - org.apache.brooklyn.util.core.logbook.opensearch.OpenSearchLogStoreTest.queryWithSearchSinglePhrase() finished in 15 ms
2023-08-17 16:46:23,181 INFO o.a.b.t.s.LoggingVerboseReporter TESTNG INVOKING: "Surefire test" - org.apache.brooklyn.util.core.logbook.opensearch.OpenSearchLogStoreTest.queryWithEntityIdAndPhrase()
2023-08-17 16:46:23,181 INFO o.a.b.t.s.LoggingVerboseReporter TESTNG PASSED: "Surefire test" - org.apache.brooklyn.util.core.logbook.opensearch.OpenSearchLogStoreTest.queryWithEntityIdAndPhrase() finished in 15 ms
2023-08-17 16:46:23,181 INFO o.a.b.t.s.LoggingVerboseReporter TESTNG INVOKING: "Surefire test" - org.apache.brooklyn.util.core.logbook.opensearch.OpenSearchLogStoreTest.queryWithTaskId()
2023-08-17 16:46:23,181 INFO o.a.b.t.s.LoggingVerboseReporter TESTNG PASSED: "Surefire test" - org.apache.brooklyn.util.core.logbook.opensearch.OpenSearchLogStoreTest.queryWithTaskId() finished in 15 ms
2023-08-17 16:46:23,181 INFO o.a.b.t.s.LoggingVerboseReporter TESTNG INVOKING: "Surefire test" - org.apache.brooklyn.util.core.logbook.opensearch.OpenSearchLogStoreTest.queryWithTimeRange()
2023-08-17 16:46:23,181 INFO o.a.b.t.s.LoggingVerboseReporter TESTNG PASSED: "Surefire test" - org.apache.brooklyn.util.core.logbook.opensearch.OpenSearchLogStoreTest.queryWithTimeRange() finished in 15 ms
2023-08-17 16:46:23,182 INFO o.a.b.t.s.LoggingVerboseReporter TESTNG INVOKING: "Surefire test" - org.apache.brooklyn.util.core.logbook.opensearch.OpenSearchLogStoreTest.queryWithTaskIdAndPhrase()
2023-08-17 16:46:23,182 INFO o.a.b.t.s.LoggingVerboseReporter TESTNG PASSED: "Surefire test" - org.apache.brooklyn.util.core.logbook.opensearch.OpenSearchLogStoreTest.queryWithTaskIdAndPhrase() finished in 16 ms
2023-08-17 16:46:23,182 INFO o.a.b.t.s.LoggingVerboseReporter TESTNG INVOKING: "Surefire test" - org.apache.brooklyn.util.core.logbook.opensearch.OpenSearchLogStoreTest.queryWithTwoLogLevel()
2023-08-17 16:46:23,183 INFO o.a.b.t.s.LoggingVerboseReporter TESTNG PASSED: "Surefire test" - org.apache.brooklyn.util.core.logbook.opensearch.OpenSearchLogStoreTest.queryWithTwoLogLevel() finished in 17 ms
2023-08-17 16:46:23,183 INFO o.a.b.t.s.LoggingVerboseReporter TESTNG INVOKING: "Surefire test" - org.apache.brooklyn.util.core.logbook.opensearch.OpenSearchLogStoreTest.queryWithOneLogLevelAndRange()
2023-08-17 16:46:23,184 INFO o.a.b.t.s.LoggingVerboseReporter TESTNG PASSED: "Surefire test" - org.apache.brooklyn.util.core.logbook.opensearch.OpenSearchLogStoreTest.queryWithOneLogLevelAndRange() finished in 18 ms
2023-08-17 16:46:23,184 INFO o.a.b.t.s.LoggingVerboseReporter TESTNG INVOKING: "Surefire test" - org.apache.brooklyn.util.core.logbook.opensearch.OpenSearchLogStoreTest.queryWithDateTimeFrom()
2023-08-17 16:46:23,184 INFO o.a.b.t.s.LoggingVerboseReporter TESTNG PASSED: "Surefire test" - org.apache.brooklyn.util.core.logbook.opensearch.OpenSearchLogStoreTest.queryWithDateTimeFrom() finished in 18 ms
2023-08-17 16:46:23,184 INFO o.a.b.t.s.LoggingVerboseReporter TESTNG INVOKING: "Surefire test" - org.apache.brooklyn.util.core.logbook.opensearch.OpenSearchLogStoreTest.queryWithTwoLogLevelAndRange()
2023-08-17 16:46:23,185 INFO o.a.b.t.s.LoggingVerboseReporter TESTNG PASSED: "Surefire test" - org.apache.brooklyn.util.core.logbook.opensearch.OpenSearchLogStoreTest.queryWithTwoLogLevelAndRange() finished in 18 ms
2023-08-17 16:46:23,185 INFO o.a.b.t.s.LoggingVerboseReporter TESTNG INVOKING: "Surefire test" - org.apache.brooklyn.util.core.logbook.opensearch.OpenSearchLogStoreTest.queryWithTailRequest()
2023-08-17 16:46:23,185 INFO o.a.b.t.s.LoggingVerboseReporter TESTNG PASSED: "Surefire test" - org.apache.brooklyn.util.core.logbook.opensearch.OpenSearchLogStoreTest.queryWithTailRequest() finished in 19 ms
2023-08-17 16:46:23,188 INFO o.a.b.t.s.LoggingVerboseReporter TESTNG
===============================================
Surefire test
Tests run: 12, Failures: 0, Skips: 0
===============================================
Tests run: 2716, Failures: 1, Errors: 0, Skipped: 0, Time elapsed: 521.194 sec <<< FAILURE! - in TestSuite
testHttpFeedRegisteredInInitIsPersistedAndFeedsStop(org.apache.brooklyn.core.mgmt.rebind.RebindFeedTest) Time elapsed: 11.893 sec <<< FAILURE!
java.lang.IllegalStateException: Repeater unsatisfied after 10s 1ms: org.apache.brooklyn.core.mgmt.rebind.RebindTestFixture$1@52b8c599
at org.apache.brooklyn.core.mgmt.rebind.RebindFeedTest.testHttpFeedRegisteredInInitIsPersistedAndFeedsStop(RebindFeedTest.java:135)
2023-08-17 16:46:23,213 INFO o.a.b.c.m.i.BrooklynShutdownHooks Brooklyn shutdown: stopping entities [TestEntityImpl{id=ucfupo68n0}, TestEntityImpl{id=wg6a6m6rs3}, BlockingEntityImpl{id=hvkiwdyy3x}]
Results :
Failed tests:
RebindFeedTest.testHttpFeedRegisteredInInitIsPersistedAndFeedsStop:135->RebindTestFixture.waitForTaskCountToBecome:180->RebindTestFixture.waitForTaskCountToBecome:207 » IllegalState
Tests run: 2716, Failures: 1, Errors: 0, Skipped: 0
[INFO] ------------------------------------------------------------------------
[INFO] Reactor Summary:
[INFO]
[INFO] Brooklyn Server Root ............................... SUCCESS [ 15.324 s]
[INFO] Brooklyn Parent Project ............................ SUCCESS [ 16.098 s]
[INFO] Brooklyn Test Support Utilities .................... SUCCESS [ 10.532 s]
[INFO] Brooklyn Logback Includable Configuration .......... SUCCESS [ 0.518 s]
[INFO] Brooklyn Common Utilities .......................... SUCCESS [ 35.613 s]
[INFO] Brooklyn API ....................................... SUCCESS [ 3.235 s]
[INFO] CAMP Server Parent Project ......................... SUCCESS [ 0.234 s]
[INFO] CAMP Base .......................................... SUCCESS [ 3.959 s]
[INFO] Brooklyn Test Support .............................. SUCCESS [ 3.392 s]
[INFO] Brooklyn REST Swagger Apidoc Utilities ............. SUCCESS [ 5.663 s]
[INFO] Brooklyn Logback Configuration ..................... SUCCESS [ 0.258 s]
[INFO] CAMP Server ........................................ SUCCESS [ 9.125 s]
[INFO] Brooklyn Felix Runtime ............................. SUCCESS [ 5.062 s]
[INFO] Brooklyn Groovy Utilities .......................... SUCCESS [ 3.075 s]
[INFO] Brooklyn Core ...................................... FAILURE [10:07 min]
[INFO] Brooklyn Policies .................................. SKIPPED
[INFO] Brooklyn WinRM Software Entities ................... SKIPPED
[INFO] Brooklyn Secure JMXMP Agent ........................ SKIPPED
[INFO] Brooklyn JMX RMI Agent ............................. SKIPPED
[INFO] Brooklyn Jclouds Location Targets .................. SKIPPED
[INFO] Brooklyn Software Base ............................. SKIPPED
[INFO] Brooklyn CAMP ...................................... SKIPPED
[INFO] Brooklyn Launcher Common ........................... SKIPPED
[INFO] Brooklyn REST API .................................. SKIPPED
[INFO] Brooklyn REST Resources ............................ SKIPPED
[INFO] Brooklyn REST Server ............................... SKIPPED
[INFO] Brooklyn Launcher .................................. SKIPPED
[INFO] Brooklyn Container Location Targets ................ SKIPPED
[INFO] Brooklyn Command Line Interface .................... SKIPPED
[INFO] Brooklyn Test Framework ............................ SKIPPED
[INFO] Brooklyn OSGi init ................................. SKIPPED
[INFO] Brooklyn OSGi start ................................ SKIPPED
[INFO] Brooklyn Karaf ..................................... SKIPPED
[INFO] Jetty config fragment .............................. SKIPPED
[INFO] Apache Http Component extension .................... SKIPPED
[INFO] Brooklyn Karaf Features ............................ SKIPPED
[INFO] Brooklyn Karaf Shell Commands ...................... SKIPPED
[INFO] ------------------------------------------------------------------------
[INFO] BUILD FAILURE
[INFO] ------------------------------------------------------------------------
[INFO] Total time: 12:17 min
[INFO] Finished at: 2023-08-17T16:46:26Z
[INFO] Final Memory: 93M/2772M
[INFO] ------------------------------------------------------------------------
[ERROR] Failed to execute goal org.apache.maven.plugins:maven-surefire-plugin:2.19.1:test (default-test) on project brooklyn-core: There are test failures.
[ERROR]
[ERROR] Please refer to /home/jenkins/jenkins-agent/workspace/Brooklyn_brooklyn-server_master/core/target/surefire-reports for the individual test results.
[ERROR] -> [Help 1]
[ERROR]
[ERROR] To see the full stack trace of the errors, re-run Maven with the -e switch.
[ERROR] Re-run Maven using the -X switch to enable full debug logging.
[ERROR]
[ERROR] For more information about the errors and possible solutions, please read the following articles:
[ERROR] [Help 1] http://cwiki.apache.org/confluence/display/MAVEN/MojoFailureException
[ERROR]
[ERROR] After correcting the problems, you can resume the build with the command
[ERROR] mvn <goals> -rf :brooklyn-core
[Pipeline] }
$ docker stop --time=1 33fbddcca035469e50588d8794eda43ddc5bb41ee2796745a9048f45e1bce778
$ docker rm -f --volumes 33fbddcca035469e50588d8794eda43ddc5bb41ee2796745a9048f45e1bce778
[Pipeline] // withDockerContainer
[Pipeline] }
[Pipeline] // stage
[Pipeline] }
[Pipeline] // withEnv
[Pipeline] }
ERROR: script returned exit code 1
[Pipeline] // catchError
[Pipeline] stage
[Pipeline] { (Publish test results)
[Pipeline] junit
Recording test results
[Checks API] No suitable checks publisher found.
[Pipeline] testNG
TestNG Reports Processing: START
Looking for TestNG results report in workspace using pattern: **/testng-results.xml
Saving reports...
Processing '/home/jenkins/jenkins-home/jobs/Brooklyn/jobs/brooklyn-server/branches/master/builds/497/testng/testng-results-1.xml'
Processing '/home/jenkins/jenkins-home/jobs/Brooklyn/jobs/brooklyn-server/branches/master/builds/497/testng/testng-results-2.xml'
Processing '/home/jenkins/jenkins-home/jobs/Brooklyn/jobs/brooklyn-server/branches/master/builds/497/testng/testng-results-3.xml'
Processing '/home/jenkins/jenkins-home/jobs/Brooklyn/jobs/brooklyn-server/branches/master/builds/497/testng/testng-results-4.xml'
Processing '/home/jenkins/jenkins-home/jobs/Brooklyn/jobs/brooklyn-server/branches/master/builds/497/testng/testng-results-5.xml'
Processing '/home/jenkins/jenkins-home/jobs/Brooklyn/jobs/brooklyn-server/branches/master/builds/497/testng/testng-results-6.xml'
Processing '/home/jenkins/jenkins-home/jobs/Brooklyn/jobs/brooklyn-server/branches/master/builds/497/testng/testng-results-7.xml'
Processing '/home/jenkins/jenkins-home/jobs/Brooklyn/jobs/brooklyn-server/branches/master/builds/497/testng/testng-results.xml'
0.029762% of tests failed, which exceeded threshold of 0%. Marking build as UNSTABLE
TestNG Reports Processing: FINISH
[Pipeline] }
[Pipeline] // stage
[Pipeline] stage
[Pipeline] { (Send notifications)
[Pipeline] step