You are viewing a plain text version of this content. The canonical link for it is here.
Posted to dev@lucene.apache.org by Policeman Jenkins Server <je...@thetaphi.de> on 2015/09/29 02:55:43 UTC
[JENKINS-EA] Lucene-Solr-trunk-Linux (32bit/jdk1.9.0-ea-b78) -
Build # 14337 - Failure!
Build: http://jenkins.thetaphi.de/job/Lucene-Solr-trunk-Linux/14337/
Java: 32bit/jdk1.9.0-ea-b78 -client -XX:+UseParallelGC
3 tests failed.
FAILED: junit.framework.TestSuite.org.apache.solr.cloud.SaslZkACLProviderTest
Error Message:
5 threads leaked from SUITE scope at org.apache.solr.cloud.SaslZkACLProviderTest: 1) Thread[id=7584, name=apacheds, state=WAITING, group=TGRP-SaslZkACLProviderTest] at java.lang.Object.wait(Native Method) at java.lang.Object.wait(Object.java:516) at java.util.TimerThread.mainLoop(Timer.java:526) at java.util.TimerThread.run(Timer.java:505) 2) Thread[id=7585, name=groupCache.data, state=TIMED_WAITING, group=TGRP-SaslZkACLProviderTest] at sun.misc.Unsafe.park(Native Method) at java.util.concurrent.locks.LockSupport.parkNanos(LockSupport.java:215) at java.util.concurrent.locks.AbstractQueuedSynchronizer$ConditionObject.awaitNanos(AbstractQueuedSynchronizer.java:2078) at java.util.concurrent.ScheduledThreadPoolExecutor$DelayedWorkQueue.take(ScheduledThreadPoolExecutor.java:1093) at java.util.concurrent.ScheduledThreadPoolExecutor$DelayedWorkQueue.take(ScheduledThreadPoolExecutor.java:809) at java.util.concurrent.ThreadPoolExecutor.getTask(ThreadPoolExecutor.java:1067) at java.util.concurrent.ThreadPoolExecutor.runWorker(ThreadPoolExecutor.java:1127) at java.util.concurrent.ThreadPoolExecutor$Worker.run(ThreadPoolExecutor.java:617) at java.lang.Thread.run(Thread.java:746) 3) Thread[id=7587, name=changePwdReplayCache.data, state=TIMED_WAITING, group=TGRP-SaslZkACLProviderTest] at sun.misc.Unsafe.park(Native Method) at java.util.concurrent.locks.LockSupport.parkNanos(LockSupport.java:215) at java.util.concurrent.locks.AbstractQueuedSynchronizer$ConditionObject.awaitNanos(AbstractQueuedSynchronizer.java:2078) at java.util.concurrent.ScheduledThreadPoolExecutor$DelayedWorkQueue.take(ScheduledThreadPoolExecutor.java:1093) at java.util.concurrent.ScheduledThreadPoolExecutor$DelayedWorkQueue.take(ScheduledThreadPoolExecutor.java:809) at java.util.concurrent.ThreadPoolExecutor.getTask(ThreadPoolExecutor.java:1067) at java.util.concurrent.ThreadPoolExecutor.runWorker(ThreadPoolExecutor.java:1127) at java.util.concurrent.ThreadPoolExecutor$Worker.run(ThreadPoolExecutor.java:617) at java.lang.Thread.run(Thread.java:746) 4) Thread[id=7588, name=kdcReplayCache.data, state=TIMED_WAITING, group=TGRP-SaslZkACLProviderTest] at sun.misc.Unsafe.park(Native Method) at java.util.concurrent.locks.LockSupport.parkNanos(LockSupport.java:215) at java.util.concurrent.locks.AbstractQueuedSynchronizer$ConditionObject.awaitNanos(AbstractQueuedSynchronizer.java:2078) at java.util.concurrent.ScheduledThreadPoolExecutor$DelayedWorkQueue.take(ScheduledThreadPoolExecutor.java:1093) at java.util.concurrent.ScheduledThreadPoolExecutor$DelayedWorkQueue.take(ScheduledThreadPoolExecutor.java:809) at java.util.concurrent.ThreadPoolExecutor.getTask(ThreadPoolExecutor.java:1067) at java.util.concurrent.ThreadPoolExecutor.runWorker(ThreadPoolExecutor.java:1127) at java.util.concurrent.ThreadPoolExecutor$Worker.run(ThreadPoolExecutor.java:617) at java.lang.Thread.run(Thread.java:746) 5) Thread[id=7586, name=ou=system.data, state=TIMED_WAITING, group=TGRP-SaslZkACLProviderTest] at sun.misc.Unsafe.park(Native Method) at java.util.concurrent.locks.LockSupport.parkNanos(LockSupport.java:215) at java.util.concurrent.locks.AbstractQueuedSynchronizer$ConditionObject.awaitNanos(AbstractQueuedSynchronizer.java:2078) at java.util.concurrent.ScheduledThreadPoolExecutor$DelayedWorkQueue.take(ScheduledThreadPoolExecutor.java:1093) at java.util.concurrent.ScheduledThreadPoolExecutor$DelayedWorkQueue.take(ScheduledThreadPoolExecutor.java:809) at java.util.concurrent.ThreadPoolExecutor.getTask(ThreadPoolExecutor.java:1067) at java.util.concurrent.ThreadPoolExecutor.runWorker(ThreadPoolExecutor.java:1127) at java.util.concurrent.ThreadPoolExecutor$Worker.run(ThreadPoolExecutor.java:617) at java.lang.Thread.run(Thread.java:746)
Stack Trace:
com.carrotsearch.randomizedtesting.ThreadLeakError: 5 threads leaked from SUITE scope at org.apache.solr.cloud.SaslZkACLProviderTest:
1) Thread[id=7584, name=apacheds, state=WAITING, group=TGRP-SaslZkACLProviderTest]
at java.lang.Object.wait(Native Method)
at java.lang.Object.wait(Object.java:516)
at java.util.TimerThread.mainLoop(Timer.java:526)
at java.util.TimerThread.run(Timer.java:505)
2) Thread[id=7585, name=groupCache.data, state=TIMED_WAITING, group=TGRP-SaslZkACLProviderTest]
at sun.misc.Unsafe.park(Native Method)
at java.util.concurrent.locks.LockSupport.parkNanos(LockSupport.java:215)
at java.util.concurrent.locks.AbstractQueuedSynchronizer$ConditionObject.awaitNanos(AbstractQueuedSynchronizer.java:2078)
at java.util.concurrent.ScheduledThreadPoolExecutor$DelayedWorkQueue.take(ScheduledThreadPoolExecutor.java:1093)
at java.util.concurrent.ScheduledThreadPoolExecutor$DelayedWorkQueue.take(ScheduledThreadPoolExecutor.java:809)
at java.util.concurrent.ThreadPoolExecutor.getTask(ThreadPoolExecutor.java:1067)
at java.util.concurrent.ThreadPoolExecutor.runWorker(ThreadPoolExecutor.java:1127)
at java.util.concurrent.ThreadPoolExecutor$Worker.run(ThreadPoolExecutor.java:617)
at java.lang.Thread.run(Thread.java:746)
3) Thread[id=7587, name=changePwdReplayCache.data, state=TIMED_WAITING, group=TGRP-SaslZkACLProviderTest]
at sun.misc.Unsafe.park(Native Method)
at java.util.concurrent.locks.LockSupport.parkNanos(LockSupport.java:215)
at java.util.concurrent.locks.AbstractQueuedSynchronizer$ConditionObject.awaitNanos(AbstractQueuedSynchronizer.java:2078)
at java.util.concurrent.ScheduledThreadPoolExecutor$DelayedWorkQueue.take(ScheduledThreadPoolExecutor.java:1093)
at java.util.concurrent.ScheduledThreadPoolExecutor$DelayedWorkQueue.take(ScheduledThreadPoolExecutor.java:809)
at java.util.concurrent.ThreadPoolExecutor.getTask(ThreadPoolExecutor.java:1067)
at java.util.concurrent.ThreadPoolExecutor.runWorker(ThreadPoolExecutor.java:1127)
at java.util.concurrent.ThreadPoolExecutor$Worker.run(ThreadPoolExecutor.java:617)
at java.lang.Thread.run(Thread.java:746)
4) Thread[id=7588, name=kdcReplayCache.data, state=TIMED_WAITING, group=TGRP-SaslZkACLProviderTest]
at sun.misc.Unsafe.park(Native Method)
at java.util.concurrent.locks.LockSupport.parkNanos(LockSupport.java:215)
at java.util.concurrent.locks.AbstractQueuedSynchronizer$ConditionObject.awaitNanos(AbstractQueuedSynchronizer.java:2078)
at java.util.concurrent.ScheduledThreadPoolExecutor$DelayedWorkQueue.take(ScheduledThreadPoolExecutor.java:1093)
at java.util.concurrent.ScheduledThreadPoolExecutor$DelayedWorkQueue.take(ScheduledThreadPoolExecutor.java:809)
at java.util.concurrent.ThreadPoolExecutor.getTask(ThreadPoolExecutor.java:1067)
at java.util.concurrent.ThreadPoolExecutor.runWorker(ThreadPoolExecutor.java:1127)
at java.util.concurrent.ThreadPoolExecutor$Worker.run(ThreadPoolExecutor.java:617)
at java.lang.Thread.run(Thread.java:746)
5) Thread[id=7586, name=ou=system.data, state=TIMED_WAITING, group=TGRP-SaslZkACLProviderTest]
at sun.misc.Unsafe.park(Native Method)
at java.util.concurrent.locks.LockSupport.parkNanos(LockSupport.java:215)
at java.util.concurrent.locks.AbstractQueuedSynchronizer$ConditionObject.awaitNanos(AbstractQueuedSynchronizer.java:2078)
at java.util.concurrent.ScheduledThreadPoolExecutor$DelayedWorkQueue.take(ScheduledThreadPoolExecutor.java:1093)
at java.util.concurrent.ScheduledThreadPoolExecutor$DelayedWorkQueue.take(ScheduledThreadPoolExecutor.java:809)
at java.util.concurrent.ThreadPoolExecutor.getTask(ThreadPoolExecutor.java:1067)
at java.util.concurrent.ThreadPoolExecutor.runWorker(ThreadPoolExecutor.java:1127)
at java.util.concurrent.ThreadPoolExecutor$Worker.run(ThreadPoolExecutor.java:617)
at java.lang.Thread.run(Thread.java:746)
at __randomizedtesting.SeedInfo.seed([E21AAB9698467EF4]:0)
FAILED: junit.framework.TestSuite.org.apache.solr.cloud.SaslZkACLProviderTest
Error Message:
There are still zombie threads that couldn't be terminated: 1) Thread[id=7584, name=apacheds, state=WAITING, group=TGRP-SaslZkACLProviderTest] at java.lang.Object.wait(Native Method) at java.lang.Object.wait(Object.java:516) at java.util.TimerThread.mainLoop(Timer.java:526) at java.util.TimerThread.run(Timer.java:505) 2) Thread[id=7585, name=groupCache.data, state=TIMED_WAITING, group=TGRP-SaslZkACLProviderTest] at sun.misc.Unsafe.park(Native Method) at java.util.concurrent.locks.LockSupport.parkNanos(LockSupport.java:215) at java.util.concurrent.locks.AbstractQueuedSynchronizer$ConditionObject.awaitNanos(AbstractQueuedSynchronizer.java:2078) at java.util.concurrent.ScheduledThreadPoolExecutor$DelayedWorkQueue.take(ScheduledThreadPoolExecutor.java:1093) at java.util.concurrent.ScheduledThreadPoolExecutor$DelayedWorkQueue.take(ScheduledThreadPoolExecutor.java:809) at java.util.concurrent.ThreadPoolExecutor.getTask(ThreadPoolExecutor.java:1067) at java.util.concurrent.ThreadPoolExecutor.runWorker(ThreadPoolExecutor.java:1127) at java.util.concurrent.ThreadPoolExecutor$Worker.run(ThreadPoolExecutor.java:617) at java.lang.Thread.run(Thread.java:746) 3) Thread[id=7587, name=changePwdReplayCache.data, state=TIMED_WAITING, group=TGRP-SaslZkACLProviderTest] at sun.misc.Unsafe.park(Native Method) at java.util.concurrent.locks.LockSupport.parkNanos(LockSupport.java:215) at java.util.concurrent.locks.AbstractQueuedSynchronizer$ConditionObject.awaitNanos(AbstractQueuedSynchronizer.java:2078) at java.util.concurrent.ScheduledThreadPoolExecutor$DelayedWorkQueue.take(ScheduledThreadPoolExecutor.java:1093) at java.util.concurrent.ScheduledThreadPoolExecutor$DelayedWorkQueue.take(ScheduledThreadPoolExecutor.java:809) at java.util.concurrent.ThreadPoolExecutor.getTask(ThreadPoolExecutor.java:1067) at java.util.concurrent.ThreadPoolExecutor.runWorker(ThreadPoolExecutor.java:1127) at java.util.concurrent.ThreadPoolExecutor$Worker.run(ThreadPoolExecutor.java:617) at java.lang.Thread.run(Thread.java:746) 4) Thread[id=7588, name=kdcReplayCache.data, state=TIMED_WAITING, group=TGRP-SaslZkACLProviderTest] at sun.misc.Unsafe.park(Native Method) at java.util.concurrent.locks.LockSupport.parkNanos(LockSupport.java:215) at java.util.concurrent.locks.AbstractQueuedSynchronizer$ConditionObject.awaitNanos(AbstractQueuedSynchronizer.java:2078) at java.util.concurrent.ScheduledThreadPoolExecutor$DelayedWorkQueue.take(ScheduledThreadPoolExecutor.java:1093) at java.util.concurrent.ScheduledThreadPoolExecutor$DelayedWorkQueue.take(ScheduledThreadPoolExecutor.java:809) at java.util.concurrent.ThreadPoolExecutor.getTask(ThreadPoolExecutor.java:1067) at java.util.concurrent.ThreadPoolExecutor.runWorker(ThreadPoolExecutor.java:1127) at java.util.concurrent.ThreadPoolExecutor$Worker.run(ThreadPoolExecutor.java:617) at java.lang.Thread.run(Thread.java:746) 5) Thread[id=7586, name=ou=system.data, state=TIMED_WAITING, group=TGRP-SaslZkACLProviderTest] at sun.misc.Unsafe.park(Native Method) at java.util.concurrent.locks.LockSupport.parkNanos(LockSupport.java:215) at java.util.concurrent.locks.AbstractQueuedSynchronizer$ConditionObject.awaitNanos(AbstractQueuedSynchronizer.java:2078) at java.util.concurrent.ScheduledThreadPoolExecutor$DelayedWorkQueue.take(ScheduledThreadPoolExecutor.java:1093) at java.util.concurrent.ScheduledThreadPoolExecutor$DelayedWorkQueue.take(ScheduledThreadPoolExecutor.java:809) at java.util.concurrent.ThreadPoolExecutor.getTask(ThreadPoolExecutor.java:1067) at java.util.concurrent.ThreadPoolExecutor.runWorker(ThreadPoolExecutor.java:1127) at java.util.concurrent.ThreadPoolExecutor$Worker.run(ThreadPoolExecutor.java:617) at java.lang.Thread.run(Thread.java:746)
Stack Trace:
com.carrotsearch.randomizedtesting.ThreadLeakError: There are still zombie threads that couldn't be terminated:
1) Thread[id=7584, name=apacheds, state=WAITING, group=TGRP-SaslZkACLProviderTest]
at java.lang.Object.wait(Native Method)
at java.lang.Object.wait(Object.java:516)
at java.util.TimerThread.mainLoop(Timer.java:526)
at java.util.TimerThread.run(Timer.java:505)
2) Thread[id=7585, name=groupCache.data, state=TIMED_WAITING, group=TGRP-SaslZkACLProviderTest]
at sun.misc.Unsafe.park(Native Method)
at java.util.concurrent.locks.LockSupport.parkNanos(LockSupport.java:215)
at java.util.concurrent.locks.AbstractQueuedSynchronizer$ConditionObject.awaitNanos(AbstractQueuedSynchronizer.java:2078)
at java.util.concurrent.ScheduledThreadPoolExecutor$DelayedWorkQueue.take(ScheduledThreadPoolExecutor.java:1093)
at java.util.concurrent.ScheduledThreadPoolExecutor$DelayedWorkQueue.take(ScheduledThreadPoolExecutor.java:809)
at java.util.concurrent.ThreadPoolExecutor.getTask(ThreadPoolExecutor.java:1067)
at java.util.concurrent.ThreadPoolExecutor.runWorker(ThreadPoolExecutor.java:1127)
at java.util.concurrent.ThreadPoolExecutor$Worker.run(ThreadPoolExecutor.java:617)
at java.lang.Thread.run(Thread.java:746)
3) Thread[id=7587, name=changePwdReplayCache.data, state=TIMED_WAITING, group=TGRP-SaslZkACLProviderTest]
at sun.misc.Unsafe.park(Native Method)
at java.util.concurrent.locks.LockSupport.parkNanos(LockSupport.java:215)
at java.util.concurrent.locks.AbstractQueuedSynchronizer$ConditionObject.awaitNanos(AbstractQueuedSynchronizer.java:2078)
at java.util.concurrent.ScheduledThreadPoolExecutor$DelayedWorkQueue.take(ScheduledThreadPoolExecutor.java:1093)
at java.util.concurrent.ScheduledThreadPoolExecutor$DelayedWorkQueue.take(ScheduledThreadPoolExecutor.java:809)
at java.util.concurrent.ThreadPoolExecutor.getTask(ThreadPoolExecutor.java:1067)
at java.util.concurrent.ThreadPoolExecutor.runWorker(ThreadPoolExecutor.java:1127)
at java.util.concurrent.ThreadPoolExecutor$Worker.run(ThreadPoolExecutor.java:617)
at java.lang.Thread.run(Thread.java:746)
4) Thread[id=7588, name=kdcReplayCache.data, state=TIMED_WAITING, group=TGRP-SaslZkACLProviderTest]
at sun.misc.Unsafe.park(Native Method)
at java.util.concurrent.locks.LockSupport.parkNanos(LockSupport.java:215)
at java.util.concurrent.locks.AbstractQueuedSynchronizer$ConditionObject.awaitNanos(AbstractQueuedSynchronizer.java:2078)
at java.util.concurrent.ScheduledThreadPoolExecutor$DelayedWorkQueue.take(ScheduledThreadPoolExecutor.java:1093)
at java.util.concurrent.ScheduledThreadPoolExecutor$DelayedWorkQueue.take(ScheduledThreadPoolExecutor.java:809)
at java.util.concurrent.ThreadPoolExecutor.getTask(ThreadPoolExecutor.java:1067)
at java.util.concurrent.ThreadPoolExecutor.runWorker(ThreadPoolExecutor.java:1127)
at java.util.concurrent.ThreadPoolExecutor$Worker.run(ThreadPoolExecutor.java:617)
at java.lang.Thread.run(Thread.java:746)
5) Thread[id=7586, name=ou=system.data, state=TIMED_WAITING, group=TGRP-SaslZkACLProviderTest]
at sun.misc.Unsafe.park(Native Method)
at java.util.concurrent.locks.LockSupport.parkNanos(LockSupport.java:215)
at java.util.concurrent.locks.AbstractQueuedSynchronizer$ConditionObject.awaitNanos(AbstractQueuedSynchronizer.java:2078)
at java.util.concurrent.ScheduledThreadPoolExecutor$DelayedWorkQueue.take(ScheduledThreadPoolExecutor.java:1093)
at java.util.concurrent.ScheduledThreadPoolExecutor$DelayedWorkQueue.take(ScheduledThreadPoolExecutor.java:809)
at java.util.concurrent.ThreadPoolExecutor.getTask(ThreadPoolExecutor.java:1067)
at java.util.concurrent.ThreadPoolExecutor.runWorker(ThreadPoolExecutor.java:1127)
at java.util.concurrent.ThreadPoolExecutor$Worker.run(ThreadPoolExecutor.java:617)
at java.lang.Thread.run(Thread.java:746)
at __randomizedtesting.SeedInfo.seed([E21AAB9698467EF4]:0)
FAILED: org.apache.solr.cloud.SaslZkACLProviderTest.testSaslZkACLProvider
Error Message:
org.apache.directory.api.ldap.model.exception.LdapOtherException: org.apache.directory.api.ldap.model.exception.LdapOtherException: ERR_04447_CANNOT_NORMALIZE_VALUE Cannot normalize the wrapped value ERR_04473_NOT_VALID_VALUE Not a valid value '20090818022733Z' for the AttributeType 'ATTRIBUTE_TYPE ( 1.3.6.1.4.1.18060.0.4.1.2.35 NAME 'schemaModifyTimestamp' DESC time which schema was modified SUP modifyTimestamp EQUALITY generalizedTimeMatch ORDERING generalizedTimeOrderingMatch SYNTAX 1.3.6.1.4.1.1466.115.121.1.24 USAGE directoryOperation ) '
Stack Trace:
java.lang.RuntimeException: org.apache.directory.api.ldap.model.exception.LdapOtherException: org.apache.directory.api.ldap.model.exception.LdapOtherException: ERR_04447_CANNOT_NORMALIZE_VALUE Cannot normalize the wrapped value ERR_04473_NOT_VALID_VALUE Not a valid value '20090818022733Z' for the AttributeType 'ATTRIBUTE_TYPE ( 1.3.6.1.4.1.18060.0.4.1.2.35
NAME 'schemaModifyTimestamp'
DESC time which schema was modified
SUP modifyTimestamp
EQUALITY generalizedTimeMatch
ORDERING generalizedTimeOrderingMatch
SYNTAX 1.3.6.1.4.1.1466.115.121.1.24
USAGE directoryOperation
)
'
at org.apache.solr.cloud.SaslZkACLProviderTest$SaslZkTestServer.run(SaslZkACLProviderTest.java:211)
at org.apache.solr.cloud.SaslZkACLProviderTest.setUp(SaslZkACLProviderTest.java:81)
at sun.reflect.GeneratedMethodAccessor10.invoke(Unknown Source)
at sun.reflect.DelegatingMethodAccessorImpl.invoke(DelegatingMethodAccessorImpl.java:43)
at java.lang.reflect.Method.invoke(Method.java:504)
at com.carrotsearch.randomizedtesting.RandomizedRunner.invoke(RandomizedRunner.java:1665)
at com.carrotsearch.randomizedtesting.RandomizedRunner$9.evaluate(RandomizedRunner.java:898)
at com.carrotsearch.randomizedtesting.RandomizedRunner$10.evaluate(RandomizedRunner.java:914)
at com.carrotsearch.randomizedtesting.rules.SystemPropertiesRestoreRule$1.evaluate(SystemPropertiesRestoreRule.java:57)
at org.apache.lucene.util.TestRuleSetupTeardownChained$1.evaluate(TestRuleSetupTeardownChained.java:50)
at org.apache.lucene.util.AbstractBeforeAfterRule$1.evaluate(AbstractBeforeAfterRule.java:46)
at org.apache.lucene.util.TestRuleThreadAndTestName$1.evaluate(TestRuleThreadAndTestName.java:49)
at org.apache.lucene.util.TestRuleIgnoreAfterMaxFailures$1.evaluate(TestRuleIgnoreAfterMaxFailures.java:65)
at org.apache.lucene.util.TestRuleMarkFailure$1.evaluate(TestRuleMarkFailure.java:48)
at com.carrotsearch.randomizedtesting.rules.StatementAdapter.evaluate(StatementAdapter.java:36)
at com.carrotsearch.randomizedtesting.ThreadLeakControl$StatementRunner.run(ThreadLeakControl.java:367)
at com.carrotsearch.randomizedtesting.ThreadLeakControl.forkTimeoutingTask(ThreadLeakControl.java:809)
at com.carrotsearch.randomizedtesting.ThreadLeakControl$3.evaluate(ThreadLeakControl.java:460)
at com.carrotsearch.randomizedtesting.RandomizedRunner.runSingleTest(RandomizedRunner.java:873)
at com.carrotsearch.randomizedtesting.RandomizedRunner$5.evaluate(RandomizedRunner.java:775)
at com.carrotsearch.randomizedtesting.RandomizedRunner$6.evaluate(RandomizedRunner.java:809)
at com.carrotsearch.randomizedtesting.RandomizedRunner$7.evaluate(RandomizedRunner.java:820)
at com.carrotsearch.randomizedtesting.rules.StatementAdapter.evaluate(StatementAdapter.java:36)
at com.carrotsearch.randomizedtesting.rules.SystemPropertiesRestoreRule$1.evaluate(SystemPropertiesRestoreRule.java:57)
at org.apache.lucene.util.AbstractBeforeAfterRule$1.evaluate(AbstractBeforeAfterRule.java:46)
at com.carrotsearch.randomizedtesting.rules.StatementAdapter.evaluate(StatementAdapter.java:36)
at org.apache.lucene.util.TestRuleStoreClassName$1.evaluate(TestRuleStoreClassName.java:42)
at com.carrotsearch.randomizedtesting.rules.NoShadowingOrOverridesOnMethodsRule$1.evaluate(NoShadowingOrOverridesOnMethodsRule.java:39)
at com.carrotsearch.randomizedtesting.rules.NoShadowingOrOverridesOnMethodsRule$1.evaluate(NoShadowingOrOverridesOnMethodsRule.java:39)
at com.carrotsearch.randomizedtesting.rules.StatementAdapter.evaluate(StatementAdapter.java:36)
at com.carrotsearch.randomizedtesting.rules.StatementAdapter.evaluate(StatementAdapter.java:36)
at com.carrotsearch.randomizedtesting.rules.StatementAdapter.evaluate(StatementAdapter.java:36)
at org.apache.lucene.util.TestRuleAssertionsRequired$1.evaluate(TestRuleAssertionsRequired.java:54)
at org.apache.lucene.util.TestRuleMarkFailure$1.evaluate(TestRuleMarkFailure.java:48)
at org.apache.lucene.util.TestRuleIgnoreAfterMaxFailures$1.evaluate(TestRuleIgnoreAfterMaxFailures.java:65)
at org.apache.lucene.util.TestRuleIgnoreTestSuites$1.evaluate(TestRuleIgnoreTestSuites.java:55)
at com.carrotsearch.randomizedtesting.rules.StatementAdapter.evaluate(StatementAdapter.java:36)
at com.carrotsearch.randomizedtesting.ThreadLeakControl$StatementRunner.run(ThreadLeakControl.java:367)
at java.lang.Thread.run(Thread.java:746)
Caused by: org.apache.directory.api.ldap.model.exception.LdapOtherException: org.apache.directory.api.ldap.model.exception.LdapOtherException: ERR_04447_CANNOT_NORMALIZE_VALUE Cannot normalize the wrapped value ERR_04473_NOT_VALID_VALUE Not a valid value '20090818022733Z' for the AttributeType 'ATTRIBUTE_TYPE ( 1.3.6.1.4.1.18060.0.4.1.2.35
NAME 'schemaModifyTimestamp'
DESC time which schema was modified
SUP modifyTimestamp
EQUALITY generalizedTimeMatch
ORDERING generalizedTimeOrderingMatch
SYNTAX 1.3.6.1.4.1.1466.115.121.1.24
USAGE directoryOperation
)
'
at org.apache.directory.server.core.api.partition.AbstractPartition.initialize(AbstractPartition.java:84)
at org.apache.directory.server.core.DefaultDirectoryService.initialize(DefaultDirectoryService.java:1808)
at org.apache.directory.server.core.DefaultDirectoryService.startup(DefaultDirectoryService.java:1248)
at org.apache.hadoop.minikdc.MiniKdc.initDirectoryService(MiniKdc.java:383)
at org.apache.hadoop.minikdc.MiniKdc.start(MiniKdc.java:319)
at org.apache.solr.cloud.SaslZkACLProviderTest$SaslZkTestServer.run(SaslZkACLProviderTest.java:204)
... 38 more
Caused by: java.lang.RuntimeException: org.apache.directory.api.ldap.model.exception.LdapOtherException: ERR_04447_CANNOT_NORMALIZE_VALUE Cannot normalize the wrapped value ERR_04473_NOT_VALID_VALUE Not a valid value '20090818022733Z' for the AttributeType 'ATTRIBUTE_TYPE ( 1.3.6.1.4.1.18060.0.4.1.2.35
NAME 'schemaModifyTimestamp'
DESC time which schema was modified
SUP modifyTimestamp
EQUALITY generalizedTimeMatch
ORDERING generalizedTimeOrderingMatch
SYNTAX 1.3.6.1.4.1.1466.115.121.1.24
USAGE directoryOperation
)
'
at org.apache.directory.server.core.api.schema.SchemaPartition.doInit(SchemaPartition.java:226)
at org.apache.directory.server.core.api.partition.AbstractPartition.initialize(AbstractPartition.java:79)
... 43 more
Caused by: org.apache.directory.api.ldap.model.exception.LdapOtherException: ERR_04447_CANNOT_NORMALIZE_VALUE Cannot normalize the wrapped value ERR_04473_NOT_VALID_VALUE Not a valid value '20090818022733Z' for the AttributeType 'ATTRIBUTE_TYPE ( 1.3.6.1.4.1.18060.0.4.1.2.35
NAME 'schemaModifyTimestamp'
DESC time which schema was modified
SUP modifyTimestamp
EQUALITY generalizedTimeMatch
ORDERING generalizedTimeOrderingMatch
SYNTAX 1.3.6.1.4.1.1466.115.121.1.24
USAGE directoryOperation
)
'
at org.apache.directory.server.core.api.partition.AbstractPartition.initialize(AbstractPartition.java:84)
at org.apache.directory.server.core.api.schema.SchemaPartition.doInit(SchemaPartition.java:219)
... 44 more
Caused by: org.apache.directory.api.ldap.model.exception.LdapInvalidAttributeValueException: ERR_04447_CANNOT_NORMALIZE_VALUE Cannot normalize the wrapped value ERR_04473_NOT_VALID_VALUE Not a valid value '20090818022733Z' for the AttributeType 'ATTRIBUTE_TYPE ( 1.3.6.1.4.1.18060.0.4.1.2.35
NAME 'schemaModifyTimestamp'
DESC time which schema was modified
SUP modifyTimestamp
EQUALITY generalizedTimeMatch
ORDERING generalizedTimeOrderingMatch
SYNTAX 1.3.6.1.4.1.1466.115.121.1.24
USAGE directoryOperation
)
'
at org.apache.directory.api.ldap.model.entry.AbstractValue.apply(AbstractValue.java:211)
at org.apache.directory.api.ldap.model.entry.StringValue.<init>(StringValue.java:107)
at org.apache.directory.api.ldap.model.entry.DefaultAttribute.<init>(DefaultAttribute.java:468)
at org.apache.directory.api.ldap.model.entry.DefaultEntry.<init>(DefaultEntry.java:315)
at org.apache.directory.server.core.partition.ldif.LdifPartition.loadEntries(LdifPartition.java:517)
at org.apache.directory.server.core.partition.ldif.LdifPartition.loadEntries(LdifPartition.java:549)
at org.apache.directory.server.core.partition.ldif.LdifPartition.doInit(LdifPartition.java:164)
at org.apache.directory.server.core.api.partition.AbstractPartition.initialize(AbstractPartition.java:79)
... 45 more
Caused by: org.apache.directory.api.ldap.model.exception.LdapInvalidAttributeValueException: ERR_04473_NOT_VALID_VALUE Not a valid value '20090818022733Z' for the AttributeType 'ATTRIBUTE_TYPE ( 1.3.6.1.4.1.18060.0.4.1.2.35
NAME 'schemaModifyTimestamp'
DESC time which schema was modified
SUP modifyTimestamp
EQUALITY generalizedTimeMatch
ORDERING generalizedTimeOrderingMatch
SYNTAX 1.3.6.1.4.1.1466.115.121.1.24
USAGE directoryOperation
)
'
at org.apache.directory.api.ldap.model.entry.AbstractValue.apply(AbstractValue.java:204)
... 52 more
Build Log:
[...truncated 10625 lines...]
[junit4] Suite: org.apache.solr.cloud.SaslZkACLProviderTest
[junit4] 2> Creating dataDir: /home/jenkins/workspace/Lucene-Solr-trunk-Linux/solr/build/solr-core/test/J0/temp/solr.cloud.SaslZkACLProviderTest_E21AAB9698467EF4-001/init-core-data-001
[junit4] 2> 1235714 INFO (SUITE-SaslZkACLProviderTest-seed#[E21AAB9698467EF4]-worker) [ ] o.a.s.SolrTestCaseJ4 Randomized ssl (true) and clientAuth (false)
[junit4] 2> 1235716 INFO (TEST-SaslZkACLProviderTest.testSaslZkACLProvider-seed#[E21AAB9698467EF4]) [ ] o.a.s.SolrTestCaseJ4 ###Starting testSaslZkACLProvider
[junit4] 2> 1235717 INFO (TEST-SaslZkACLProviderTest.testSaslZkACLProvider-seed#[E21AAB9698467EF4]) [ ] o.a.s.c.SaslZkACLProviderTest ####SETUP_START testSaslZkACLProvider
[junit4] 2> 1235717 INFO (TEST-SaslZkACLProviderTest.testSaslZkACLProvider-seed#[E21AAB9698467EF4]) [ ] o.a.s.c.SaslZkACLProviderTest ZooKeeper dataDir:/home/jenkins/workspace/Lucene-Solr-trunk-Linux/solr/build/solr-core/test/J0/temp/solr.cloud.SaslZkACLProviderTest_E21AAB9698467EF4-001/tempDir-002/zookeeper/server1/data
[junit4] 2> 1237881 WARN (TEST-SaslZkACLProviderTest.testSaslZkACLProvider-seed#[E21AAB9698467EF4]) [ ] o.a.d.a.l.m.e.DefaultEntry The attribute 'schemamodifytimestamp' cannot be stored
[junit4] 2> 1237905 ERROR (TEST-SaslZkACLProviderTest.testSaslZkACLProvider-seed#[E21AAB9698467EF4]) [ ] o.a.d.s.c.a.s.SchemaPartition ERR_90 Failed to initialize wrapped partition.
[junit4] 2> org.apache.directory.api.ldap.model.exception.LdapOtherException: ERR_04447_CANNOT_NORMALIZE_VALUE Cannot normalize the wrapped value ERR_04473_NOT_VALID_VALUE Not a valid value '20090818022733Z' for the AttributeType 'ATTRIBUTE_TYPE ( 1.3.6.1.4.1.18060.0.4.1.2.35
[junit4] 2> NAME 'schemaModifyTimestamp'
[junit4] 2> DESC time which schema was modified
[junit4] 2> SUP modifyTimestamp
[junit4] 2> EQUALITY generalizedTimeMatch
[junit4] 2> ORDERING generalizedTimeOrderingMatch
[junit4] 2> SYNTAX 1.3.6.1.4.1.1466.115.121.1.24
[junit4] 2> USAGE directoryOperation
[junit4] 2> )
[junit4] 2> '
[junit4] 2> at org.apache.directory.server.core.api.partition.AbstractPartition.initialize(AbstractPartition.java:84)
[junit4] 2> at org.apache.directory.server.core.api.schema.SchemaPartition.doInit(SchemaPartition.java:219)
[junit4] 2> at org.apache.directory.server.core.api.partition.AbstractPartition.initialize(AbstractPartition.java:79)
[junit4] 2> at org.apache.directory.server.core.DefaultDirectoryService.initialize(DefaultDirectoryService.java:1808)
[junit4] 2> at org.apache.directory.server.core.DefaultDirectoryService.startup(DefaultDirectoryService.java:1248)
[junit4] 2> at org.apache.hadoop.minikdc.MiniKdc.initDirectoryService(MiniKdc.java:383)
[junit4] 2> at org.apache.hadoop.minikdc.MiniKdc.start(MiniKdc.java:319)
[junit4] 2> at org.apache.solr.cloud.SaslZkACLProviderTest$SaslZkTestServer.run(SaslZkACLProviderTest.java:204)
[junit4] 2> at org.apache.solr.cloud.SaslZkACLProviderTest.setUp(SaslZkACLProviderTest.java:81)
[junit4] 2> at sun.reflect.GeneratedMethodAccessor10.invoke(Unknown Source)
[junit4] 2> at sun.reflect.DelegatingMethodAccessorImpl.invoke(DelegatingMethodAccessorImpl.java:43)
[junit4] 2> at java.lang.reflect.Method.invoke(Method.java:504)
[junit4] 2> at com.carrotsearch.randomizedtesting.RandomizedRunner.invoke(RandomizedRunner.java:1665)
[junit4] 2> at com.carrotsearch.randomizedtesting.RandomizedRunner$9.evaluate(RandomizedRunner.java:898)
[junit4] 2> at com.carrotsearch.randomizedtesting.RandomizedRunner$10.evaluate(RandomizedRunner.java:914)
[junit4] 2> at com.carrotsearch.randomizedtesting.rules.SystemPropertiesRestoreRule$1.evaluate(SystemPropertiesRestoreRule.java:57)
[junit4] 2> at org.apache.lucene.util.TestRuleSetupTeardownChained$1.evaluate(TestRuleSetupTeardownChained.java:50)
[junit4] 2> at org.apache.lucene.util.AbstractBeforeAfterRule$1.evaluate(AbstractBeforeAfterRule.java:46)
[junit4] 2> at org.apache.lucene.util.TestRuleThreadAndTestName$1.evaluate(TestRuleThreadAndTestName.java:49)
[junit4] 2> at org.apache.lucene.util.TestRuleIgnoreAfterMaxFailures$1.evaluate(TestRuleIgnoreAfterMaxFailures.java:65)
[junit4] 2> at org.apache.lucene.util.TestRuleMarkFailure$1.evaluate(TestRuleMarkFailure.java:48)
[junit4] 2> at com.carrotsearch.randomizedtesting.rules.StatementAdapter.evaluate(StatementAdapter.java:36)
[junit4] 2> at com.carrotsearch.randomizedtesting.ThreadLeakControl$StatementRunner.run(ThreadLeakControl.java:367)
[junit4] 2> at com.carrotsearch.randomizedtesting.ThreadLeakControl.forkTimeoutingTask(ThreadLeakControl.java:809)
[junit4] 2> at com.carrotsearch.randomizedtesting.ThreadLeakControl$3.evaluate(ThreadLeakControl.java:460)
[junit4] 2> at com.carrotsearch.randomizedtesting.RandomizedRunner.runSingleTest(RandomizedRunner.java:873)
[junit4] 2> at com.carrotsearch.randomizedtesting.RandomizedRunner$5.evaluate(RandomizedRunner.java:775)
[junit4] 2> at com.carrotsearch.randomizedtesting.RandomizedRunner$6.evaluate(RandomizedRunner.java:809)
[junit4] 2> at com.carrotsearch.randomizedtesting.RandomizedRunner$7.evaluate(RandomizedRunner.java:820)
[junit4] 2> at com.carrotsearch.randomizedtesting.rules.StatementAdapter.evaluate(StatementAdapter.java:36)
[junit4] 2> at com.carrotsearch.randomizedtesting.rules.SystemPropertiesRestoreRule$1.evaluate(SystemPropertiesRestoreRule.java:57)
[junit4] 2> at org.apache.lucene.util.AbstractBeforeAfterRule$1.evaluate(AbstractBeforeAfterRule.java:46)
[junit4] 2> at com.carrotsearch.randomizedtesting.rules.StatementAdapter.evaluate(StatementAdapter.java:36)
[junit4] 2> at org.apache.lucene.util.TestRuleStoreClassName$1.evaluate(TestRuleStoreClassName.java:42)
[junit4] 2> at com.carrotsearch.randomizedtesting.rules.NoShadowingOrOverridesOnMethodsRule$1.evaluate(NoShadowingOrOverridesOnMethodsRule.java:39)
[junit4] 2> at com.carrotsearch.randomizedtesting.rules.NoShadowingOrOverridesOnMethodsRule$1.evaluate(NoShadowingOrOverridesOnMethodsRule.java:39)
[junit4] 2> at com.carrotsearch.randomizedtesting.rules.StatementAdapter.evaluate(StatementAdapter.java:36)
[junit4] 2> at com.carrotsearch.randomizedtesting.rules.StatementAdapter.evaluate(StatementAdapter.java:36)
[junit4] 2> at com.carrotsearch.randomizedtesting.rules.StatementAdapter.evaluate(StatementAdapter.java:36)
[junit4] 2> at org.apache.lucene.util.TestRuleAssertionsRequired$1.evaluate(TestRuleAssertionsRequired.java:54)
[junit4] 2> at org.apache.lucene.util.TestRuleMarkFailure$1.evaluate(TestRuleMarkFailure.java:48)
[junit4] 2> at org.apache.lucene.util.TestRuleIgnoreAfterMaxFailures$1.evaluate(TestRuleIgnoreAfterMaxFailures.java:65)
[junit4] 2> at org.apache.lucene.util.TestRuleIgnoreTestSuites$1.evaluate(TestRuleIgnoreTestSuites.java:55)
[junit4] 2> at com.carrotsearch.randomizedtesting.rules.StatementAdapter.evaluate(StatementAdapter.java:36)
[junit4] 2> at com.carrotsearch.randomizedtesting.ThreadLeakControl$StatementRunner.run(ThreadLeakControl.java:367)
[junit4] 2> at java.lang.Thread.run(Thread.java:746)
[junit4] 2> Caused by: org.apache.directory.api.ldap.model.exception.LdapInvalidAttributeValueException: ERR_04447_CANNOT_NORMALIZE_VALUE Cannot normalize the wrapped value ERR_04473_NOT_VALID_VALUE Not a valid value '20090818022733Z' for the AttributeType 'ATTRIBUTE_TYPE ( 1.3.6.1.4.1.18060.0.4.1.2.35
[junit4] 2> NAME 'schemaModifyTimestamp'
[junit4] 2> DESC time which schema was modified
[junit4] 2> SUP modifyTimestamp
[junit4] 2> EQUALITY generalizedTimeMatch
[junit4] 2> ORDERING generalizedTimeOrderingMatch
[junit4] 2> SYNTAX 1.3.6.1.4.1.1466.115.121.1.24
[junit4] 2> USAGE directoryOperation
[junit4] 2> )
[junit4] 2> '
[junit4] 2> at org.apache.directory.api.ldap.model.entry.AbstractValue.apply(AbstractValue.java:211)
[junit4] 2> at org.apache.directory.api.ldap.model.entry.StringValue.<init>(StringValue.java:107)
[junit4] 2> at org.apache.directory.api.ldap.model.entry.DefaultAttribute.<init>(DefaultAttribute.java:468)
[junit4] 2> at org.apache.directory.api.ldap.model.entry.DefaultEntry.<init>(DefaultEntry.java:315)
[junit4] 2> at org.apache.directory.server.core.partition.ldif.LdifPartition.loadEntries(LdifPartition.java:517)
[junit4] 2> at org.apache.directory.server.core.partition.ldif.LdifPartition.loadEntries(LdifPartition.java:549)
[junit4] 2> at org.apache.directory.server.core.partition.ldif.LdifPartition.doInit(LdifPartition.java:164)
[junit4] 2> at org.apache.directory.server.core.api.partition.AbstractPartition.initialize(AbstractPartition.java:79)
[junit4] 2> ... 45 more
[junit4] 2> Caused by: org.apache.directory.api.ldap.model.exception.LdapInvalidAttributeValueException: ERR_04473_NOT_VALID_VALUE Not a valid value '20090818022733Z' for the AttributeType 'ATTRIBUTE_TYPE ( 1.3.6.1.4.1.18060.0.4.1.2.35
[junit4] 2> NAME 'schemaModifyTimestamp'
[junit4] 2> DESC time which schema was modified
[junit4] 2> SUP modifyTimestamp
[junit4] 2> EQUALITY generalizedTimeMatch
[junit4] 2> ORDERING generalizedTimeOrderingMatch
[junit4] 2> SYNTAX 1.3.6.1.4.1.1466.115.121.1.24
[junit4] 2> USAGE directoryOperation
[junit4] 2> )
[junit4] 2> '
[junit4] 2> at org.apache.directory.api.ldap.model.entry.AbstractValue.apply(AbstractValue.java:204)
[junit4] 2> ... 52 more
[junit4] 2> NOTE: reproduce with: ant test -Dtestcase=SaslZkACLProviderTest -Dtests.method=testSaslZkACLProvider -Dtests.seed=E21AAB9698467EF4 -Dtests.multiplier=3 -Dtests.slow=true -Dtests.locale=uz -Dtests.timezone=Europe/Zagreb -Dtests.asserts=true -Dtests.file.encoding=UTF-8
[junit4] ERROR 2.20s J0 | SaslZkACLProviderTest.testSaslZkACLProvider <<<
[junit4] > Throwable #1: java.lang.RuntimeException: org.apache.directory.api.ldap.model.exception.LdapOtherException: org.apache.directory.api.ldap.model.exception.LdapOtherException: ERR_04447_CANNOT_NORMALIZE_VALUE Cannot normalize the wrapped value ERR_04473_NOT_VALID_VALUE Not a valid value '20090818022733Z' for the AttributeType 'ATTRIBUTE_TYPE ( 1.3.6.1.4.1.18060.0.4.1.2.35
[junit4] > NAME 'schemaModifyTimestamp'
[junit4] > DESC time which schema was modified
[junit4] > SUP modifyTimestamp
[junit4] > EQUALITY generalizedTimeMatch
[junit4] > ORDERING generalizedTimeOrderingMatch
[junit4] > SYNTAX 1.3.6.1.4.1.1466.115.121.1.24
[junit4] > USAGE directoryOperation
[junit4] > )
[junit4] > '
[junit4] > at org.apache.solr.cloud.SaslZkACLProviderTest$SaslZkTestServer.run(SaslZkACLProviderTest.java:211)
[junit4] > at org.apache.solr.cloud.SaslZkACLProviderTest.setUp(SaslZkACLProviderTest.java:81)
[junit4] > at java.lang.Thread.run(Thread.java:746)
[junit4] > Caused by: org.apache.directory.api.ldap.model.exception.LdapOtherException: org.apache.directory.api.ldap.model.exception.LdapOtherException: ERR_04447_CANNOT_NORMALIZE_VALUE Cannot normalize the wrapped value ERR_04473_NOT_VALID_VALUE Not a valid value '20090818022733Z' for the AttributeType 'ATTRIBUTE_TYPE ( 1.3.6.1.4.1.18060.0.4.1.2.35
[junit4] > NAME 'schemaModifyTimestamp'
[junit4] > DESC time which schema was modified
[junit4] > SUP modifyTimestamp
[junit4] > EQUALITY generalizedTimeMatch
[junit4] > ORDERING generalizedTimeOrderingMatch
[junit4] > SYNTAX 1.3.6.1.4.1.1466.115.121.1.24
[junit4] > USAGE directoryOperation
[junit4] > )
[junit4] > '
[junit4] > at org.apache.directory.server.core.api.partition.AbstractPartition.initialize(AbstractPartition.java:84)
[junit4] > at org.apache.directory.server.core.DefaultDirectoryService.initialize(DefaultDirectoryService.java:1808)
[junit4] > at org.apache.directory.server.core.DefaultDirectoryService.startup(DefaultDirectoryService.java:1248)
[junit4] > at org.apache.hadoop.minikdc.MiniKdc.initDirectoryService(MiniKdc.java:383)
[junit4] > at org.apache.hadoop.minikdc.MiniKdc.start(MiniKdc.java:319)
[junit4] > at org.apache.solr.cloud.SaslZkACLProviderTest$SaslZkTestServer.run(SaslZkACLProviderTest.java:204)
[junit4] > ... 38 more
[junit4] > Caused by: java.lang.RuntimeException: org.apache.directory.api.ldap.model.exception.LdapOtherException: ERR_04447_CANNOT_NORMALIZE_VALUE Cannot normalize the wrapped value ERR_04473_NOT_VALID_VALUE Not a valid value '20090818022733Z' for the AttributeType 'ATTRIBUTE_TYPE ( 1.3.6.1.4.1.18060.0.4.1.2.35
[junit4] > NAME 'schemaModifyTimestamp'
[junit4] > DESC time which schema was modified
[junit4] > SUP modifyTimestamp
[junit4] > EQUALITY generalizedTimeMatch
[junit4] > ORDERING generalizedTimeOrderingMatch
[junit4] > SYNTAX 1.3.6.1.4.1.1466.115.121.1.24
[junit4] > USAGE directoryOperation
[junit4] > )
[junit4] > '
[junit4] > at org.apache.directory.server.core.api.schema.SchemaPartition.doInit(SchemaPartition.java:226)
[junit4] > at org.apache.directory.server.core.api.partition.AbstractPartition.initialize(AbstractPartition.java:79)
[junit4] > ... 43 more
[junit4] > Caused by: org.apache.directory.api.ldap.model.exception.LdapOtherException: ERR_04447_CANNOT_NORMALIZE_VALUE Cannot normalize the wrapped value ERR_04473_NOT_VALID_VALUE Not a valid value '20090818022733Z' for the AttributeType 'ATTRIBUTE_TYPE ( 1.3.6.1.4.1.18060.0.4.1.2.35
[junit4] > NAME 'schemaModifyTimestamp'
[junit4] > DESC time which schema was modified
[junit4] > SUP modifyTimestamp
[junit4] > EQUALITY generalizedTimeMatch
[junit4] > ORDERING generalizedTimeOrderingMatch
[junit4] > SYNTAX 1.3.6.1.4.1.1466.115.121.1.24
[junit4] > USAGE directoryOperation
[junit4] > )
[junit4] > '
[junit4] > at org.apache.directory.server.core.api.partition.AbstractPartition.initialize(AbstractPartition.java:84)
[junit4] > at org.apache.directory.server.core.api.schema.SchemaPartition.doInit(SchemaPartition.java:219)
[junit4] > ... 44 more
[junit4] > Caused by: org.apache.directory.api.ldap.model.exception.LdapInvalidAttributeValueException: ERR_04447_CANNOT_NORMALIZE_VALUE Cannot normalize the wrapped value ERR_04473_NOT_VALID_VALUE Not a valid value '20090818022733Z' for the AttributeType 'ATTRIBUTE_TYPE ( 1.3.6.1.4.1.18060.0.4.1.2.35
[junit4] > NAME 'schemaModifyTimestamp'
[junit4] > DESC time which schema was modified
[junit4] > SUP modifyTimestamp
[junit4] > EQUALITY generalizedTimeMatch
[junit4] > ORDERING generalizedTimeOrderingMatch
[junit4] > SYNTAX 1.3.6.1.4.1.1466.115.121.1.24
[junit4] > USAGE directoryOperation
[junit4] > )
[junit4] > '
[junit4] > at org.apache.directory.api.ldap.model.entry.AbstractValue.apply(AbstractValue.java:211)
[junit4] > at org.apache.directory.api.ldap.model.entry.StringValue.<init>(StringValue.java:107)
[junit4] > at org.apache.directory.api.ldap.model.entry.DefaultAttribute.<init>(DefaultAttribute.java:468)
[junit4] > at org.apache.directory.api.ldap.model.entry.DefaultEntry.<init>(DefaultEntry.java:315)
[junit4] > at org.apache.directory.server.core.partition.ldif.LdifPartition.loadEntries(LdifPartition.java:517)
[junit4] > at org.apache.directory.server.core.partition.ldif.LdifPartition.loadEntries(LdifPartition.java:549)
[junit4] > at org.apache.directory.server.core.partition.ldif.LdifPartition.doInit(LdifPartition.java:164)
[junit4] > at org.apache.directory.server.core.api.partition.AbstractPartition.initialize(AbstractPartition.java:79)
[junit4] > ... 45 more
[junit4] > Caused by: org.apache.directory.api.ldap.model.exception.LdapInvalidAttributeValueException: ERR_04473_NOT_VALID_VALUE Not a valid value '20090818022733Z' for the AttributeType 'ATTRIBUTE_TYPE ( 1.3.6.1.4.1.18060.0.4.1.2.35
[junit4] > NAME 'schemaModifyTimestamp'
[junit4] > DESC time which schema was modified
[junit4] > SUP modifyTimestamp
[junit4] > EQUALITY generalizedTimeMatch
[junit4] > ORDERING generalizedTimeOrderingMatch
[junit4] > SYNTAX 1.3.6.1.4.1.1466.115.121.1.24
[junit4] > USAGE directoryOperation
[junit4] > )
[junit4] > '
[junit4] > at org.apache.directory.api.ldap.model.entry.AbstractValue.apply(AbstractValue.java:204)
[junit4] > ... 52 moreThrowable #2: java.lang.NullPointerException
[junit4] > at org.apache.solr.cloud.ZkTestServer$ZKServerMain.shutdown(ZkTestServer.java:334)
[junit4] > at org.apache.solr.cloud.ZkTestServer.shutdown(ZkTestServer.java:526)
[junit4] > at org.apache.solr.cloud.SaslZkACLProviderTest$SaslZkTestServer.shutdown(SaslZkACLProviderTest.java:218)
[junit4] > at org.apache.solr.cloud.SaslZkACLProviderTest.tearDown(SaslZkACLProviderTest.java:116)
[junit4] > at java.lang.Thread.run(Thread.java:746)
[junit4] 2> 1237915 INFO (SUITE-SaslZkACLProviderTest-seed#[E21AAB9698467EF4]-worker) [ ] o.a.s.SolrTestCaseJ4 ###deleteCore
[junit4] 2> NOTE: leaving temporary files on disk at: /home/jenkins/workspace/Lucene-Solr-trunk-Linux/solr/build/solr-core/test/J0/temp/solr.cloud.SaslZkACLProviderTest_E21AAB9698467EF4-001
[junit4] 2> Sep 29, 2015 12:52:16 AM com.carrotsearch.randomizedtesting.ThreadLeakControl checkThreadLeaks
[junit4] 2> WARNING: Will linger awaiting termination of 5 leaked thread(s).
[junit4] 2> Sep 29, 2015 12:52:37 AM com.carrotsearch.randomizedtesting.ThreadLeakControl checkThreadLeaks
[junit4] 2> SEVERE: 5 threads leaked from SUITE scope at org.apache.solr.cloud.SaslZkACLProviderTest:
[junit4] 2> 1) Thread[id=7584, name=apacheds, state=WAITING, group=TGRP-SaslZkACLProviderTest]
[junit4] 2> at java.lang.Object.wait(Native Method)
[junit4] 2> at java.lang.Object.wait(Object.java:516)
[junit4] 2> at java.util.TimerThread.mainLoop(Timer.java:526)
[junit4] 2> at java.util.TimerThread.run(Timer.java:505)
[junit4] 2> 2) Thread[id=7585, name=groupCache.data, state=TIMED_WAITING, group=TGRP-SaslZkACLProviderTest]
[junit4] 2> at sun.misc.Unsafe.park(Native Method)
[junit4] 2> at java.util.concurrent.locks.LockSupport.parkNanos(LockSupport.java:215)
[junit4] 2> at java.util.concurrent.locks.AbstractQueuedSynchronizer$ConditionObject.awaitNanos(AbstractQueuedSynchronizer.java:2078)
[junit4] 2> at java.util.concurrent.ScheduledThreadPoolExecutor$DelayedWorkQueue.take(ScheduledThreadPoolExecutor.java:1093)
[junit4] 2> at java.util.concurrent.ScheduledThreadPoolExecutor$DelayedWorkQueue.take(ScheduledThreadPoolExecutor.java:809)
[junit4] 2> at java.util.concurrent.ThreadPoolExecutor.getTask(ThreadPoolExecutor.java:1067)
[junit4] 2> at java.util.concurrent.ThreadPoolExecutor.runWorker(ThreadPoolExecutor.java:1127)
[junit4] 2> at java.util.concurrent.ThreadPoolExecutor$Worker.run(ThreadPoolExecutor.java:617)
[junit4] 2> at java.lang.Thread.run(Thread.java:746)
[junit4] 2> 3) Thread[id=7587, name=changePwdReplayCache.data, state=TIMED_WAITING, group=TGRP-SaslZkACLProviderTest]
[junit4] 2> at sun.misc.Unsafe.park(Native Method)
[junit4] 2> at java.util.concurrent.locks.LockSupport.parkNanos(LockSupport.java:215)
[junit4] 2> at java.util.concurrent.locks.AbstractQueuedSynchronizer$ConditionObject.awaitNanos(AbstractQueuedSynchronizer.java:2078)
[junit4] 2> at java.util.concurrent.ScheduledThreadPoolExecutor$DelayedWorkQueue.take(ScheduledThreadPoolExecutor.java:1093)
[junit4] 2> at java.util.concurrent.ScheduledThreadPoolExecutor$DelayedWorkQueue.take(ScheduledThreadPoolExecutor.java:809)
[junit4] 2> at java.util.concurrent.ThreadPoolExecutor.getTask(ThreadPoolExecutor.java:1067)
[junit4] 2> at java.util.concurrent.ThreadPoolExecutor.runWorker(ThreadPoolExecutor.java:1127)
[junit4] 2> at java.util.concurrent.ThreadPoolExecutor$Worker.run(ThreadPoolExecutor.java:617)
[junit4] 2> at java.lang.Thread.run(Thread.java:746)
[junit4] 2> 4) Thread[id=7588, name=kdcReplayCache.data, state=TIMED_WAITING, group=TGRP-SaslZkACLProviderTest]
[junit4] 2> at sun.misc.Unsafe.park(Native Method)
[junit4] 2> at java.util.concurrent.locks.LockSupport.parkNanos(LockSupport.java:215)
[junit4] 2> at java.util.concurrent.locks.AbstractQueuedSynchronizer$ConditionObject.awaitNanos(AbstractQueuedSynchronizer.java:2078)
[junit4] 2> at java.util.concurrent.ScheduledThreadPoolExecutor$DelayedWorkQueue.take(ScheduledThreadPoolExecutor.java:1093)
[junit4] 2> at java.util.concurrent.ScheduledThreadPoolExecutor$DelayedWorkQueue.take(ScheduledThreadPoolExecutor.java:809)
[junit4] 2> at java.util.concurrent.ThreadPoolExecutor.getTask(ThreadPoolExecutor.java:1067)
[junit4] 2> at java.util.concurrent.ThreadPoolExecutor.runWorker(ThreadPoolExecutor.java:1127)
[junit4] 2> at java.util.concurrent.ThreadPoolExecutor$Worker.run(ThreadPoolExecutor.java:617)
[junit4] 2> at java.lang.Thread.run(Thread.java:746)
[junit4] 2> 5) Thread[id=7586, name=ou=system.data, state=TIMED_WAITING, group=TGRP-SaslZkACLProviderTest]
[junit4] 2> at sun.misc.Unsafe.park(Native Method)
[junit4] 2> at java.util.concurrent.locks.LockSupport.parkNanos(LockSupport.java:215)
[junit4] 2> at java.util.concurrent.locks.AbstractQueuedSynchronizer$ConditionObject.awaitNanos(AbstractQueuedSynchronizer.java:2078)
[junit4] 2> at java.util.concurrent.ScheduledThreadPoolExecutor$DelayedWorkQueue.take(ScheduledThreadPoolExecutor.java:1093)
[junit4] 2> at java.util.concurrent.ScheduledThreadPoolExecutor$DelayedWorkQueue.take(ScheduledThreadPoolExecutor.java:809)
[junit4] 2> at java.util.concurrent.ThreadPoolExecutor.getTask(ThreadPoolExecutor.java:1067)
[junit4] 2> at java.util.concurrent.ThreadPoolExecutor.runWorker(ThreadPoolExecutor.java:1127)
[junit4] 2> at java.util.concurrent.ThreadPoolExecutor$Worker.run(ThreadPoolExecutor.java:617)
[junit4] 2> at java.lang.Thread.run(Thread.java:746)
[junit4] 2> Sep 29, 2015 12:52:37 AM com.carrotsearch.randomizedtesting.ThreadLeakControl tryToInterruptAll
[junit4] 2> INFO: Starting to interrupt leaked threads:
[junit4] 2> 1) Thread[id=7584, name=apacheds, state=WAITING, group=TGRP-SaslZkACLProviderTest]
[junit4] 2> 2) Thread[id=7585, name=groupCache.data, state=TIMED_WAITING, group=TGRP-SaslZkACLProviderTest]
[junit4] 2> 3) Thread[id=7587, name=changePwdReplayCache.data, state=TIMED_WAITING, group=TGRP-SaslZkACLProviderTest]
[junit4] 2> 4) Thread[id=7588, name=kdcReplayCache.data, state=TIMED_WAITING, group=TGRP-SaslZkACLProviderTest]
[junit4] 2> 5) Thread[id=7586, name=ou=system.data, state=TIMED_WAITING, group=TGRP-SaslZkACLProviderTest]
[junit4] 2> Sep 29, 2015 12:52:40 AM com.carrotsearch.randomizedtesting.ThreadLeakControl tryToInterruptAll
[junit4] 2> SEVERE: There are still zombie threads that couldn't be terminated:
[junit4] 2> 1) Thread[id=7584, name=apacheds, state=WAITING, group=TGRP-SaslZkACLProviderTest]
[junit4] 2> at java.lang.Object.wait(Native Method)
[junit4] 2> at java.lang.Object.wait(Object.java:516)
[junit4] 2> at java.util.TimerThread.mainLoop(Timer.java:526)
[junit4] 2> at java.util.TimerThread.run(Timer.java:505)
[junit4] 2> 2) Thread[id=7585, name=groupCache.data, state=TIMED_WAITING, group=TGRP-SaslZkACLProviderTest]
[junit4] 2> at sun.misc.Unsafe.park(Native Method)
[junit4] 2> at java.util.concurrent.locks.LockSupport.parkNanos(LockSupport.java:215)
[junit4] 2> at java.util.concurrent.locks.AbstractQueuedSynchronizer$ConditionObject.awaitNanos(AbstractQueuedSynchronizer.java:2078)
[junit4] 2> at java.util.concurrent.ScheduledThreadPoolExecutor$DelayedWorkQueue.take(ScheduledThreadPoolExecutor.java:1093)
[junit4] 2> at java.util.concurrent.ScheduledThreadPoolExecutor$DelayedWorkQueue.take(ScheduledThreadPoolExecutor.java:809)
[junit4] 2> at java.util.concurrent.ThreadPoolExecutor.getTask(ThreadPoolExecutor.java:1067)
[junit4] 2> at java.util.concurrent.ThreadPoolExecutor.runWorker(ThreadPoolExecutor.java:1127)
[junit4] 2> at java.util.concurrent.ThreadPoolExecutor$Worker.run(ThreadPoolExecutor.java:617)
[junit4] 2> at java.lang.Thread.run(Thread.java:746)
[junit4] 2> 3) Thread[id=7587, name=changePwdReplayCache.data, state=TIMED_WAITING, group=TGRP-SaslZkACLProviderTest]
[junit4] 2> at sun.misc.Unsafe.park(Native Method)
[junit4] 2> at java.util.concurrent.locks.LockSupport.parkNanos(LockSupport.java:215)
[junit4] 2> at java.util.concurrent.locks.AbstractQueuedSynchronizer$ConditionObject.awaitNanos(AbstractQueuedSynchronizer.java:2078)
[junit4] 2> at java.util.concurrent.ScheduledThreadPoolExecutor$DelayedWorkQueue.take(ScheduledThreadPoolExecutor.java:1093)
[junit4] 2> at java.util.concurrent.ScheduledThreadPoolExecutor$DelayedWorkQueue.take(ScheduledThreadPoolExecutor.java:809)
[junit4] 2> at java.util.concurrent.ThreadPoolExecutor.getTask(ThreadPoolExecutor.java:1067)
[junit4] 2> at java.util.concurrent.ThreadPoolExecutor.runWorker(ThreadPoolExecutor.java:1127)
[junit4] 2> at java.util.concurrent.ThreadPoolExecutor$Worker.run(ThreadPoolExecutor.java:617)
[junit4] 2> at java.lang.Thread.run(Thread.java:746)
[junit4] 2> 4) Thread[id=7588, name=kdcReplayCache.data, state=TIMED_WAITING, group=TGRP-SaslZkACLProviderTest]
[junit4] 2> at sun.misc.Unsafe.park(Native Method)
[junit4] 2> at java.util.concurrent.locks.LockSupport.parkNanos(LockSupport.java:215)
[junit4] 2> at java.util.concurrent.locks.AbstractQueuedSynchronizer$ConditionObject.awaitNanos(AbstractQueuedSynchronizer.java:2078)
[junit4] 2> at java.util.concurrent.ScheduledThreadPoolExecutor$DelayedWorkQueue.take(ScheduledThreadPoolExecutor.java:1093)
[junit4] 2> at java.util.concurrent.ScheduledThreadPoolExecutor$DelayedWorkQueue.take(ScheduledThreadPoolExecutor.java:809)
[junit4] 2> at java.util.concurrent.ThreadPoolExecutor.getTask(ThreadPoolExecutor.java:1067)
[junit4] 2> at java.util.concurrent.ThreadPoolExecutor.runWorker(ThreadPoolExecutor.java:1127)
[junit4] 2> at java.util.concurrent.ThreadPoolExecutor$Worker.run(ThreadPoolExecutor.java:617)
[junit4] 2> at java.lang.Thread.run(Thread.java:746)
[junit4] 2> 5) Thread[id=7586, name=ou=system.data, state=TIMED_WAITING, group=TGRP-SaslZkACLProviderTest]
[junit4] 2> at sun.misc.Unsafe.park(Native Method)
[junit4] 2> at java.util.concurrent.locks.LockSupport.parkNanos(LockSupport.java:215)
[junit4] 2> at java.util.concurrent.locks.AbstractQueuedSynchronizer$ConditionObject.awaitNanos(AbstractQueuedSynchronizer.java:2078)
[junit4] 2> at java.util.concurrent.ScheduledThreadPoolExecutor$DelayedWorkQueue.take(ScheduledThreadPoolExecutor.java:1093)
[junit4] 2> at java.util.concurrent.ScheduledThreadPoolExecutor$DelayedWorkQueue.take(ScheduledThreadPoolExecutor.java:809)
[junit4] 2> at java.util.concurrent.ThreadPoolExecutor.getTask(ThreadPoolExecutor.java:1067)
[junit4] 2> at java.util.concurrent.ThreadPoolExecutor.runWorker(ThreadPoolExecutor.java:1127)
[junit4] 2> at java.util.concurrent.ThreadPoolExecutor$Worker.run(ThreadPoolExecutor.java:617)
[junit4] 2> at java.lang.Thread.run(Thread.java:746)
[junit4] 2> NOTE: test params are: codec=Asserting(Lucene53): {}, docValues:{}, sim=RandomSimilarityProvider(queryNorm=false,coord=yes): {}, locale=uz, timezone=Europe/Zagreb
[junit4] 2> NOTE: Linux 3.19.0-28-generic i386/Oracle Corporation 1.9.0-ea (32-bit)/cpus=12,threads=6,free=42550880,total=339738624
[junit4] 2> NOTE: All tests run in this JVM: [CollectionStateFormat2Test, TestExclusionRuleCollectionAccess, TestStressLucene, TestManagedSchemaFieldResource, TestSortingResponseWriter, TestOmitPositions, TestMergePolicyConfig, TestRandomFaceting, TestDocumentBuilder, SolrCoreTest, BufferStoreTest, HighlighterMaxOffsetTest, SyncSliceTest, TestSolrJ, DisMaxRequestHandlerTest, ExitableDirectoryReaderTest, TestReplicaProperties, TestLuceneMatchVersion, TestConfigSetImmutable, TestInitParams, TestExceedMaxTermLength, TestSchemaSimilarityResource, TestArbitraryIndexDir, UUIDUpdateProcessorFallbackTest, RemoteQueryErrorTest, XsltUpdateRequestHandlerTest, ReplicationFactorTest, TestRealTimeGet, BaseCdcrDistributedZkTest, ActionThrottleTest, AlternateDirectoryTest, HttpPartitionTest, TestChildDocTransformer, SynonymTokenizerTest, FacetPivotSmallTest, TestRecoveryHdfs, DefaultValueUpdateProcessorTest, DeleteInactiveReplicaTest, CacheHeaderTest, DeleteShardTest, DistributedFacetPivotLargeTest, OpenExchangeRatesOrgProviderTest, TestEmbeddedSolrServerConstructors, TestRemoteStreaming, TestDownShardTolerantSearch, CollectionTooManyReplicasTest, TestPivotHelperCode, AnalysisAfterCoreReloadTest, DocumentAnalysisRequestHandlerTest, ConnectionManagerTest, TestDistributedSearch, TestFunctionQuery, CoreAdminCreateDiscoverTest, PolyFieldTest, DistributedSpellCheckComponentTest, ResourceLoaderTest, StandardRequestHandlerTest, BigEndianAscendingWordSerializerTest, TestSimpleQParserPlugin, TestCloudInspectUtil, TestLMDirichletSimilarityFactory, OverseerRolesTest, FileUtilsTest, SOLR749Test, TestConfig, EnumFieldTest, TestFaceting, ExternalFileFieldSortTest, TestJoin, TestRandomMergePolicy, DateFieldTest, JSONWriterTest, TestPhraseSuggestions, SpellingQueryConverterTest, PathHierarchyTokenizerFactoryTest, VersionInfoTest, HdfsUnloadDistributedZkTest, PrimUtilsTest, TestExactStatsCache, TestCSVLoader, TestComponentsName, TestSolrQueryParserDefaultOperatorResource, BasicDistributedZkTest, TestIntervalFaceting, TestBlobHandler, TestInfoStreamLogging, ResponseLogComponentTest, HLLUtilTest, LeaderInitiatedRecoveryOnCommitTest, TestSystemIdResolver, DOMUtilTest, TestLRUCache, TestUtils, ZkNodePropsTest, SliceStateTest, SystemInfoHandlerTest, CircularListTest, DistributedMLTComponentTest, CursorPagingTest, TestHighlightDedupGrouping, TestTolerantSearch, AliasIntegrationTest, CdcrReplicationDistributedZkTest, CdcrReplicationHandlerTest, DistribJoinFromCollectionTest, MigrateRouteKeyTest, OutOfBoxZkACLAndCredentialsProvidersTest, OverseerStatusTest, SSLMigrationTest, SaslZkACLProviderTest]
[junit4] 2> NOTE: reproduce with: ant test -Dtestcase=SaslZkACLProviderTest -Dtests.seed=E21AAB9698467EF4 -Dtests.multiplier=3 -Dtests.slow=true -Dtests.locale=uz -Dtests.timezone=Europe/Zagreb -Dtests.asserts=true -Dtests.file.encoding=UTF-8
[junit4] ERROR 0.00s J0 | SaslZkACLProviderTest (suite) <<<
[junit4] > Throwable #1: com.carrotsearch.randomizedtesting.ThreadLeakError: 5 threads leaked from SUITE scope at org.apache.solr.cloud.SaslZkACLProviderTest:
[junit4] > 1) Thread[id=7584, name=apacheds, state=WAITING, group=TGRP-SaslZkACLProviderTest]
[junit4] > at java.lang.Object.wait(Native Method)
[junit4] > at java.lang.Object.wait(Object.java:516)
[junit4] > at java.util.TimerThread.mainLoop(Timer.java:526)
[junit4] > at java.util.TimerThread.run(Timer.java:505)
[junit4] > 2) Thread[id=7585, name=groupCache.data, state=TIMED_WAITING, group=TGRP-SaslZkACLProviderTest]
[junit4] > at sun.misc.Unsafe.park(Native Method)
[junit4] > at java.util.concurrent.locks.LockSupport.parkNanos(LockSupport.java:215)
[junit4] > at java.util.concurrent.locks.AbstractQueuedSynchronizer$ConditionObject.awaitNanos(AbstractQueuedSynchronizer.java:2078)
[junit4] > at java.util.concurrent.ScheduledThreadPoolExecutor$DelayedWorkQueue.take(ScheduledThreadPoolExecutor.java:1093)
[junit4] > at java.util.concurrent.ScheduledThreadPoolExecutor$DelayedWorkQueue.take(ScheduledThreadPoolExecutor.java:809)
[junit4] > at java.util.concurrent.ThreadPoolExecutor.getTask(ThreadPoolExecutor.java:1067)
[junit4] > at java.util.concurrent.ThreadPoolExecutor.runWorker(ThreadPoolExecutor.java:1127)
[junit4] > at java.util.concurrent.ThreadPoolExecutor$Worker.run(ThreadPoolExecutor.java:617)
[junit4] > at java.lang.Thread.run(Thread.java:746)
[junit4] > 3) Thread[id=7587, name=changePwdReplayCache.data, state=TIMED_WAITING, group=TGRP-SaslZkACLProviderTest]
[junit4] > at sun.misc.Unsafe.park(Native Method)
[junit4] > at java.util.concurrent.locks.LockSupport.parkNanos(LockSupport.java:215)
[junit4] > at java.util.concurrent.locks.AbstractQueuedSynchronizer$ConditionObject.awaitNanos(AbstractQueuedSynchronizer.java:2078)
[junit4] > at java.util.concurrent.ScheduledThreadPoolExecutor$DelayedWorkQueue.take(ScheduledThreadPoolExecutor.java:1093)
[junit4] > at java.util.concurrent.ScheduledThreadPoolExecutor$DelayedWorkQueue.take(ScheduledThreadPoolExecutor.java:809)
[junit4] > at java.util.concurrent.ThreadPoolExecutor.getTask(ThreadPoolExecutor.java:1067)
[junit4] > at java.util.concurrent.ThreadPoolExecutor.runWorker(ThreadPoolExecutor.java:1127)
[junit4] > at java.util.concurrent.ThreadPoolExecutor$Worker.run(ThreadPoolExecutor.java:617)
[junit4] > at java.lang.Thread.run(Thread.java:746)
[junit4] > 4) Thread[id=7588, name=kdcReplayCache.data, state=TIMED_WAITING, group=TGRP-SaslZkACLProviderTest]
[junit4] > at sun.misc.Unsafe.park(Native Method)
[junit4] > at java.util.concurrent.locks.LockSupport.parkNanos(LockSupport.java:215)
[junit4] > at java.util.concurrent.locks.AbstractQueuedSynchronizer$ConditionObject.awaitNanos(AbstractQueuedSynchronizer.java:2078)
[junit4] > at java.util.concurrent.ScheduledThreadPoolExecutor$DelayedWorkQueue.take(ScheduledThreadPoolExecutor.java:1093)
[junit4] > at java.util.concurrent.ScheduledThreadPoolExecutor$DelayedWorkQueue.take(ScheduledThreadPoolExecutor.java:809)
[junit4] > at java.util.concurrent.ThreadPoolExecutor.getTask(ThreadPoolExecutor.java:1067)
[junit4] > at java.util.concurrent.ThreadPoolExecutor.runWorker(ThreadPoolExecutor.java:1127)
[junit4] > at java.util.concurrent.ThreadPoolExecutor$Worker.run(ThreadPoolExecutor.java:617)
[junit4] > at java.lang.Thread.run(Thread.java:746)
[junit4] > 5) Thread[id=7586, name=ou=system.data, state=TIMED_WAITING, group=TGRP-SaslZkACLProviderTest]
[junit4] > at sun.misc.Unsafe.park(Native Method)
[junit4] > at java.util.concurrent.locks.LockSupport.parkNanos(LockSupport.java:215)
[junit4] > at java.util.concurrent.locks.AbstractQueuedSynchronizer$ConditionObject.awaitNanos(AbstractQueuedSynchronizer.java:2078)
[junit4] > at java.util.concurrent.ScheduledThreadPoolExecutor$DelayedWorkQueue.take(ScheduledThreadPoolExecutor.java:1093)
[junit4] > at java.util.concurrent.ScheduledThreadPoolExecutor$DelayedWorkQueue.take(ScheduledThreadPoolExecutor.java:809)
[junit4] > at java.util.concurrent.ThreadPoolExecutor.getTask(ThreadPoolExecutor.java:1067)
[junit4] > at java.util.concurrent.ThreadPoolExecutor.runWorker(ThreadPoolExecutor.java:1127)
[junit4] > at java.util.concurrent.ThreadPoolExecutor$Worker.run(ThreadPoolExecutor.java:617)
[junit4] > at java.lang.Thread.run(Thread.java:746)
[junit4] > at __randomizedtesting.SeedInfo.seed([E21AAB9698467EF4]:0)Throwable #2: com.carrotsearch.randomizedtesting.ThreadLeakError: There are still zombie threads that couldn't be terminated:
[junit4] > 1) Thread[id=7584, name=apacheds, state=WAITING, group=TGRP-SaslZkACLProviderTest]
[junit4] > at java.lang.Object.wait(Native Method)
[junit4] > at java.lang.Object.wait(Object.java:516)
[junit4] > at java.util.TimerThread.mainLoop(Timer.java:526)
[junit4] > at java.util.TimerThread.run(Timer.java:505)
[junit4] > 2) Thread[id=7585, name=groupCache.data, state=TIMED_WAITING, group=TGRP-SaslZkACLProviderTest]
[junit4] > at sun.misc.Unsafe.park(Native Method)
[junit4] > at java.util.concurrent.locks.LockSupport.parkNanos(LockSupport.java:215)
[junit4] > at java.util.concurrent.locks.AbstractQueuedSynchronizer$ConditionObject.awaitNanos(AbstractQueuedSynchronizer.java:2078)
[junit4] > at java.util.concurrent.ScheduledThreadPoolExecutor$DelayedWorkQueue.take(ScheduledThreadPoolExecutor.java:1093)
[junit4] > at java.util.concurrent.ScheduledThreadPoolExecutor$DelayedWorkQueue.take(ScheduledThreadPoolExecutor.java:809)
[junit4] > at java.util.concurrent.ThreadPoolExecutor.getTask(ThreadPoolExecutor.java:1067)
[junit4] > at java.util.concurrent.ThreadPoolExecutor.runWorker(ThreadPoolExecutor.java:1127)
[junit4] > at java.util.concurrent.ThreadPoolExecutor$Worker.run(ThreadPoolExecutor.java:617)
[junit4] > at java.lang.Thread.run(Thread.java:746)
[junit4] > 3) Thread[id=7587, name=changePwdReplayCache.data, state=TIMED_WAITING, group=TGRP-SaslZkACLProviderTest]
[junit4] > at sun.misc.Unsafe.park(Native Method)
[junit4] > at java.util.concurrent.locks.LockSupport.parkNanos(LockSupport.java:215)
[junit4] > at java.util.concurrent.locks.AbstractQueuedSynchronizer$ConditionObject.awaitNanos(AbstractQueuedSynchronizer.java:2078)
[junit4] > at java.util.concurrent.ScheduledThreadPoolExecutor$DelayedWorkQueue.take(ScheduledThreadPoolExecutor.java:1093)
[junit4] > at java.util.concurrent.ScheduledThreadPoolExecutor$DelayedWorkQueue.take(ScheduledThreadPoolExecutor.java:809)
[junit4] > at java.util.concurrent.ThreadPoolExecutor.getTask(ThreadPoolExecutor.java:1067)
[junit4] > at java.util.concurrent.ThreadPoolExecutor.runWorker(ThreadPoolExecutor.java:1127)
[junit4] > at java.util.concurrent.ThreadPoolExecutor$Worker.run(ThreadPoolExecutor.java:617)
[junit4] > at java.lang.Thread.run(Thread.java:746)
[junit4] > 4) Thread[id=7588, name=kdcReplayCache.data, state=TIMED_WAITING, group=TGRP-SaslZkACLProviderTest]
[junit4] > at sun.misc.Unsafe.park(Native Method)
[junit4] > at java.util.concurrent.locks.LockSupport.parkNanos(LockSupport.java:215)
[junit4] > at java.util.concurrent.locks.AbstractQueuedSynchronizer$ConditionObject.awaitNanos(AbstractQueuedSynchronizer.java:2078)
[junit4] > at java.util.concurrent.ScheduledThreadPoolExecutor$DelayedWorkQueue.take(ScheduledThreadPoolExecutor.java:1093)
[junit4] > at java.util.concurrent.ScheduledThreadPoolExecutor$DelayedWorkQueue.take(ScheduledThreadPoolExecutor.java:809)
[junit4] > at java.util.concurrent.ThreadPoolExecutor.getTask(ThreadPoolExecutor.java:1067)
[junit4] > at java.util.concurrent.ThreadPoolExecutor.runWorker(ThreadPoolExecutor.java:1127)
[junit4] > at java.util.concurrent.ThreadPoolExecutor$Worker.run(ThreadPoolExecutor.java:617)
[junit4] > at java.lang.Thread.run(Thread.java:746)
[junit4] > 5) Thread[id=7586, name=ou=system.data, state=TIMED_WAITING, group=TGRP-SaslZkACLProviderTest]
[junit4] > at sun.misc.Unsafe.park(Native Method)
[junit4] > at java.util.concurrent.locks.LockSupport.parkNanos(LockSupport.java:215)
[junit4] > at java.util.concurrent.locks.AbstractQueuedSynchronizer$ConditionObject.awaitNanos(AbstractQueuedSynchronizer.java:2078)
[junit4] > at java.util.concurrent.ScheduledThreadPoolExecutor$DelayedWorkQueue.take(ScheduledThreadPoolExecutor.java:1093)
[junit4] > at java.util.concurrent.ScheduledThreadPoolExecutor$DelayedWorkQueue.take(ScheduledThreadPoolExecutor.java:809)
[junit4] > at java.util.concurrent.ThreadPoolExecutor.getTask(ThreadPoolExecutor.java:1067)
[junit4] > at java.util.concurrent.ThreadPoolExecutor.runWorker(ThreadPoolExecutor.java:1127)
[junit4] > at java.util.concurrent.ThreadPoolExecutor$Worker.run(ThreadPoolExecutor.java:617)
[junit4] > at java.lang.Thread.run(Thread.java:746)
[junit4] > at __randomizedtesting.SeedInfo.seed([E21AAB9698467EF4]:0)
[junit4] Completed [424/546] on J0 in 25.49s, 1 test, 3 errors <<< FAILURES!
[...truncated 393 lines...]
BUILD FAILED
/home/jenkins/workspace/Lucene-Solr-trunk-Linux/build.xml:775: The following error occurred while executing this line:
/home/jenkins/workspace/Lucene-Solr-trunk-Linux/build.xml:719: The following error occurred while executing this line:
/home/jenkins/workspace/Lucene-Solr-trunk-Linux/build.xml:59: The following error occurred while executing this line:
/home/jenkins/workspace/Lucene-Solr-trunk-Linux/solr/build.xml:233: The following error occurred while executing this line:
/home/jenkins/workspace/Lucene-Solr-trunk-Linux/solr/common-build.xml:514: The following error occurred while executing this line:
/home/jenkins/workspace/Lucene-Solr-trunk-Linux/lucene/common-build.xml:1432: The following error occurred while executing this line:
/home/jenkins/workspace/Lucene-Solr-trunk-Linux/lucene/common-build.xml:987: There were test failures: 546 suites (8 ignored), 2145 tests, 2 suite-level errors, 1 error, 392 ignored (31 assumptions) [seed: E21AAB9698467EF4]
Total time: 43 minutes 42 seconds
Build step 'Invoke Ant' marked build as failure
Archiving artifacts
[WARNINGS] Skipping publisher since build result is FAILURE
Recording test results
Email was triggered for: Failure - Any
Sending email for trigger: Failure - Any
[JENKINS-EA] Lucene-Solr-trunk-Linux (64bit/jdk1.9.0-ea-b78) -
Build # 14338 - Still Failing!
Posted by Policeman Jenkins Server <je...@thetaphi.de>.
Build: http://jenkins.thetaphi.de/job/Lucene-Solr-trunk-Linux/14338/
Java: 64bit/jdk1.9.0-ea-b78 -XX:-UseCompressedOops -XX:+UseConcMarkSweepGC
3 tests failed.
FAILED: junit.framework.TestSuite.org.apache.solr.client.solrj.impl.CloudSolrClientTest
Error Message:
2 threads leaked from SUITE scope at org.apache.solr.client.solrj.impl.CloudSolrClientTest: 1) Thread[id=243, name=TEST-CloudSolrClientTest.test-seed#[1A736900F2D6E6B7]-EventThread, state=WAITING, group=TGRP-CloudSolrClientTest] at sun.misc.Unsafe.park(Native Method) at java.util.concurrent.locks.LockSupport.park(LockSupport.java:175) at java.util.concurrent.locks.AbstractQueuedSynchronizer$ConditionObject.await(AbstractQueuedSynchronizer.java:2039) at java.util.concurrent.LinkedBlockingQueue.take(LinkedBlockingQueue.java:442) at org.apache.zookeeper.ClientCnxn$EventThread.run(ClientCnxn.java:494) 2) Thread[id=242, name=TEST-CloudSolrClientTest.test-seed#[1A736900F2D6E6B7]-SendThread(127.0.0.1:60210), state=RUNNABLE, group=TGRP-CloudSolrClientTest] at java.lang.Thread.sleep(Native Method) at org.apache.zookeeper.client.StaticHostProvider.next(StaticHostProvider.java:101) at org.apache.zookeeper.ClientCnxn$SendThread.startConnect(ClientCnxn.java:940) at org.apache.zookeeper.ClientCnxn$SendThread.run(ClientCnxn.java:1003)
Stack Trace:
com.carrotsearch.randomizedtesting.ThreadLeakError: 2 threads leaked from SUITE scope at org.apache.solr.client.solrj.impl.CloudSolrClientTest:
1) Thread[id=243, name=TEST-CloudSolrClientTest.test-seed#[1A736900F2D6E6B7]-EventThread, state=WAITING, group=TGRP-CloudSolrClientTest]
at sun.misc.Unsafe.park(Native Method)
at java.util.concurrent.locks.LockSupport.park(LockSupport.java:175)
at java.util.concurrent.locks.AbstractQueuedSynchronizer$ConditionObject.await(AbstractQueuedSynchronizer.java:2039)
at java.util.concurrent.LinkedBlockingQueue.take(LinkedBlockingQueue.java:442)
at org.apache.zookeeper.ClientCnxn$EventThread.run(ClientCnxn.java:494)
2) Thread[id=242, name=TEST-CloudSolrClientTest.test-seed#[1A736900F2D6E6B7]-SendThread(127.0.0.1:60210), state=RUNNABLE, group=TGRP-CloudSolrClientTest]
at java.lang.Thread.sleep(Native Method)
at org.apache.zookeeper.client.StaticHostProvider.next(StaticHostProvider.java:101)
at org.apache.zookeeper.ClientCnxn$SendThread.startConnect(ClientCnxn.java:940)
at org.apache.zookeeper.ClientCnxn$SendThread.run(ClientCnxn.java:1003)
at __randomizedtesting.SeedInfo.seed([1A736900F2D6E6B7]:0)
FAILED: junit.framework.TestSuite.org.apache.solr.client.solrj.impl.CloudSolrClientTest
Error Message:
There are still zombie threads that couldn't be terminated: 1) Thread[id=242, name=TEST-CloudSolrClientTest.test-seed#[1A736900F2D6E6B7]-SendThread(127.0.0.1:60210), state=TIMED_WAITING, group=TGRP-CloudSolrClientTest] at java.lang.Thread.sleep(Native Method) at org.apache.zookeeper.ClientCnxn$SendThread.run(ClientCnxn.java:994)
Stack Trace:
com.carrotsearch.randomizedtesting.ThreadLeakError: There are still zombie threads that couldn't be terminated:
1) Thread[id=242, name=TEST-CloudSolrClientTest.test-seed#[1A736900F2D6E6B7]-SendThread(127.0.0.1:60210), state=TIMED_WAITING, group=TGRP-CloudSolrClientTest]
at java.lang.Thread.sleep(Native Method)
at org.apache.zookeeper.ClientCnxn$SendThread.run(ClientCnxn.java:994)
at __randomizedtesting.SeedInfo.seed([1A736900F2D6E6B7]:0)
FAILED: org.apache.solr.client.solrj.impl.CloudSolrClientTest.test
Error Message:
Stack Trace:
java.lang.AssertionError
at __randomizedtesting.SeedInfo.seed([1A736900F2D6E6B7:922756DA5C2A8B4F]:0)
at org.junit.Assert.fail(Assert.java:92)
at org.junit.Assert.assertTrue(Assert.java:43)
at org.junit.Assert.assertTrue(Assert.java:54)
at org.apache.solr.client.solrj.impl.CloudSolrClientTest.allTests(CloudSolrClientTest.java:231)
at org.apache.solr.client.solrj.impl.CloudSolrClientTest.test(CloudSolrClientTest.java:117)
at sun.reflect.NativeMethodAccessorImpl.invoke0(Native Method)
at sun.reflect.NativeMethodAccessorImpl.invoke(NativeMethodAccessorImpl.java:62)
at sun.reflect.DelegatingMethodAccessorImpl.invoke(DelegatingMethodAccessorImpl.java:43)
at java.lang.reflect.Method.invoke(Method.java:504)
at com.carrotsearch.randomizedtesting.RandomizedRunner.invoke(RandomizedRunner.java:1665)
at com.carrotsearch.randomizedtesting.RandomizedRunner$8.evaluate(RandomizedRunner.java:864)
at com.carrotsearch.randomizedtesting.RandomizedRunner$9.evaluate(RandomizedRunner.java:900)
at com.carrotsearch.randomizedtesting.RandomizedRunner$10.evaluate(RandomizedRunner.java:914)
at org.junit.rules.ExpectedException$ExpectedExceptionStatement.evaluate(ExpectedException.java:110)
at org.apache.solr.BaseDistributedSearchTestCase$ShardsRepeatRule$ShardsFixedStatement.callStatement(BaseDistributedSearchTestCase.java:963)
at org.apache.solr.BaseDistributedSearchTestCase$ShardsRepeatRule$ShardsStatement.evaluate(BaseDistributedSearchTestCase.java:938)
at com.carrotsearch.randomizedtesting.rules.SystemPropertiesRestoreRule$1.evaluate(SystemPropertiesRestoreRule.java:57)
at org.apache.lucene.util.TestRuleSetupTeardownChained$1.evaluate(TestRuleSetupTeardownChained.java:50)
at org.apache.lucene.util.AbstractBeforeAfterRule$1.evaluate(AbstractBeforeAfterRule.java:46)
at org.apache.lucene.util.TestRuleThreadAndTestName$1.evaluate(TestRuleThreadAndTestName.java:49)
at org.apache.lucene.util.TestRuleIgnoreAfterMaxFailures$1.evaluate(TestRuleIgnoreAfterMaxFailures.java:65)
at org.apache.lucene.util.TestRuleMarkFailure$1.evaluate(TestRuleMarkFailure.java:48)
at com.carrotsearch.randomizedtesting.rules.StatementAdapter.evaluate(StatementAdapter.java:36)
at com.carrotsearch.randomizedtesting.ThreadLeakControl$StatementRunner.run(ThreadLeakControl.java:367)
at com.carrotsearch.randomizedtesting.ThreadLeakControl.forkTimeoutingTask(ThreadLeakControl.java:809)
at com.carrotsearch.randomizedtesting.ThreadLeakControl$3.evaluate(ThreadLeakControl.java:460)
at com.carrotsearch.randomizedtesting.RandomizedRunner.runSingleTest(RandomizedRunner.java:873)
at com.carrotsearch.randomizedtesting.RandomizedRunner$5.evaluate(RandomizedRunner.java:775)
at com.carrotsearch.randomizedtesting.RandomizedRunner$6.evaluate(RandomizedRunner.java:809)
at com.carrotsearch.randomizedtesting.RandomizedRunner$7.evaluate(RandomizedRunner.java:820)
at com.carrotsearch.randomizedtesting.rules.StatementAdapter.evaluate(StatementAdapter.java:36)
at com.carrotsearch.randomizedtesting.rules.SystemPropertiesRestoreRule$1.evaluate(SystemPropertiesRestoreRule.java:57)
at org.apache.lucene.util.AbstractBeforeAfterRule$1.evaluate(AbstractBeforeAfterRule.java:46)
at com.carrotsearch.randomizedtesting.rules.StatementAdapter.evaluate(StatementAdapter.java:36)
at org.apache.lucene.util.TestRuleStoreClassName$1.evaluate(TestRuleStoreClassName.java:42)
at com.carrotsearch.randomizedtesting.rules.NoShadowingOrOverridesOnMethodsRule$1.evaluate(NoShadowingOrOverridesOnMethodsRule.java:39)
at com.carrotsearch.randomizedtesting.rules.NoShadowingOrOverridesOnMethodsRule$1.evaluate(NoShadowingOrOverridesOnMethodsRule.java:39)
at com.carrotsearch.randomizedtesting.rules.StatementAdapter.evaluate(StatementAdapter.java:36)
at com.carrotsearch.randomizedtesting.rules.StatementAdapter.evaluate(StatementAdapter.java:36)
at com.carrotsearch.randomizedtesting.rules.StatementAdapter.evaluate(StatementAdapter.java:36)
at org.apache.lucene.util.TestRuleAssertionsRequired$1.evaluate(TestRuleAssertionsRequired.java:54)
at org.apache.lucene.util.TestRuleMarkFailure$1.evaluate(TestRuleMarkFailure.java:48)
at org.apache.lucene.util.TestRuleIgnoreAfterMaxFailures$1.evaluate(TestRuleIgnoreAfterMaxFailures.java:65)
at org.apache.lucene.util.TestRuleIgnoreTestSuites$1.evaluate(TestRuleIgnoreTestSuites.java:55)
at com.carrotsearch.randomizedtesting.rules.StatementAdapter.evaluate(StatementAdapter.java:36)
at com.carrotsearch.randomizedtesting.ThreadLeakControl$StatementRunner.run(ThreadLeakControl.java:367)
at java.lang.Thread.run(Thread.java:746)
Build Log:
[...truncated 11394 lines...]
[junit4] Suite: org.apache.solr.client.solrj.impl.CloudSolrClientTest
[junit4] 2> Creating dataDir: /home/jenkins/workspace/Lucene-Solr-trunk-Linux/solr/build/solr-solrj/test/J2/temp/solr.client.solrj.impl.CloudSolrClientTest_1A736900F2D6E6B7-001/init-core-data-001
[junit4] 2> 0 INFO (SUITE-CloudSolrClientTest-seed#[1A736900F2D6E6B7]-worker) [ ] o.a.s.SolrTestCaseJ4 Randomized ssl (false) and clientAuth (false)
[junit4] 2> 19 INFO (SUITE-CloudSolrClientTest-seed#[1A736900F2D6E6B7]-worker) [ ] o.a.s.BaseDistributedSearchTestCase Setting hostContext system property: /_f/ab
[junit4] 2> 21 WARN (SUITE-CloudSolrClientTest-seed#[1A736900F2D6E6B7]-worker) [ ] o.a.s.c.AbstractZkTestCase TEST_HOME() does not exist - solrj test?
[junit4] 2> 46 INFO (TEST-CloudSolrClientTest.test-seed#[1A736900F2D6E6B7]) [ ] o.a.s.c.ZkTestServer STARTING ZK TEST SERVER
[junit4] 2> 47 INFO (Thread-1) [ ] o.a.s.c.ZkTestServer client port:0.0.0.0/0.0.0.0:0
[junit4] 2> 47 INFO (Thread-1) [ ] o.a.s.c.ZkTestServer Starting server
[junit4] 2> 147 INFO (TEST-CloudSolrClientTest.test-seed#[1A736900F2D6E6B7]) [ ] o.a.s.c.ZkTestServer start zk server on port:60210
[junit4] 2> 165 INFO (TEST-CloudSolrClientTest.test-seed#[1A736900F2D6E6B7]) [ ] o.a.s.c.c.SolrZkClient Using default ZkCredentialsProvider
[junit4] 2> 206 INFO (TEST-CloudSolrClientTest.test-seed#[1A736900F2D6E6B7]) [ ] o.a.s.c.c.ConnectionManager Waiting for client to connect to ZooKeeper
[junit4] 2> 259 INFO (zkCallback-1-thread-1) [ ] o.a.s.c.c.ConnectionManager Watcher org.apache.solr.common.cloud.ConnectionManager@1263d52c name:ZooKeeperConnection Watcher:127.0.0.1:60210 got event WatchedEvent state:SyncConnected type:None path:null path:null type:None
[junit4] 2> 259 INFO (TEST-CloudSolrClientTest.test-seed#[1A736900F2D6E6B7]) [ ] o.a.s.c.c.ConnectionManager Client is connected to ZooKeeper
[junit4] 2> 261 INFO (TEST-CloudSolrClientTest.test-seed#[1A736900F2D6E6B7]) [ ] o.a.s.c.c.SolrZkClient Using default ZkACLProvider
[junit4] 2> 262 INFO (TEST-CloudSolrClientTest.test-seed#[1A736900F2D6E6B7]) [ ] o.a.s.c.c.SolrZkClient makePath: /solr
[junit4] 2> 302 INFO (TEST-CloudSolrClientTest.test-seed#[1A736900F2D6E6B7]) [ ] o.a.s.c.c.SolrZkClient Using default ZkCredentialsProvider
[junit4] 2> 304 INFO (TEST-CloudSolrClientTest.test-seed#[1A736900F2D6E6B7]) [ ] o.a.s.c.c.ConnectionManager Waiting for client to connect to ZooKeeper
[junit4] 2> 311 INFO (zkCallback-2-thread-1) [ ] o.a.s.c.c.ConnectionManager Watcher org.apache.solr.common.cloud.ConnectionManager@10c98f83 name:ZooKeeperConnection Watcher:127.0.0.1:60210/solr got event WatchedEvent state:SyncConnected type:None path:null path:null type:None
[junit4] 2> 311 INFO (TEST-CloudSolrClientTest.test-seed#[1A736900F2D6E6B7]) [ ] o.a.s.c.c.ConnectionManager Client is connected to ZooKeeper
[junit4] 2> 312 INFO (TEST-CloudSolrClientTest.test-seed#[1A736900F2D6E6B7]) [ ] o.a.s.c.c.SolrZkClient Using default ZkACLProvider
[junit4] 2> 318 INFO (TEST-CloudSolrClientTest.test-seed#[1A736900F2D6E6B7]) [ ] o.a.s.c.c.SolrZkClient makePath: /collections/collection1
[junit4] 2> 324 INFO (TEST-CloudSolrClientTest.test-seed#[1A736900F2D6E6B7]) [ ] o.a.s.c.c.SolrZkClient makePath: /collections/collection1/shards
[junit4] 2> 328 INFO (TEST-CloudSolrClientTest.test-seed#[1A736900F2D6E6B7]) [ ] o.a.s.c.c.SolrZkClient makePath: /collections/control_collection
[junit4] 2> 331 INFO (TEST-CloudSolrClientTest.test-seed#[1A736900F2D6E6B7]) [ ] o.a.s.c.c.SolrZkClient makePath: /collections/control_collection/shards
[junit4] 2> 334 INFO (TEST-CloudSolrClientTest.test-seed#[1A736900F2D6E6B7]) [ ] o.a.s.c.AbstractZkTestCase put /home/jenkins/workspace/Lucene-Solr-trunk-Linux/solr/solrj/src/test-files/solrj/solr/collection1/conf/solrconfig.xml to /configs/conf1/solrconfig.xml
[junit4] 2> 346 INFO (TEST-CloudSolrClientTest.test-seed#[1A736900F2D6E6B7]) [ ] o.a.s.c.c.SolrZkClient makePath: /configs/conf1/solrconfig.xml
[junit4] 2> 352 INFO (TEST-CloudSolrClientTest.test-seed#[1A736900F2D6E6B7]) [ ] o.a.s.c.AbstractZkTestCase put /home/jenkins/workspace/Lucene-Solr-trunk-Linux/solr/solrj/src/test-files/solrj/solr/collection1/conf/schema.xml to /configs/conf1/schema.xml
[junit4] 2> 353 INFO (TEST-CloudSolrClientTest.test-seed#[1A736900F2D6E6B7]) [ ] o.a.s.c.c.SolrZkClient makePath: /configs/conf1/schema.xml
[junit4] 2> 357 INFO (TEST-CloudSolrClientTest.test-seed#[1A736900F2D6E6B7]) [ ] o.a.s.c.AbstractZkTestCase skipping /home/jenkins/workspace/Lucene-Solr-trunk-Linux/solr/solrj/src/test-files/solrj/solr/collection1/conf/solrconfig.snippet.randomindexconfig.xml because it doesn't exist
[junit4] 2> 357 INFO (TEST-CloudSolrClientTest.test-seed#[1A736900F2D6E6B7]) [ ] o.a.s.c.AbstractZkTestCase skipping /home/jenkins/workspace/Lucene-Solr-trunk-Linux/solr/solrj/src/test-files/solrj/solr/collection1/conf/stopwords.txt because it doesn't exist
[junit4] 2> 357 INFO (TEST-CloudSolrClientTest.test-seed#[1A736900F2D6E6B7]) [ ] o.a.s.c.AbstractZkTestCase skipping /home/jenkins/workspace/Lucene-Solr-trunk-Linux/solr/solrj/src/test-files/solrj/solr/collection1/conf/protwords.txt because it doesn't exist
[junit4] 2> 357 INFO (TEST-CloudSolrClientTest.test-seed#[1A736900F2D6E6B7]) [ ] o.a.s.c.AbstractZkTestCase skipping /home/jenkins/workspace/Lucene-Solr-trunk-Linux/solr/solrj/src/test-files/solrj/solr/collection1/conf/currency.xml because it doesn't exist
[junit4] 2> 358 INFO (TEST-CloudSolrClientTest.test-seed#[1A736900F2D6E6B7]) [ ] o.a.s.c.AbstractZkTestCase skipping /home/jenkins/workspace/Lucene-Solr-trunk-Linux/solr/solrj/src/test-files/solrj/solr/collection1/conf/enumsConfig.xml because it doesn't exist
[junit4] 2> 358 INFO (TEST-CloudSolrClientTest.test-seed#[1A736900F2D6E6B7]) [ ] o.a.s.c.AbstractZkTestCase skipping /home/jenkins/workspace/Lucene-Solr-trunk-Linux/solr/solrj/src/test-files/solrj/solr/collection1/conf/open-exchange-rates.json because it doesn't exist
[junit4] 2> 358 INFO (TEST-CloudSolrClientTest.test-seed#[1A736900F2D6E6B7]) [ ] o.a.s.c.AbstractZkTestCase skipping /home/jenkins/workspace/Lucene-Solr-trunk-Linux/solr/solrj/src/test-files/solrj/solr/collection1/conf/mapping-ISOLatin1Accent.txt because it doesn't exist
[junit4] 2> 359 INFO (TEST-CloudSolrClientTest.test-seed#[1A736900F2D6E6B7]) [ ] o.a.s.c.AbstractZkTestCase skipping /home/jenkins/workspace/Lucene-Solr-trunk-Linux/solr/solrj/src/test-files/solrj/solr/collection1/conf/old_synonyms.txt because it doesn't exist
[junit4] 2> 359 INFO (TEST-CloudSolrClientTest.test-seed#[1A736900F2D6E6B7]) [ ] o.a.s.c.AbstractZkTestCase skipping /home/jenkins/workspace/Lucene-Solr-trunk-Linux/solr/solrj/src/test-files/solrj/solr/collection1/conf/synonyms.txt because it doesn't exist
[junit4] 2> 383 INFO (TEST-CloudSolrClientTest.test-seed#[1A736900F2D6E6B7]) [ ] o.a.s.SolrTestCaseJ4 Writing core.properties file to /home/jenkins/workspace/Lucene-Solr-trunk-Linux/solr/build/solr-solrj/test/J2/temp/solr.client.solrj.impl.CloudSolrClientTest_1A736900F2D6E6B7-001/control-001/cores/collection1
[junit4] 2> 425 INFO (TEST-CloudSolrClientTest.test-seed#[1A736900F2D6E6B7]) [ ] o.e.j.u.log Logging initialized @2270ms
[junit4] 2> 572 INFO (TEST-CloudSolrClientTest.test-seed#[1A736900F2D6E6B7]) [ ] o.e.j.s.Server jetty-9.2.13.v20150730
[junit4] 2> 631 INFO (TEST-CloudSolrClientTest.test-seed#[1A736900F2D6E6B7]) [ ] o.e.j.s.h.ContextHandler Started o.e.j.s.ServletContextHandler@1045545b{/_f/ab,null,AVAILABLE}
[junit4] 2> 639 INFO (TEST-CloudSolrClientTest.test-seed#[1A736900F2D6E6B7]) [ ] o.e.j.s.ServerConnector Started ServerConnector@32ba4ada{HTTP/1.1}{127.0.0.1:57855}
[junit4] 2> 640 INFO (TEST-CloudSolrClientTest.test-seed#[1A736900F2D6E6B7]) [ ] o.e.j.s.Server Started @2490ms
[junit4] 2> 640 INFO (TEST-CloudSolrClientTest.test-seed#[1A736900F2D6E6B7]) [ ] o.a.s.c.s.e.JettySolrRunner Jetty properties: {solr.data.dir=/home/jenkins/workspace/Lucene-Solr-trunk-Linux/solr/build/solr-solrj/test/J2/temp/solr.client.solrj.impl.CloudSolrClientTest_1A736900F2D6E6B7-001/tempDir-001/control/data, hostContext=/_f/ab, hostPort=57855, coreRootDirectory=/home/jenkins/workspace/Lucene-Solr-trunk-Linux/solr/build/solr-solrj/test/J2/temp/solr.client.solrj.impl.CloudSolrClientTest_1A736900F2D6E6B7-001/control-001/cores}
[junit4] 2> 648 INFO (TEST-CloudSolrClientTest.test-seed#[1A736900F2D6E6B7]) [ ] o.a.s.s.SolrDispatchFilter SolrDispatchFilter.init(): sun.misc.Launcher$AppClassLoader@593634ad
[junit4] 2> 667 INFO (TEST-CloudSolrClientTest.test-seed#[1A736900F2D6E6B7]) [ ] o.a.s.c.SolrResourceLoader new SolrResourceLoader for directory: '/home/jenkins/workspace/Lucene-Solr-trunk-Linux/solr/build/solr-solrj/test/J2/temp/solr.client.solrj.impl.CloudSolrClientTest_1A736900F2D6E6B7-001/control-001/'
[junit4] 2> 805 INFO (TEST-CloudSolrClientTest.test-seed#[1A736900F2D6E6B7]) [ ] o.a.s.c.c.SolrZkClient Using default ZkCredentialsProvider
[junit4] 2> 808 INFO (TEST-CloudSolrClientTest.test-seed#[1A736900F2D6E6B7]) [ ] o.a.s.c.c.ConnectionManager Waiting for client to connect to ZooKeeper
[junit4] 2> 825 INFO (zkCallback-3-thread-1) [ ] o.a.s.c.c.ConnectionManager Watcher org.apache.solr.common.cloud.ConnectionManager@38814eab name:ZooKeeperConnection Watcher:127.0.0.1:60210/solr got event WatchedEvent state:SyncConnected type:None path:null path:null type:None
[junit4] 2> 825 INFO (TEST-CloudSolrClientTest.test-seed#[1A736900F2D6E6B7]) [ ] o.a.s.c.c.ConnectionManager Client is connected to ZooKeeper
[junit4] 2> 826 INFO (TEST-CloudSolrClientTest.test-seed#[1A736900F2D6E6B7]) [ ] o.a.s.c.c.SolrZkClient Using default ZkACLProvider
[junit4] 2> 828 INFO (TEST-CloudSolrClientTest.test-seed#[1A736900F2D6E6B7]) [ ] o.a.s.s.SolrDispatchFilter Loading solr.xml from SolrHome (not found in ZooKeeper)
[junit4] 2> 830 INFO (TEST-CloudSolrClientTest.test-seed#[1A736900F2D6E6B7]) [ ] o.a.s.c.SolrXmlConfig Loading container configuration from /home/jenkins/workspace/Lucene-Solr-trunk-Linux/solr/build/solr-solrj/test/J2/temp/solr.client.solrj.impl.CloudSolrClientTest_1A736900F2D6E6B7-001/control-001/solr.xml
[junit4] 2> 952 INFO (TEST-CloudSolrClientTest.test-seed#[1A736900F2D6E6B7]) [ ] o.a.s.c.CoresLocator Config-defined core root directory: /home/jenkins/workspace/Lucene-Solr-trunk-Linux/solr/build/solr-solrj/test/J2/temp/solr.client.solrj.impl.CloudSolrClientTest_1A736900F2D6E6B7-001/control-001/cores
[junit4] 2> 1036 INFO (TEST-CloudSolrClientTest.test-seed#[1A736900F2D6E6B7]) [ ] o.a.s.c.CoreContainer New CoreContainer 465816318
[junit4] 2> 1037 INFO (TEST-CloudSolrClientTest.test-seed#[1A736900F2D6E6B7]) [ ] o.a.s.c.CoreContainer Loading cores into CoreContainer [instanceDir=/home/jenkins/workspace/Lucene-Solr-trunk-Linux/solr/build/solr-solrj/test/J2/temp/solr.client.solrj.impl.CloudSolrClientTest_1A736900F2D6E6B7-001/control-001/]
[junit4] 2> 1037 INFO (TEST-CloudSolrClientTest.test-seed#[1A736900F2D6E6B7]) [ ] o.a.s.c.CoreContainer loading shared library: /home/jenkins/workspace/Lucene-Solr-trunk-Linux/solr/build/solr-solrj/test/J2/temp/solr.client.solrj.impl.CloudSolrClientTest_1A736900F2D6E6B7-001/control-001/lib
[junit4] 2> 1038 WARN (TEST-CloudSolrClientTest.test-seed#[1A736900F2D6E6B7]) [ ] o.a.s.c.SolrResourceLoader Can't find (or read) directory to add to classloader: lib (resolved as: /home/jenkins/workspace/Lucene-Solr-trunk-Linux/solr/build/solr-solrj/test/J2/temp/solr.client.solrj.impl.CloudSolrClientTest_1A736900F2D6E6B7-001/control-001/lib).
[junit4] 2> 1071 INFO (TEST-CloudSolrClientTest.test-seed#[1A736900F2D6E6B7]) [ ] o.a.s.h.c.HttpShardHandlerFactory created with socketTimeout : 90000,urlScheme : ,connTimeout : 15000,maxConnectionsPerHost : 20,maxConnections : 10000,corePoolSize : 0,maximumPoolSize : 2147483647,maxThreadIdleTime : 5,sizeOfQueue : -1,fairnessPolicy : false,useRetries : false,
[junit4] 2> 1258 INFO (TEST-CloudSolrClientTest.test-seed#[1A736900F2D6E6B7]) [ ] o.a.s.u.UpdateShardHandler Creating UpdateShardHandler HTTP client with params: socketTimeout=340000&connTimeout=45000&retry=true
[junit4] 2> 1261 INFO (TEST-CloudSolrClientTest.test-seed#[1A736900F2D6E6B7]) [ ] o.a.s.l.LogWatcher SLF4J impl is org.slf4j.impl.Log4jLoggerFactory
[junit4] 2> 1261 INFO (TEST-CloudSolrClientTest.test-seed#[1A736900F2D6E6B7]) [ ] o.a.s.l.LogWatcher Registering Log Listener [Log4j (org.slf4j.impl.Log4jLoggerFactory)]
[junit4] 2> 1263 INFO (TEST-CloudSolrClientTest.test-seed#[1A736900F2D6E6B7]) [ ] o.a.s.c.ZkContainer Zookeeper client=127.0.0.1:60210/solr
[junit4] 2> 1273 INFO (TEST-CloudSolrClientTest.test-seed#[1A736900F2D6E6B7]) [ ] o.a.s.c.ZkController zkHost includes chroot
[junit4] 2> 1273 INFO (TEST-CloudSolrClientTest.test-seed#[1A736900F2D6E6B7]) [ ] o.a.s.c.c.SolrZkClient Using default ZkCredentialsProvider
[junit4] 2> 1273 INFO (TEST-CloudSolrClientTest.test-seed#[1A736900F2D6E6B7]) [ ] o.a.s.c.c.ConnectionManager Waiting for client to connect to ZooKeeper
[junit4] 2> 1275 INFO (zkCallback-5-thread-1) [ ] o.a.s.c.c.ConnectionManager Watcher org.apache.solr.common.cloud.ConnectionManager@299a0ec5 name:ZooKeeperConnection Watcher:127.0.0.1:60210 got event WatchedEvent state:SyncConnected type:None path:null path:null type:None
[junit4] 2> 1275 INFO (TEST-CloudSolrClientTest.test-seed#[1A736900F2D6E6B7]) [ ] o.a.s.c.c.ConnectionManager Client is connected to ZooKeeper
[junit4] 2> 1276 INFO (TEST-CloudSolrClientTest.test-seed#[1A736900F2D6E6B7]) [ ] o.a.s.c.c.SolrZkClient Using default ZkACLProvider
[junit4] 2> 1283 INFO (TEST-CloudSolrClientTest.test-seed#[1A736900F2D6E6B7]) [n:127.0.0.1:57855__f%2Fab ] o.a.s.c.c.ConnectionManager Waiting for client to connect to ZooKeeper
[junit4] 2> 1285 INFO (zkCallback-6-thread-1-processing-n:127.0.0.1:57855__f%2Fab) [n:127.0.0.1:57855__f%2Fab ] o.a.s.c.c.ConnectionManager Watcher org.apache.solr.common.cloud.ConnectionManager@692ccdaa name:ZooKeeperConnection Watcher:127.0.0.1:60210/solr got event WatchedEvent state:SyncConnected type:None path:null path:null type:None
[junit4] 2> 1285 INFO (TEST-CloudSolrClientTest.test-seed#[1A736900F2D6E6B7]) [n:127.0.0.1:57855__f%2Fab ] o.a.s.c.c.ConnectionManager Client is connected to ZooKeeper
[junit4] 2> 1295 INFO (TEST-CloudSolrClientTest.test-seed#[1A736900F2D6E6B7]) [n:127.0.0.1:57855__f%2Fab ] o.a.s.c.c.SolrZkClient makePath: /overseer/queue
[junit4] 2> 1304 INFO (TEST-CloudSolrClientTest.test-seed#[1A736900F2D6E6B7]) [n:127.0.0.1:57855__f%2Fab ] o.a.s.c.c.SolrZkClient makePath: /overseer/collection-queue-work
[junit4] 2> 1309 INFO (TEST-CloudSolrClientTest.test-seed#[1A736900F2D6E6B7]) [n:127.0.0.1:57855__f%2Fab ] o.a.s.c.c.SolrZkClient makePath: /overseer/collection-map-running
[junit4] 2> 1320 INFO (TEST-CloudSolrClientTest.test-seed#[1A736900F2D6E6B7]) [n:127.0.0.1:57855__f%2Fab ] o.a.s.c.c.SolrZkClient makePath: /overseer/collection-map-completed
[junit4] 2> 1322 INFO (TEST-CloudSolrClientTest.test-seed#[1A736900F2D6E6B7]) [n:127.0.0.1:57855__f%2Fab ] o.a.s.c.c.SolrZkClient makePath: /overseer/collection-map-failure
[junit4] 2> 1330 INFO (TEST-CloudSolrClientTest.test-seed#[1A736900F2D6E6B7]) [n:127.0.0.1:57855__f%2Fab ] o.a.s.c.c.SolrZkClient makePath: /live_nodes
[junit4] 2> 1335 INFO (TEST-CloudSolrClientTest.test-seed#[1A736900F2D6E6B7]) [n:127.0.0.1:57855__f%2Fab ] o.a.s.c.c.SolrZkClient makePath: /aliases.json
[junit4] 2> 1338 INFO (TEST-CloudSolrClientTest.test-seed#[1A736900F2D6E6B7]) [n:127.0.0.1:57855__f%2Fab ] o.a.s.c.c.SolrZkClient makePath: /clusterstate.json
[junit4] 2> 1340 INFO (TEST-CloudSolrClientTest.test-seed#[1A736900F2D6E6B7]) [n:127.0.0.1:57855__f%2Fab ] o.a.s.c.c.SolrZkClient makePath: /security.json
[junit4] 2> 1342 INFO (TEST-CloudSolrClientTest.test-seed#[1A736900F2D6E6B7]) [n:127.0.0.1:57855__f%2Fab ] o.a.s.c.ZkController Register node as live in ZooKeeper:/live_nodes/127.0.0.1:57855__f%2Fab
[junit4] 2> 1343 INFO (TEST-CloudSolrClientTest.test-seed#[1A736900F2D6E6B7]) [n:127.0.0.1:57855__f%2Fab ] o.a.s.c.c.SolrZkClient makePath: /live_nodes/127.0.0.1:57855__f%2Fab
[junit4] 2> 1347 INFO (TEST-CloudSolrClientTest.test-seed#[1A736900F2D6E6B7]) [n:127.0.0.1:57855__f%2Fab ] o.a.s.c.c.SolrZkClient makePath: /overseer_elect
[junit4] 2> 1349 INFO (TEST-CloudSolrClientTest.test-seed#[1A736900F2D6E6B7]) [n:127.0.0.1:57855__f%2Fab ] o.a.s.c.c.SolrZkClient makePath: /overseer_elect/election
[junit4] 2> 1351 INFO (TEST-CloudSolrClientTest.test-seed#[1A736900F2D6E6B7]) [n:127.0.0.1:57855__f%2Fab ] o.a.s.c.Overseer Overseer (id=null) closing
[junit4] 2> 1351 INFO (TEST-CloudSolrClientTest.test-seed#[1A736900F2D6E6B7]) [n:127.0.0.1:57855__f%2Fab ] o.a.s.c.LeaderElector Joined leadership election with path: /overseer_elect/election/94600885037039620-127.0.0.1:57855__f%2Fab-n_0000000000
[junit4] 2> 1355 INFO (TEST-CloudSolrClientTest.test-seed#[1A736900F2D6E6B7]) [n:127.0.0.1:57855__f%2Fab ] o.a.s.c.OverseerElectionContext I am going to be the leader 127.0.0.1:57855__f%2Fab
[junit4] 2> 1355 INFO (TEST-CloudSolrClientTest.test-seed#[1A736900F2D6E6B7]) [n:127.0.0.1:57855__f%2Fab ] o.a.s.c.c.SolrZkClient makePath: /overseer_elect/leader
[junit4] 2> 1357 INFO (TEST-CloudSolrClientTest.test-seed#[1A736900F2D6E6B7]) [n:127.0.0.1:57855__f%2Fab ] o.a.s.c.Overseer Overseer (id=94600885037039620-127.0.0.1:57855__f%2Fab-n_0000000000) starting
[junit4] 2> 1363 INFO (TEST-CloudSolrClientTest.test-seed#[1A736900F2D6E6B7]) [n:127.0.0.1:57855__f%2Fab ] o.a.s.c.c.SolrZkClient makePath: /overseer/queue-work
[junit4] 2> 1389 INFO (TEST-CloudSolrClientTest.test-seed#[1A736900F2D6E6B7]) [n:127.0.0.1:57855__f%2Fab ] o.a.s.c.OverseerAutoReplicaFailoverThread Starting OverseerAutoReplicaFailoverThread autoReplicaFailoverWorkLoopDelay=10000 autoReplicaFailoverWaitAfterExpiration=30000 autoReplicaFailoverBadNodeExpiration=60000
[junit4] 2> 1452 INFO (TEST-CloudSolrClientTest.test-seed#[1A736900F2D6E6B7]) [n:127.0.0.1:57855__f%2Fab ] o.a.s.c.c.ZkStateReader Updating cluster state from ZooKeeper...
[junit4] 2> 1452 INFO (OverseerCollectionConfigSetProcessor-94600885037039620-127.0.0.1:57855__f%2Fab-n_0000000000) [n:127.0.0.1:57855__f%2Fab ] o.a.s.c.OverseerTaskProcessor Process current queue of overseer operations
[junit4] 2> 1517 INFO (OverseerStateUpdate-94600885037039620-127.0.0.1:57855__f%2Fab-n_0000000000) [n:127.0.0.1:57855__f%2Fab ] o.a.s.c.Overseer Starting to work on the main queue
[junit4] 2> 1606 INFO (TEST-CloudSolrClientTest.test-seed#[1A736900F2D6E6B7]) [n:127.0.0.1:57855__f%2Fab ] o.a.s.c.CoreContainer Security conf doesn't exist. Skipping setup for authorization module.
[junit4] 2> 1606 INFO (TEST-CloudSolrClientTest.test-seed#[1A736900F2D6E6B7]) [n:127.0.0.1:57855__f%2Fab ] o.a.s.c.CoreContainer No authentication plugin used.
[junit4] 2> 1661 INFO (TEST-CloudSolrClientTest.test-seed#[1A736900F2D6E6B7]) [n:127.0.0.1:57855__f%2Fab ] o.a.s.c.CoresLocator Looking for core definitions underneath /home/jenkins/workspace/Lucene-Solr-trunk-Linux/solr/build/solr-solrj/test/J2/temp/solr.client.solrj.impl.CloudSolrClientTest_1A736900F2D6E6B7-001/control-001/cores
[junit4] 2> 1699 INFO (TEST-CloudSolrClientTest.test-seed#[1A736900F2D6E6B7]) [n:127.0.0.1:57855__f%2Fab ] o.a.s.c.SolrCore Created CoreDescriptor: {name=collection1, config=solrconfig.xml, transient=false, schema=schema.xml, loadOnStartup=true, configSetProperties=configsetprops.json, instanceDir=/home/jenkins/workspace/Lucene-Solr-trunk-Linux/solr/build/solr-solrj/test/J2/temp/solr.client.solrj.impl.CloudSolrClientTest_1A736900F2D6E6B7-001/control-001/cores/collection1, collection=control_collection, absoluteInstDir=/home/jenkins/workspace/Lucene-Solr-trunk-Linux/solr/build/solr-solrj/test/J2/temp/solr.client.solrj.impl.CloudSolrClientTest_1A736900F2D6E6B7-001/control-001/cores/collection1/, coreNodeName=, dataDir=data/, shard=}
[junit4] 2> 1700 INFO (TEST-CloudSolrClientTest.test-seed#[1A736900F2D6E6B7]) [n:127.0.0.1:57855__f%2Fab ] o.a.s.c.CoresLocator Found core collection1 in /home/jenkins/workspace/Lucene-Solr-trunk-Linux/solr/build/solr-solrj/test/J2/temp/solr.client.solrj.impl.CloudSolrClientTest_1A736900F2D6E6B7-001/control-001/cores/collection1/
[junit4] 2> 1700 INFO (TEST-CloudSolrClientTest.test-seed#[1A736900F2D6E6B7]) [n:127.0.0.1:57855__f%2Fab ] o.a.s.c.CoresLocator Found 1 core definitions
[junit4] 2> 1704 INFO (TEST-CloudSolrClientTest.test-seed#[1A736900F2D6E6B7]) [n:127.0.0.1:57855__f%2Fab ] o.a.s.s.SolrDispatchFilter user.dir=/home/jenkins/workspace/Lucene-Solr-trunk-Linux/solr/build/solr-solrj/test/J2
[junit4] 2> 1704 INFO (TEST-CloudSolrClientTest.test-seed#[1A736900F2D6E6B7]) [n:127.0.0.1:57855__f%2Fab ] o.a.s.s.SolrDispatchFilter SolrDispatchFilter.init() done
[junit4] 2> 1722 INFO (coreLoadExecutor-7-thread-1-processing-n:127.0.0.1:57855__f%2Fab) [n:127.0.0.1:57855__f%2Fab c:control_collection x:collection1] o.a.s.c.ZkController publishing state=down
[junit4] 2> 1722 INFO (coreLoadExecutor-7-thread-1-processing-n:127.0.0.1:57855__f%2Fab) [n:127.0.0.1:57855__f%2Fab c:control_collection x:collection1] o.a.s.c.ZkController numShards not found on descriptor - reading it from system property
[junit4] 2> 1731 INFO (OverseerStateUpdate-94600885037039620-127.0.0.1:57855__f%2Fab-n_0000000000) [n:127.0.0.1:57855__f%2Fab ] o.a.s.c.Overseer processMessage: queueSize: 1, message = {
[junit4] 2> "core":"collection1",
[junit4] 2> "roles":null,
[junit4] 2> "base_url":"http://127.0.0.1:57855/_f/ab",
[junit4] 2> "node_name":"127.0.0.1:57855__f%2Fab",
[junit4] 2> "numShards":"1",
[junit4] 2> "state":"down",
[junit4] 2> "shard":null,
[junit4] 2> "collection":"control_collection",
[junit4] 2> "operation":"state"} current state version: 0
[junit4] 2> 1737 INFO (coreLoadExecutor-7-thread-1-processing-n:127.0.0.1:57855__f%2Fab) [n:127.0.0.1:57855__f%2Fab c:control_collection x:collection1] o.a.s.c.ZkController look for our core node name
[junit4] 2> 1739 INFO (OverseerStateUpdate-94600885037039620-127.0.0.1:57855__f%2Fab-n_0000000000) [n:127.0.0.1:57855__f%2Fab ] o.a.s.c.o.ReplicaMutator Update state numShards=1 message={
[junit4] 2> "core":"collection1",
[junit4] 2> "roles":null,
[junit4] 2> "base_url":"http://127.0.0.1:57855/_f/ab",
[junit4] 2> "node_name":"127.0.0.1:57855__f%2Fab",
[junit4] 2> "numShards":"1",
[junit4] 2> "state":"down",
[junit4] 2> "shard":null,
[junit4] 2> "collection":"control_collection",
[junit4] 2> "operation":"state"}
[junit4] 2> 1740 INFO (OverseerStateUpdate-94600885037039620-127.0.0.1:57855__f%2Fab-n_0000000000) [n:127.0.0.1:57855__f%2Fab ] o.a.s.c.o.ClusterStateMutator building a new cName: control_collection
[junit4] 2> 1747 INFO (OverseerStateUpdate-94600885037039620-127.0.0.1:57855__f%2Fab-n_0000000000) [n:127.0.0.1:57855__f%2Fab ] o.a.s.c.o.ReplicaMutator Assigning new node to shard shard=shard1
[junit4] 2> 1752 INFO (zkCallback-6-thread-1-processing-n:127.0.0.1:57855__f%2Fab) [n:127.0.0.1:57855__f%2Fab ] o.a.s.c.c.ZkStateReader A cluster state change: WatchedEvent state:SyncConnected type:NodeDataChanged path:/clusterstate.json, has occurred - updating... (live nodes size: 1)
[junit4] 2> 2738 INFO (coreLoadExecutor-7-thread-1-processing-n:127.0.0.1:57855__f%2Fab) [n:127.0.0.1:57855__f%2Fab c:control_collection x:collection1] o.a.s.c.ZkController waiting to find shard id in clusterstate for collection1
[junit4] 2> 2739 INFO (coreLoadExecutor-7-thread-1-processing-n:127.0.0.1:57855__f%2Fab) [n:127.0.0.1:57855__f%2Fab c:control_collection x:collection1] o.a.s.c.ZkController Check for collection zkNode:control_collection
[junit4] 2> 2740 INFO (coreLoadExecutor-7-thread-1-processing-n:127.0.0.1:57855__f%2Fab) [n:127.0.0.1:57855__f%2Fab c:control_collection x:collection1] o.a.s.c.ZkController Collection zkNode exists
[junit4] 2> 2741 INFO (coreLoadExecutor-7-thread-1-processing-n:127.0.0.1:57855__f%2Fab) [n:127.0.0.1:57855__f%2Fab c:control_collection x:collection1] o.a.s.c.c.ZkStateReader Load collection config from:/collections/control_collection
[junit4] 2> 2742 INFO (coreLoadExecutor-7-thread-1-processing-n:127.0.0.1:57855__f%2Fab) [n:127.0.0.1:57855__f%2Fab c:control_collection x:collection1] o.a.s.c.c.ZkStateReader path=/collections/control_collection configName=conf1 specified config exists in ZooKeeper
[junit4] 2> 2743 INFO (coreLoadExecutor-7-thread-1-processing-n:127.0.0.1:57855__f%2Fab) [n:127.0.0.1:57855__f%2Fab c:control_collection x:collection1] o.a.s.c.SolrResourceLoader new SolrResourceLoader for directory: '/home/jenkins/workspace/Lucene-Solr-trunk-Linux/solr/build/solr-solrj/test/J2/temp/solr.client.solrj.impl.CloudSolrClientTest_1A736900F2D6E6B7-001/control-001/cores/collection1/'
[junit4] 2> 2784 INFO (coreLoadExecutor-7-thread-1-processing-n:127.0.0.1:57855__f%2Fab) [n:127.0.0.1:57855__f%2Fab c:control_collection x:collection1] o.a.s.c.Config loaded config solrconfig.xml with version 0
[junit4] 2> 2829 INFO (coreLoadExecutor-7-thread-1-processing-n:127.0.0.1:57855__f%2Fab) [n:127.0.0.1:57855__f%2Fab c:control_collection x:collection1] o.a.s.c.SolrConfig current version of requestparams : -1
[junit4] 2> 2844 INFO (coreLoadExecutor-7-thread-1-processing-n:127.0.0.1:57855__f%2Fab) [n:127.0.0.1:57855__f%2Fab c:control_collection x:collection1] o.a.s.c.SolrConfig Using Lucene MatchVersion: 6.0.0
[junit4] 2> 2897 INFO (coreLoadExecutor-7-thread-1-processing-n:127.0.0.1:57855__f%2Fab) [n:127.0.0.1:57855__f%2Fab c:control_collection x:collection1] o.a.s.c.Config Loaded SolrConfig: solrconfig.xml
[junit4] 2> 2906 INFO (coreLoadExecutor-7-thread-1-processing-n:127.0.0.1:57855__f%2Fab) [n:127.0.0.1:57855__f%2Fab c:control_collection x:collection1] o.a.s.s.IndexSchema Reading Solr Schema from /configs/conf1/schema.xml
[junit4] 2> 2981 INFO (coreLoadExecutor-7-thread-1-processing-n:127.0.0.1:57855__f%2Fab) [n:127.0.0.1:57855__f%2Fab c:control_collection x:collection1] o.a.s.s.IndexSchema [collection1] Schema name=test
[junit4] 2> 3484 INFO (coreLoadExecutor-7-thread-1-processing-n:127.0.0.1:57855__f%2Fab) [n:127.0.0.1:57855__f%2Fab c:control_collection x:collection1] o.a.s.s.IndexSchema default search field in schema is text
[junit4] 2> 3486 INFO (coreLoadExecutor-7-thread-1-processing-n:127.0.0.1:57855__f%2Fab) [n:127.0.0.1:57855__f%2Fab c:control_collection x:collection1] o.a.s.s.IndexSchema unique key field: id
[junit4] 2> 3494 WARN (coreLoadExecutor-7-thread-1-processing-n:127.0.0.1:57855__f%2Fab) [n:127.0.0.1:57855__f%2Fab c:control_collection x:collection1] o.a.s.s.IndexSchema Field lowerfilt1and2 is not multivalued and destination for multiple copyFields (2)
[junit4] 2> 3494 WARN (coreLoadExecutor-7-thread-1-processing-n:127.0.0.1:57855__f%2Fab) [n:127.0.0.1:57855__f%2Fab c:control_collection x:collection1] o.a.s.s.IndexSchema Field text is not multivalued and destination for multiple copyFields (3)
[junit4] 2> 3518 INFO (coreLoadExecutor-7-thread-1-processing-n:127.0.0.1:57855__f%2Fab) [n:127.0.0.1:57855__f%2Fab c:control_collection x:collection1] o.a.s.c.ConfigSetProperties Did not find ConfigSet properties, assuming default properties: Can't find resource 'configsetprops.json' in classpath or '/configs/conf1', cwd=/home/jenkins/workspace/Lucene-Solr-trunk-Linux/solr/build/solr-solrj/test/J2
[junit4] 2> 3519 INFO (coreLoadExecutor-7-thread-1-processing-n:127.0.0.1:57855__f%2Fab) [n:127.0.0.1:57855__f%2Fab c:control_collection x:collection1] o.a.s.c.CoreContainer Creating SolrCore 'collection1' using configuration from collection control_collection
[junit4] 2> 3519 INFO (coreLoadExecutor-7-thread-1-processing-n:127.0.0.1:57855__f%2Fab) [n:127.0.0.1:57855__f%2Fab c:control_collection s:shard1 r:core_node1 x:collection1] o.a.s.c.SolrCore org.apache.solr.core.MockDirectoryFactory
[junit4] 2> 3534 INFO (coreLoadExecutor-7-thread-1-processing-n:127.0.0.1:57855__f%2Fab) [n:127.0.0.1:57855__f%2Fab c:control_collection s:shard1 r:core_node1 x:collection1] o.a.s.c.SolrCore [[collection1] ] Opening new SolrCore at [/home/jenkins/workspace/Lucene-Solr-trunk-Linux/solr/build/solr-solrj/test/J2/temp/solr.client.solrj.impl.CloudSolrClientTest_1A736900F2D6E6B7-001/control-001/cores/collection1/], dataDir=[null]
[junit4] 2> 3535 INFO (coreLoadExecutor-7-thread-1-processing-n:127.0.0.1:57855__f%2Fab) [n:127.0.0.1:57855__f%2Fab c:control_collection s:shard1 r:core_node1 x:collection1] o.a.s.c.SolrCore JMX monitoring not detected for core: collection1
[junit4] 2> 3553 INFO (coreLoadExecutor-7-thread-1-processing-n:127.0.0.1:57855__f%2Fab) [n:127.0.0.1:57855__f%2Fab c:control_collection s:shard1 r:core_node1 x:collection1] o.a.s.c.CachingDirectoryFactory return new directory for /home/jenkins/workspace/Lucene-Solr-trunk-Linux/solr/build/solr-solrj/test/J2/temp/solr.client.solrj.impl.CloudSolrClientTest_1A736900F2D6E6B7-001/control-001/cores/collection1/data
[junit4] 2> 3553 INFO (coreLoadExecutor-7-thread-1-processing-n:127.0.0.1:57855__f%2Fab) [n:127.0.0.1:57855__f%2Fab c:control_collection s:shard1 r:core_node1 x:collection1] o.a.s.c.SolrCore New index directory detected: old=null new=/home/jenkins/workspace/Lucene-Solr-trunk-Linux/solr/build/solr-solrj/test/J2/temp/solr.client.solrj.impl.CloudSolrClientTest_1A736900F2D6E6B7-001/control-001/cores/collection1/data/index/
[junit4] 2> 3553 WARN (coreLoadExecutor-7-thread-1-processing-n:127.0.0.1:57855__f%2Fab) [n:127.0.0.1:57855__f%2Fab c:control_collection s:shard1 r:core_node1 x:collection1] o.a.s.c.SolrCore [collection1] Solr index directory '/home/jenkins/workspace/Lucene-Solr-trunk-Linux/solr/build/solr-solrj/test/J2/temp/solr.client.solrj.impl.CloudSolrClientTest_1A736900F2D6E6B7-001/control-001/cores/collection1/data/index' doesn't exist. Creating new index...
[junit4] 2> 3565 INFO (coreLoadExecutor-7-thread-1-processing-n:127.0.0.1:57855__f%2Fab) [n:127.0.0.1:57855__f%2Fab c:control_collection s:shard1 r:core_node1 x:collection1] o.a.s.c.CachingDirectoryFactory return new directory for /home/jenkins/workspace/Lucene-Solr-trunk-Linux/solr/build/solr-solrj/test/J2/temp/solr.client.solrj.impl.CloudSolrClientTest_1A736900F2D6E6B7-001/control-001/cores/collection1/data/index
[junit4] 2> 3602 INFO (coreLoadExecutor-7-thread-1-processing-n:127.0.0.1:57855__f%2Fab) [n:127.0.0.1:57855__f%2Fab c:control_collection s:shard1 r:core_node1 x:collection1] o.a.s.c.SolrCore SolrDeletionPolicy.onCommit: commits: num=1
[junit4] 2> commit{dir=MockDirectoryWrapper(RAMDirectory@7d37e9de lockFactory=org.apache.lucene.store.SingleInstanceLockFactory@7cdd5eb5),segFN=segments_1,generation=1}
[junit4] 2> 3603 INFO (coreLoadExecutor-7-thread-1-processing-n:127.0.0.1:57855__f%2Fab) [n:127.0.0.1:57855__f%2Fab c:control_collection s:shard1 r:core_node1 x:collection1] o.a.s.c.SolrCore newest commit generation = 1
[junit4] 2> 3603 INFO (OldIndexDirectoryCleanupThreadForCore-collection1) [n:127.0.0.1:57855__f%2Fab c:control_collection s:shard1 r:core_node1 x:collection1] o.a.s.c.SolrCore Looking for old index directories to cleanup for core collection1 in /home/jenkins/workspace/Lucene-Solr-trunk-Linux/solr/build/solr-solrj/test/J2/temp/solr.client.solrj.impl.CloudSolrClientTest_1A736900F2D6E6B7-001/control-001/cores/collection1/data/
[junit4] 2> 3604 WARN (OldIndexDirectoryCleanupThreadForCore-collection1) [n:127.0.0.1:57855__f%2Fab c:control_collection s:shard1 r:core_node1 x:collection1] o.a.s.c.DirectoryFactory /home/jenkins/workspace/Lucene-Solr-trunk-Linux/solr/build/solr-solrj/test/J2/temp/solr.client.solrj.impl.CloudSolrClientTest_1A736900F2D6E6B7-001/control-001/cores/collection1/data/ does not point to a valid data directory; skipping clean-up of old index directories.
[junit4] 2> 3785 INFO (coreLoadExecutor-7-thread-1-processing-n:127.0.0.1:57855__f%2Fab) [n:127.0.0.1:57855__f%2Fab c:control_collection s:shard1 r:core_node1 x:collection1] o.a.s.c.SolrCore no updateRequestProcessorChain defined as default, creating implicit default
[junit4] 2> 3842 INFO (coreLoadExecutor-7-thread-1-processing-n:127.0.0.1:57855__f%2Fab) [n:127.0.0.1:57855__f%2Fab c:control_collection s:shard1 r:core_node1 x:collection1] o.a.s.h.l.XMLLoader xsltCacheLifetimeSeconds=60
[junit4] 2> 3847 INFO (coreLoadExecutor-7-thread-1-processing-n:127.0.0.1:57855__f%2Fab) [n:127.0.0.1:57855__f%2Fab c:control_collection s:shard1 r:core_node1 x:collection1] o.a.s.h.l.XMLLoader xsltCacheLifetimeSeconds=60
[junit4] 2> 3848 INFO (coreLoadExecutor-7-thread-1-processing-n:127.0.0.1:57855__f%2Fab) [n:127.0.0.1:57855__f%2Fab c:control_collection s:shard1 r:core_node1 x:collection1] o.a.s.h.l.XMLLoader xsltCacheLifetimeSeconds=60
[junit4] 2> 3849 INFO (coreLoadExecutor-7-thread-1-processing-n:127.0.0.1:57855__f%2Fab) [n:127.0.0.1:57855__f%2Fab c:control_collection s:shard1 r:core_node1 x:collection1] o.a.s.h.l.XMLLoader xsltCacheLifetimeSeconds=60
[junit4] 2> 3865 INFO (coreLoadExecutor-7-thread-1-processing-n:127.0.0.1:57855__f%2Fab) [n:127.0.0.1:57855__f%2Fab c:control_collection s:shard1 r:core_node1 x:collection1] o.a.s.c.RequestHandlers Registered paths: /admin/mbeans,standard,,/update/csv,/update/json/docs,/admin/luke,/admin/segments,/get,/admin/system,/replication,/admin/properties,/config,/schema,/admin/plugins,/admin/logging,/update/json,/admin/threads,/admin/ping,/update,/admin/file
[junit4] 2> 3866 INFO (coreLoadExecutor-7-thread-1-processing-n:127.0.0.1:57855__f%2Fab) [n:127.0.0.1:57855__f%2Fab c:control_collection s:shard1 r:core_node1 x:collection1] o.a.s.c.SolrCore Using default statsCache cache: org.apache.solr.search.stats.LocalStatsCache
[junit4] 2> 3888 INFO (coreLoadExecutor-7-thread-1-processing-n:127.0.0.1:57855__f%2Fab) [n:127.0.0.1:57855__f%2Fab c:control_collection s:shard1 r:core_node1 x:collection1] o.a.s.u.UpdateHandler Using UpdateLog implementation: org.apache.solr.update.UpdateLog
[junit4] 2> 3899 INFO (coreLoadExecutor-7-thread-1-processing-n:127.0.0.1:57855__f%2Fab) [n:127.0.0.1:57855__f%2Fab c:control_collection s:shard1 r:core_node1 x:collection1] o.a.s.u.UpdateLog Initializing UpdateLog: dataDir= defaultSyncLevel=FLUSH numRecordsToKeep=100 maxNumLogsToKeep=10 numVersionBuckets=65536
[junit4] 2> 3921 INFO (coreLoadExecutor-7-thread-1-processing-n:127.0.0.1:57855__f%2Fab) [n:127.0.0.1:57855__f%2Fab c:control_collection s:shard1 r:core_node1 x:collection1] o.a.s.c.SolrCore Hard AutoCommit: disabled
[junit4] 2> 3921 INFO (coreLoadExecutor-7-thread-1-processing-n:127.0.0.1:57855__f%2Fab) [n:127.0.0.1:57855__f%2Fab c:control_collection s:shard1 r:core_node1 x:collection1] o.a.s.c.SolrCore Soft AutoCommit: disabled
[junit4] 2> 3923 INFO (coreLoadExecutor-7-thread-1-processing-n:127.0.0.1:57855__f%2Fab) [n:127.0.0.1:57855__f%2Fab c:control_collection s:shard1 r:core_node1 x:collection1] o.a.s.c.SolrCore SolrDeletionPolicy.onInit: commits: num=1
[junit4] 2> commit{dir=MockDirectoryWrapper(RAMDirectory@7d37e9de lockFactory=org.apache.lucene.store.SingleInstanceLockFactory@7cdd5eb5),segFN=segments_1,generation=1}
[junit4] 2> 3924 INFO (coreLoadExecutor-7-thread-1-processing-n:127.0.0.1:57855__f%2Fab) [n:127.0.0.1:57855__f%2Fab c:control_collection s:shard1 r:core_node1 x:collection1] o.a.s.c.SolrCore newest commit generation = 1
[junit4] 2> 3942 INFO (coreLoadExecutor-7-thread-1-processing-n:127.0.0.1:57855__f%2Fab) [n:127.0.0.1:57855__f%2Fab c:control_collection s:shard1 r:core_node1 x:collection1] o.a.s.s.SolrIndexSearcher Opening Searcher@96b3b91[collection1] main
[junit4] 2> 3950 INFO (coreLoadExecutor-7-thread-1-processing-n:127.0.0.1:57855__f%2Fab) [n:127.0.0.1:57855__f%2Fab c:control_collection s:shard1 r:core_node1 x:collection1] o.a.s.c.c.ZkStateReader Load collection config from:/collections/control_collection
[junit4] 2> 3951 INFO (coreLoadExecutor-7-thread-1-processing-n:127.0.0.1:57855__f%2Fab) [n:127.0.0.1:57855__f%2Fab c:control_collection s:shard1 r:core_node1 x:collection1] o.a.s.c.c.ZkStateReader path=/collections/control_collection configName=conf1 specified config exists in ZooKeeper
[junit4] 2> 3951 INFO (coreLoadExecutor-7-thread-1-processing-n:127.0.0.1:57855__f%2Fab) [n:127.0.0.1:57855__f%2Fab c:control_collection s:shard1 r:core_node1 x:collection1] o.a.s.r.ManagedResourceStorage Setting up ZooKeeper-based storage for the RestManager with znodeBase: /configs/conf1
[junit4] 2> 3953 INFO (coreLoadExecutor-7-thread-1-processing-n:127.0.0.1:57855__f%2Fab) [n:127.0.0.1:57855__f%2Fab c:control_collection s:shard1 r:core_node1 x:collection1] o.a.s.r.ManagedResourceStorage Configured ZooKeeperStorageIO with znodeBase: /configs/conf1
[junit4] 2> 3953 INFO (coreLoadExecutor-7-thread-1-processing-n:127.0.0.1:57855__f%2Fab) [n:127.0.0.1:57855__f%2Fab c:control_collection s:shard1 r:core_node1 x:collection1] o.a.s.r.RestManager Initializing RestManager with initArgs: {}
[junit4] 2> 3973 INFO (coreLoadExecutor-7-thread-1-processing-n:127.0.0.1:57855__f%2Fab) [n:127.0.0.1:57855__f%2Fab c:control_collection s:shard1 r:core_node1 x:collection1] o.a.s.r.ManagedResourceStorage Reading _rest_managed.json using ZooKeeperStorageIO:path=/configs/conf1
[junit4] 2> 3975 INFO (coreLoadExecutor-7-thread-1-processing-n:127.0.0.1:57855__f%2Fab) [n:127.0.0.1:57855__f%2Fab c:control_collection s:shard1 r:core_node1 x:collection1] o.a.s.r.ManagedResourceStorage No data found for znode /configs/conf1/_rest_managed.json
[junit4] 2> 3975 INFO (coreLoadExecutor-7-thread-1-processing-n:127.0.0.1:57855__f%2Fab) [n:127.0.0.1:57855__f%2Fab c:control_collection s:shard1 r:core_node1 x:collection1] o.a.s.r.ManagedResourceStorage Loaded null at path _rest_managed.json using ZooKeeperStorageIO:path=/configs/conf1
[junit4] 2> 3975 INFO (coreLoadExecutor-7-thread-1-processing-n:127.0.0.1:57855__f%2Fab) [n:127.0.0.1:57855__f%2Fab c:control_collection s:shard1 r:core_node1 x:collection1] o.a.s.r.RestManager Initializing 0 registered ManagedResources
[junit4] 2> 3998 INFO (coreLoadExecutor-7-thread-1-processing-n:127.0.0.1:57855__f%2Fab) [n:127.0.0.1:57855__f%2Fab c:control_collection s:shard1 r:core_node1 x:collection1] o.a.s.h.ReplicationHandler Commits will be reserved for 10000
[junit4] 2> 3999 INFO (searcherExecutor-8-thread-1-processing-n:127.0.0.1:57855__f%2Fab x:collection1 s:shard1 c:control_collection r:core_node1) [n:127.0.0.1:57855__f%2Fab c:control_collection s:shard1 r:core_node1 x:collection1] o.a.s.c.SolrCore [collection1] Registered new searcher Searcher@96b3b91[collection1] main{ExitableDirectoryReader(UninvertingDirectoryReader())}
[junit4] 2> 3999 INFO (coreLoadExecutor-7-thread-1-processing-n:127.0.0.1:57855__f%2Fab) [n:127.0.0.1:57855__f%2Fab c:control_collection s:shard1 r:core_node1 x:collection1] o.a.s.u.UpdateLog Looking up max value of version field to seed version buckets
[junit4] 2> 4001 INFO (coreLoadExecutor-7-thread-1-processing-n:127.0.0.1:57855__f%2Fab) [n:127.0.0.1:57855__f%2Fab c:control_collection s:shard1 r:core_node1 x:collection1] o.a.s.u.VersionInfo Refreshing highest value of _version_ for 65536 version buckets from index
[junit4] 2> 4002 INFO (coreLoadExecutor-7-thread-1-processing-n:127.0.0.1:57855__f%2Fab) [n:127.0.0.1:57855__f%2Fab c:control_collection s:shard1 r:core_node1 x:collection1] o.a.s.u.VersionInfo No terms found for _version_, cannot seed version bucket highest value from index
[junit4] 2> 4003 INFO (coreLoadExecutor-7-thread-1-processing-n:127.0.0.1:57855__f%2Fab) [n:127.0.0.1:57855__f%2Fab c:control_collection s:shard1 r:core_node1 x:collection1] o.a.s.u.UpdateLog Could not find max version in index or recent updates, using new clock 1513614164702003200
[junit4] 2> 4010 INFO (coreLoadExecutor-7-thread-1-processing-n:127.0.0.1:57855__f%2Fab) [n:127.0.0.1:57855__f%2Fab c:control_collection s:shard1 r:core_node1 x:collection1] o.a.s.u.UpdateLog Took 8.0ms to seed version buckets with highest version 1513614164702003200
[junit4] 2> 4011 INFO (coreLoadExecutor-7-thread-1-processing-n:127.0.0.1:57855__f%2Fab) [n:127.0.0.1:57855__f%2Fab c:control_collection s:shard1 r:core_node1 x:collection1] o.a.s.c.ZkController watch zkdir /configs/conf1
[junit4] 2> 4015 INFO (coreLoadExecutor-7-thread-1-processing-n:127.0.0.1:57855__f%2Fab) [n:127.0.0.1:57855__f%2Fab c:control_collection s:shard1 r:core_node1 x:collection1] o.a.s.c.CoreContainer registering core: collection1
[junit4] 2> 4029 INFO (coreZkRegister-1-thread-1-processing-n:127.0.0.1:57855__f%2Fab x:collection1 s:shard1 c:control_collection r:core_node1) [n:127.0.0.1:57855__f%2Fab c:control_collection s:shard1 r:core_node1 x:collection1] o.a.s.c.ZkController Register replica - core:collection1 address:http://127.0.0.1:57855/_f/ab collection:control_collection shard:shard1
[junit4] 2> 4035 INFO (coreZkRegister-1-thread-1-processing-n:127.0.0.1:57855__f%2Fab x:collection1 s:shard1 c:control_collection r:core_node1) [n:127.0.0.1:57855__f%2Fab c:control_collection s:shard1 r:core_node1 x:collection1] o.a.s.c.c.SolrZkClient makePath: /collections/control_collection/leader_elect/shard1/election
[junit4] 2> 4040 INFO (coreZkRegister-1-thread-1-processing-n:127.0.0.1:57855__f%2Fab x:collection1 s:shard1 c:control_collection r:core_node1) [n:127.0.0.1:57855__f%2Fab c:control_collection s:shard1 r:core_node1 x:collection1] o.a.s.c.LeaderElector Joined leadership election with path: /collections/control_collection/leader_elect/shard1/election/94600885037039620-core_node1-n_0000000000
[junit4] 2> 4041 INFO (coreZkRegister-1-thread-1-processing-n:127.0.0.1:57855__f%2Fab x:collection1 s:shard1 c:control_collection r:core_node1) [n:127.0.0.1:57855__f%2Fab c:control_collection s:shard1 r:core_node1 x:collection1] o.a.s.c.ShardLeaderElectionContext Running the leader process for shard shard1
[junit4] 2> 4047 INFO (coreZkRegister-1-thread-1-processing-n:127.0.0.1:57855__f%2Fab x:collection1 s:shard1 c:control_collection r:core_node1) [n:127.0.0.1:57855__f%2Fab c:control_collection s:shard1 r:core_node1 x:collection1] o.a.s.c.ShardLeaderElectionContext Enough replicas found to continue.
[junit4] 2> 4047 INFO (coreZkRegister-1-thread-1-processing-n:127.0.0.1:57855__f%2Fab x:collection1 s:shard1 c:control_collection r:core_node1) [n:127.0.0.1:57855__f%2Fab c:control_collection s:shard1 r:core_node1 x:collection1] o.a.s.c.ShardLeaderElectionContext I may be the new leader - try and sync
[junit4] 2> 4048 INFO (OverseerStateUpdate-94600885037039620-127.0.0.1:57855__f%2Fab-n_0000000000) [n:127.0.0.1:57855__f%2Fab ] o.a.s.c.Overseer processMessage: queueSize: 1, message = {
[junit4] 2> "operation":"leader",
[junit4] 2> "shard":"shard1",
[junit4] 2> "collection":"control_collection"} current state version: 1
[junit4] 2> 4049 INFO (coreZkRegister-1-thread-1-processing-n:127.0.0.1:57855__f%2Fab x:collection1 s:shard1 c:control_collection r:core_node1) [n:127.0.0.1:57855__f%2Fab c:control_collection s:shard1 r:core_node1 x:collection1] o.a.s.c.SyncStrategy Sync replicas to http://127.0.0.1:57855/_f/ab/collection1/
[junit4] 2> 4049 INFO (coreZkRegister-1-thread-1-processing-n:127.0.0.1:57855__f%2Fab x:collection1 s:shard1 c:control_collection r:core_node1) [n:127.0.0.1:57855__f%2Fab c:control_collection s:shard1 r:core_node1 x:collection1] o.a.s.c.SyncStrategy Sync Success - now sync replicas to me
[junit4] 2> 4050 INFO (coreZkRegister-1-thread-1-processing-n:127.0.0.1:57855__f%2Fab x:collection1 s:shard1 c:control_collection r:core_node1) [n:127.0.0.1:57855__f%2Fab c:control_collection s:shard1 r:core_node1 x:collection1] o.a.s.c.SyncStrategy http://127.0.0.1:57855/_f/ab/collection1/ has no replicas
[junit4] 2> 4050 INFO (coreZkRegister-1-thread-1-processing-n:127.0.0.1:57855__f%2Fab x:collection1 s:shard1 c:control_collection r:core_node1) [n:127.0.0.1:57855__f%2Fab c:control_collection s:shard1 r:core_node1 x:collection1] o.a.s.c.ShardLeaderElectionContext I am the new leader: http://127.0.0.1:57855/_f/ab/collection1/ shard1
[junit4] 2> 4056 INFO (coreZkRegister-1-thread-1-processing-n:127.0.0.1:57855__f%2Fab x:collection1 s:shard1 c:control_collection r:core_node1) [n:127.0.0.1:57855__f%2Fab c:control_collection s:shard1 r:core_node1 x:collection1] o.a.s.c.c.SolrZkClient makePath: /collections/control_collection/leaders/shard1
[junit4] 2> 4057 INFO (zkCallback-6-thread-1-processing-n:127.0.0.1:57855__f%2Fab) [n:127.0.0.1:57855__f%2Fab ] o.a.s.c.c.ZkStateReader A cluster state change: WatchedEvent state:SyncConnected type:NodeDataChanged path:/clusterstate.json, has occurred - updating... (live nodes size: 1)
[junit4] 2> 4066 INFO (coreZkRegister-1-thread-1-processing-n:127.0.0.1:57855__f%2Fab x:collection1 s:shard1 c:control_collection r:core_node1) [n:127.0.0.1:57855__f%2Fab c:control_collection s:shard1 r:core_node1 x:collection1] o.a.s.c.ShardLeaderElectionContextBase Creating leader registration node
[junit4] 2> 4086 INFO (OverseerStateUpdate-94600885037039620-127.0.0.1:57855__f%2Fab-n_0000000000) [n:127.0.0.1:57855__f%2Fab ] o.a.s.c.Overseer processMessage: queueSize: 1, message = {
[junit4] 2> "operation":"leader",
[junit4] 2> "shard":"shard1",
[junit4] 2> "collection":"control_collection",
[junit4] 2> "base_url":"http://127.0.0.1:57855/_f/ab",
[junit4] 2> "core":"collection1",
[junit4] 2> "state":"active"} current state version: 2
[junit4] 2> 4201 INFO (zkCallback-6-thread-1-processing-n:127.0.0.1:57855__f%2Fab) [n:127.0.0.1:57855__f%2Fab ] o.a.s.c.c.ZkStateReader A cluster state change: WatchedEvent state:SyncConnected type:NodeDataChanged path:/clusterstate.json, has occurred - updating... (live nodes size: 1)
[junit4] 2> 4203 INFO (coreZkRegister-1-thread-1-processing-n:127.0.0.1:57855__f%2Fab x:collection1 s:shard1 c:control_collection r:core_node1) [n:127.0.0.1:57855__f%2Fab c:control_collection s:shard1 r:core_node1 x:collection1] o.a.s.c.ZkController We are http://127.0.0.1:57855/_f/ab/collection1/ and leader is http://127.0.0.1:57855/_f/ab/collection1/
[junit4] 2> 4205 INFO (coreZkRegister-1-thread-1-processing-n:127.0.0.1:57855__f%2Fab x:collection1 s:shard1 c:control_collection r:core_node1) [n:127.0.0.1:57855__f%2Fab c:control_collection s:shard1 r:core_node1 x:collection1] o.a.s.c.ZkController No LogReplay needed for core=collection1 baseURL=http://127.0.0.1:57855/_f/ab
[junit4] 2> 4205 INFO (coreZkRegister-1-thread-1-processing-n:127.0.0.1:57855__f%2Fab x:collection1 s:shard1 c:control_collection r:core_node1) [n:127.0.0.1:57855__f%2Fab c:control_collection s:shard1 r:core_node1 x:collection1] o.a.s.c.ZkController I am the leader, no recovery necessary
[junit4] 2> 4205 INFO (coreZkRegister-1-thread-1-processing-n:127.0.0.1:57855__f%2Fab x:collection1 s:shard1 c:control_collection r:core_node1) [n:127.0.0.1:57855__f%2Fab c:control_collection s:shard1 r:core_node1 x:collection1] o.a.s.c.ZkController publishing state=active
[junit4] 2> 4205 INFO (coreZkRegister-1-thread-1-processing-n:127.0.0.1:57855__f%2Fab x:collection1 s:shard1 c:control_collection r:core_node1) [n:127.0.0.1:57855__f%2Fab c:control_collection s:shard1 r:core_node1 x:collection1] o.a.s.c.ZkController numShards not found on descriptor - reading it from system property
[junit4] 2> 4208 INFO (OverseerStateUpdate-94600885037039620-127.0.0.1:57855__f%2Fab-n_0000000000) [n:127.0.0.1:57855__f%2Fab ] o.a.s.c.Overseer processMessage: queueSize: 1, message = {
[junit4] 2> "core":"collection1",
[junit4] 2> "core_node_name":"core_node1",
[junit4] 2> "roles":null,
[junit4] 2> "base_url":"http://127.0.0.1:57855/_f/ab",
[junit4] 2> "node_name":"127.0.0.1:57855__f%2Fab",
[junit4] 2> "numShards":"1",
[junit4] 2> "state":"active",
[junit4] 2> "shard":"shard1",
[junit4] 2> "collection":"control_collection",
[junit4] 2> "operation":"state"} current state version: 3
[junit4] 2> 4210 INFO (OverseerStateUpdate-94600885037039620-127.0.0.1:57855__f%2Fab-n_0000000000) [n:127.0.0.1:57855__f%2Fab ] o.a.s.c.o.ReplicaMutator Update state numShards=1 message={
[junit4] 2> "core":"collection1",
[junit4] 2> "core_node_name":"core_node1",
[junit4] 2> "roles":null,
[junit4] 2> "base_url":"http://127.0.0.1:57855/_f/ab",
[junit4] 2> "node_name":"127.0.0.1:57855__f%2Fab",
[junit4] 2> "numShards":"1",
[junit4] 2> "state":"active",
[junit4] 2> "shard":"shard1",
[junit4] 2> "collection":"control_collection",
[junit4] 2> "operation":"state"}
[junit4] 2> 4274 INFO (TEST-CloudSolrClientTest.test-seed#[1A736900F2D6E6B7]) [ ] o.a.s.c.c.SolrZkClient Using default ZkCredentialsProvider
[junit4] 2> 4274 INFO (TEST-CloudSolrClientTest.test-seed#[1A736900F2D6E6B7]) [ ] o.a.s.c.c.ConnectionManager Waiting for client to connect to ZooKeeper
[junit4] 2> 4281 INFO (zkCallback-8-thread-1) [ ] o.a.s.c.c.ConnectionManager Watcher org.apache.solr.common.cloud.ConnectionManager@8aa7ac4 name:ZooKeeperConnection Watcher:127.0.0.1:60210/solr got event WatchedEvent state:SyncConnected type:None path:null path:null type:None
[junit4] 2> 4282 INFO (TEST-CloudSolrClientTest.test-seed#[1A736900F2D6E6B7]) [ ] o.a.s.c.c.ConnectionManager Client is connected to ZooKeeper
[junit4] 2> 4282 INFO (TEST-CloudSolrClientTest.test-seed#[1A736900F2D6E6B7]) [ ] o.a.s.c.c.SolrZkClient Using default ZkACLProvider
[junit4] 2> 4282 INFO (TEST-CloudSolrClientTest.test-seed#[1A736900F2D6E6B7]) [ ] o.a.s.c.c.ZkStateReader Updating cluster state from ZooKeeper...
[junit4] 2> 4286 INFO (TEST-CloudSolrClientTest.test-seed#[1A736900F2D6E6B7]) [ ] o.a.s.c.ChaosMonkey monkey: init - expire sessions:false cause connection loss:false
[junit4] 2> 4287 INFO (TEST-CloudSolrClientTest.test-seed#[1A736900F2D6E6B7]) [ ] o.a.s.c.AbstractFullDistribZkTestBase Creating collection1 with stateFormat=2
[junit4] 2> 4287 INFO (TEST-CloudSolrClientTest.test-seed#[1A736900F2D6E6B7]) [ ] o.a.s.c.c.SolrZkClient Using default ZkCredentialsProvider
[junit4] 2> 4287 INFO (TEST-CloudSolrClientTest.test-seed#[1A736900F2D6E6B7]) [ ] o.a.s.c.c.ConnectionManager Waiting for client to connect to ZooKeeper
[junit4] 2> 4291 INFO (zkCallback-9-thread-1) [ ] o.a.s.c.c.ConnectionManager Watcher org.apache.solr.common.cloud.ConnectionManager@6fae89ff name:ZooKeeperConnection Watcher:127.0.0.1:60210/solr got event WatchedEvent state:SyncConnected type:None path:null path:null type:None
[junit4] 2> 4291 INFO (TEST-CloudSolrClientTest.test-seed#[1A736900F2D6E6B7]) [ ] o.a.s.c.c.ConnectionManager Client is connected to ZooKeeper
[junit4] 2> 4291 INFO (TEST-CloudSolrClientTest.test-seed#[1A736900F2D6E6B7]) [ ] o.a.s.c.c.SolrZkClient Using default ZkACLProvider
[junit4] 2> 4297 INFO (OverseerStateUpdate-94600885037039620-127.0.0.1:57855__f%2Fab-n_0000000000) [n:127.0.0.1:57855__f%2Fab ] o.a.s.c.Overseer processMessage: queueSize: 1, message = {
[junit4] 2> "operation":"create",
[junit4] 2> "name":"collection1",
[junit4] 2> "numShards":"2",
[junit4] 2> "stateFormat":"2"} current state version: 3
[junit4] 2> 4297 INFO (OverseerStateUpdate-94600885037039620-127.0.0.1:57855__f%2Fab-n_0000000000) [n:127.0.0.1:57855__f%2Fab ] o.a.s.c.o.ClusterStateMutator building a new cName: collection1
[junit4] 2> 4298 INFO (zkCallback-8-thread-1) [ ] o.a.s.c.c.ZkStateReader A cluster state change: WatchedEvent state:SyncConnected type:NodeDataChanged path:/clusterstate.json, has occurred - updating... (live nodes size: 1)
[junit4] 2> 4298 INFO (zkCallback-6-thread-1-processing-n:127.0.0.1:57855__f%2Fab) [n:127.0.0.1:57855__f%2Fab ] o.a.s.c.c.ZkStateReader A cluster state change: WatchedEvent state:SyncConnected type:NodeDataChanged path:/clusterstate.json, has occurred - updating... (live nodes size: 1)
[junit4] 2> 4312 INFO (TEST-CloudSolrClientTest.test-seed#[1A736900F2D6E6B7]) [ ] o.a.s.SolrTestCaseJ4 Writing core.properties file to /home/jenkins/workspace/Lucene-Solr-trunk-Linux/solr/build/solr-solrj/test/J2/temp/solr.client.solrj.impl.CloudSolrClientTest_1A736900F2D6E6B7-001/shard-1-001/cores/collection1
[junit4] 2> 4313 INFO (TEST-CloudSolrClientTest.test-seed#[1A736900F2D6E6B7]) [ ] o.a.s.c.AbstractFullDistribZkTestBase create jetty 1 in directory /home/jenkins/workspace/Lucene-Solr-trunk-Linux/solr/build/solr-solrj/test/J2/temp/solr.client.solrj.impl.CloudSolrClientTest_1A736900F2D6E6B7-001/shard-1-001
[junit4] 2> 4314 INFO (TEST-CloudSolrClientTest.test-seed#[1A736900F2D6E6B7]) [ ] o.e.j.s.Server jetty-9.2.13.v20150730
[junit4] 2> 4327 INFO (TEST-CloudSolrClientTest.test-seed#[1A736900F2D6E6B7]) [ ] o.e.j.s.h.ContextHandler Started o.e.j.s.ServletContextHandler@1f7d243d{/_f/ab,null,AVAILABLE}
[junit4] 2> 4332 INFO (TEST-CloudSolrClientTest.test-seed#[1A736900F2D6E6B7]) [ ] o.e.j.s.ServerConnector Started ServerConnector@154e0e3f{HTTP/1.1}{127.0.0.1:39113}
[junit4] 2> 4333 INFO (TEST-CloudSolrClientTest.test-seed#[1A736900F2D6E6B7]) [ ] o.e.j.s.Server Started @6183ms
[junit4] 2> 4333 INFO (TEST-CloudSolrClientTest.test-seed#[1A736900F2D6E6B7]) [ ] o.a.s.c.s.e.JettySolrRunner Jetty properties: {solr.data.dir=/home/jenkins/workspace/Lucene-Solr-trunk-Linux/solr/build/solr-solrj/test/J2/temp/solr.client.solrj.impl.CloudSolrClientTest_1A736900F2D6E6B7-001/tempDir-001/jetty1, solrconfig=solrconfig.xml, hostContext=/_f/ab, hostPort=39113, coreRootDirectory=/home/jenkins/workspace/Lucene-Solr-trunk-Linux/solr/build/solr-solrj/test/J2/temp/solr.client.solrj.impl.CloudSolrClientTest_1A736900F2D6E6B7-001/shard-1-001/cores}
[junit4] 2> 4334 INFO (TEST-CloudSolrClientTest.test-seed#[1A736900F2D6E6B7]) [ ] o.a.s.s.SolrDispatchFilter SolrDispatchFilter.init(): sun.misc.Launcher$AppClassLoader@593634ad
[junit4] 2> 4335 INFO (TEST-CloudSolrClientTest.test-seed#[1A736900F2D6E6B7]) [ ] o.a.s.c.SolrResourceLoader new SolrResourceLoader for directory: '/home/jenkins/workspace/Lucene-Solr-trunk-Linux/solr/build/solr-solrj/test/J2/temp/solr.client.solrj.impl.CloudSolrClientTest_1A736900F2D6E6B7-001/shard-1-001/'
[junit4] 2> 4354 INFO (TEST-CloudSolrClientTest.test-seed#[1A736900F2D6E6B7]) [ ] o.a.s.c.c.SolrZkClient Using default ZkCredentialsProvider
[junit4] 2> 4359 INFO (TEST-CloudSolrClientTest.test-seed#[1A736900F2D6E6B7]) [ ] o.a.s.c.c.ConnectionManager Waiting for client to connect to ZooKeeper
[junit4] 2> 4363 INFO (zkCallback-10-thread-1) [ ] o.a.s.c.c.ConnectionManager Watcher org.apache.solr.common.cloud.ConnectionManager@308022e0 name:ZooKeeperConnection Watcher:127.0.0.1:60210/solr got event WatchedEvent state:SyncConnected type:None path:null path:null type:None
[junit4] 2> 4363 INFO (TEST-CloudSolrClientTest.test-seed#[1A736900F2D6E6B7]) [ ] o.a.s.c.c.ConnectionManager Client is connected to ZooKeeper
[junit4] 2> 4364 INFO (TEST-CloudSolrClientTest.test-seed#[1A736900F2D6E6B7]) [ ] o.a.s.c.c.SolrZkClient Using default ZkACLProvider
[junit4] 2> 4367 INFO (TEST-CloudSolrClientTest.test-seed#[1A736900F2D6E6B7]) [ ] o.a.s.s.SolrDispatchFilter Loading solr.xml from SolrHome (not found in ZooKeeper)
[junit4] 2> 4367 INFO (TEST-CloudSolrClientTest.test-seed#[1A736900F2D6E6B7]) [ ] o.a.s.c.SolrXmlConfig Loading container configuration from /home/jenkins/workspace/Lucene-Solr-trunk-Linux/solr/build/solr-solrj/test/J2/temp/solr.client.solrj.impl.CloudSolrClientTest_1A736900F2D6E6B7-001/shard-1-001/solr.xml
[junit4] 2> 4381 INFO (TEST-CloudSolrClientTest.test-seed#[1A736900F2D6E6B7]) [ ] o.a.s.c.CoresLocator Config-defined core root directory: /home/jenkins/workspace/Lucene-Solr-trunk-Linux/solr/build/solr-solrj/test/J2/temp/solr.client.solrj.impl.CloudSolrClientTest_1A736900F2D6E6B7-001/shard-1-001/cores
[junit4] 2> 4381 INFO (TEST-CloudSolrClientTest.test-seed#[1A736900F2D6E6B7]) [ ] o.a.s.c.CoreContainer New CoreContainer 341529835
[junit4] 2> 4381 INFO (TEST-CloudSolrClientTest.test-seed#[1A736900F2D6E6B7]) [ ] o.a.s.c.CoreContainer Loading cores into CoreContainer [instanceDir=/home/jenkins/workspace/Lucene-Solr-trunk-Linux/solr/build/solr-solrj/test/J2/temp/solr.client.solrj.impl.CloudSolrClientTest_1A736900F2D6E6B7-001/shard-1-001/]
[junit4] 2> 4381 INFO (TEST-CloudSolrClientTest.test-seed#[1A736900F2D6E6B7]) [ ] o.a.s.c.CoreContainer loading shared library: /home/jenkins/workspace/Lucene-Solr-trunk-Linux/solr/build/solr-solrj/test/J2/temp/solr.client.solrj.impl.CloudSolrClientTest_1A736900F2D6E6B7-001/shard-1-001/lib
[junit4] 2> 4381 WARN (TEST-CloudSolrClientTest.test-seed#[1A736900F2D6E6B7]) [ ] o.a.s.c.SolrResourceLoader Can't find (or read) directory to add to classloader: lib (resolved as: /home/jenkins/workspace/Lucene-Solr-trunk-Linux/solr/build/solr-solrj/test/J2/temp/solr.client.solrj.impl.CloudSolrClientTest_1A736900F2D6E6B7-001/shard-1-001/lib).
[junit4] 2> 4390 INFO (TEST-CloudSolrClientTest.test-seed#[1A736900F2D6E6B7]) [ ] o.a.s.h.c.HttpShardHandlerFactory created with socketTimeout : 90000,urlScheme : ,connTimeout : 15000,maxConnectionsPerHost : 20,maxConnections : 10000,corePoolSize : 0,maximumPoolSize : 2147483647,maxThreadIdleTime : 5,sizeOfQueue : -1,fairnessPolicy : false,useRetries : false,
[junit4] 2> 4392 INFO (TEST-CloudSolrClientTest.test-seed#[1A736900F2D6E6B7]) [ ] o.a.s.u.UpdateShardHandler Creating UpdateShardHandler HTTP client with params: socketTimeout=340000&connTimeout=45000&retry=true
[junit4] 2> 4392 INFO (TEST-CloudSolrClientTest.test-seed#[1A736900F2D6E6B7]) [ ] o.a.s.l.LogWatcher SLF4J impl is org.slf4j.impl.Log4jLoggerFactory
[junit4] 2> 4392 INFO (TEST-CloudSolrClientTest.test-seed#[1A736900F2D6E6B7]) [ ] o.a.s.l.LogWatcher Registering Log Listener [Log4j (org.slf4j.impl.Log4jLoggerFactory)]
[junit4] 2> 4393 INFO (TEST-CloudSolrClientTest.test-seed#[1A736900F2D6E6B7]) [ ] o.a.s.c.ZkContainer Zookeeper client=127.0.0.1:60210/solr
[junit4] 2> 4393 INFO (TEST-CloudSolrClientTest.test-seed#[1A736900F2D6E6B7]) [ ] o.a.s.c.ZkController zkHost includes chroot
[junit4] 2> 4393 INFO (TEST-CloudSolrClientTest.test-seed#[1A736900F2D6E6B7]) [ ] o.a.s.c.c.SolrZkClient Using default ZkCredentialsProvider
[junit4] 2> 4393 INFO (TEST-CloudSolrClientTest.test-seed#[1A736900F2D6E6B7]) [ ] o.a.s.c.c.ConnectionManager Waiting for client to connect to ZooKeeper
[junit4] 2> 4398 INFO (zkCallback-12-thread-1) [ ] o.a.s.c.c.ConnectionManager Watcher org.apache.solr.common.cloud.ConnectionManager@fa9d56b name:ZooKeeperConnection Watcher:127.0.0.1:60210 got event WatchedEvent state:SyncConnected type:None path:null path:null type:None
[junit4] 2> 4399 INFO (TEST-CloudSolrClientTest.test-seed#[1A736900F2D6E6B7]) [ ] o.a.s.c.c.ConnectionManager Client is connected to ZooKeeper
[junit4] 2> 4399 INFO (TEST-CloudSolrClientTest.test-seed#[1A736900F2D6E6B7]) [ ] o.a.s.c.c.SolrZkClient Using default ZkACLProvider
[junit4] 2> 4406 INFO (OverseerStateUpdate-94600885037039620-127.0.0.1:57855__f%2Fab-n_0000000000) [n:127.0.0.1:57855__f%2Fab ] o.a.s.c.o.ZkStateWriter going to create_collection /collections/collection1/state.json
[junit4] 2> 4406 INFO (TEST-CloudSolrClientTest.test-seed#[1A736900F2D6E6B7]) [n:127.0.0.1:39113__f%2Fab ] o.a.s.c.c.ConnectionManager Waiting for client to connect to ZooKeeper
[junit4] 2> 4408 INFO (zkCallback-13-thread-1-processing-n:127.0.0.1:39113__f%2Fab) [n:127.0.0.1:39113__f%2Fab ] o.a.s.c.c.ConnectionManager Watcher org.apache.solr.common.cloud.ConnectionManager@42e1c381 name:ZooKeeperConnection Watcher:127.0.0.1:60210/solr got event WatchedEvent state:SyncConnected type:None path:null path:null type:None
[junit4] 2> 4409 INFO (TEST-CloudSolrClientTest.test-seed#[1A736900F2D6E6B7]) [n:127.0.0.1:39113__f%2Fab ] o.a.s.c.c.ConnectionManager Client is connected to ZooKeeper
[junit4] 2> 4420 INFO (TEST-CloudSolrClientTest.test-seed#[1A736900F2D6E6B7]) [n:127.0.0.1:39113__f%2Fab ] o.a.s.c.c.ZkStateReader Updating cluster state from ZooKeeper...
[junit4] 2> 5437 INFO (TEST-CloudSolrClientTest.test-seed#[1A736900F2D6E6B7]) [n:127.0.0.1:39113__f%2Fab ] o.a.s.c.ZkController Register node as live in ZooKeeper:/live_nodes/127.0.0.1:39113__f%2Fab
[junit4] 2> 5438 INFO (TEST-CloudSolrClientTest.test-seed#[1A736900F2D6E6B7]) [n:127.0.0.1:39113__f%2Fab ] o.a.s.c.c.SolrZkClient makePath: /live_nodes/127.0.0.1:39113__f%2Fab
[junit4] 2> 5439 INFO (zkCallback-8-thread-1) [ ] o.a.s.c.c.ZkStateReader A live node change: WatchedEvent state:SyncConnected type:NodeChildrenChanged path:/live_nodes, has occurred - updating... (live nodes size: 1)
[junit4] 2> 5439 INFO (zkCallback-6-thread-1-processing-n:127.0.0.1:57855__f%2Fab) [n:127.0.0.1:57855__f%2Fab ] o.a.s.c.c.ZkStateReader A live node change: WatchedEvent state:SyncConnected type:NodeChildrenChanged path:/live_nodes, has occurred - updating... (live nodes size: 1)
[junit4] 2> 5439 INFO (zkCallback-13-thread-1-processing-n:127.0.0.1:39113__f%2Fab) [n:127.0.0.1:39113__f%2Fab ] o.a.s.c.c.ZkStateReader A live node change: WatchedEvent state:SyncConnected type:NodeChildrenChanged path:/live_nodes, has occurred - updating... (live nodes size: 1)
[junit4] 2> 5441 INFO (TEST-CloudSolrClientTest.test-seed#[1A736900F2D6E6B7]) [n:127.0.0.1:39113__f%2Fab ] o.a.s.c.Overseer Overseer (id=null) closing
[junit4] 2> 5442 INFO (TEST-CloudSolrClientTest.test-seed#[1A736900F2D6E6B7]) [n:127.0.0.1:39113__f%2Fab ] o.a.s.c.LeaderElector Joined leadership election with path: /overseer_elect/election/94600885037039625-127.0.0.1:39113__f%2Fab-n_0000000001
[junit4] 2> 5445 INFO (TEST-CloudSolrClientTest.test-seed#[1A736900F2D6E6B7]) [n:127.0.0.1:39113__f%2Fab ] o.a.s.c.LeaderElector Watching path /overseer_elect/election/94600885037039620-127.0.0.1:57855__f%2Fab-n_0000000000 to know if I could be the leader
[junit4] 2> 5468 INFO (TEST-CloudSolrClientTest.test-seed#[1A736900F2D6E6B7]) [n:127.0.0.1:39113__f%2Fab ] o.a.s.c.CoreContainer Security conf doesn't exist. Skipping setup for authorization module.
[junit4] 2> 5468 INFO (TEST-CloudSolrClientTest.test-seed#[1A736900F2D6E6B7]) [n:127.0.0.1:39113__f%2Fab ] o.a.s.c.CoreContainer No authentication plugin used.
[junit4] 2> 5469 INFO (TEST-CloudSolrClientTest.test-seed#[1A736900F2D6E6B7]) [n:127.0.0.1:39113__f%2Fab ] o.a.s.c.CoresLocator Looking for core definitions underneath /home/jenkins/workspace/Lucene-Solr-trunk-Linux/solr/build/solr-solrj/test/J2/temp/solr.client.solrj.impl.CloudSolrClientTest_1A736900F2D6E6B7-001/shard-1-001/cores
[junit4] 2> 5470 INFO (TEST-CloudSolrClientTest.test-seed#[1A736900F2D6E6B7]) [n:127.0.0.1:39113__f%2Fab ] o.a.s.c.SolrCore Created CoreDescriptor: {name=collection1, config=solrconfig.xml, transient=false, schema=schema.xml, loadOnStartup=true, configSetProperties=configsetprops.json, instanceDir=/home/jenkins/workspace/Lucene-Solr-trunk-Linux/solr/build/solr-solrj/test/J2/temp/solr.client.solrj.impl.CloudSolrClientTest_1A736900F2D6E6B7-001/shard-1-001/cores/collection1, collection=collection1, absoluteInstDir=/home/jenkins/workspace/Lucene-Solr-trunk-Linux/solr/build/solr-solrj/test/J2/temp/solr.client.solrj.impl.CloudSolrClientTest_1A736900F2D6E6B7-001/shard-1-001/cores/collection1/, coreNodeName=, dataDir=data/, shard=}
[junit4] 2> 5470 INFO (TEST-CloudSolrClientTest.test-seed#[1A736900F2D6E6B7]) [n:127.0.0.1:39113__f%2Fab ] o.a.s.c.CoresLocator Found core collection1 in /home/jenkins/workspace/Lucene-Solr-trunk-Linux/solr/build/solr-solrj/test/J2/temp/solr.client.solrj.impl.CloudSolrClientTest_1A736900F2D6E6B7-001/shard-1-001/cores/collection1/
[junit4] 2> 5470 INFO (TEST-CloudSolrClientTest.test-seed#[1A736900F2D6E6B7]) [n:127.0.0.1:39113__f%2Fab ] o.a.s.c.CoresLocator Found 1 core definitions
[junit4] 2> 5472 INFO (TEST-CloudSolrClientTest.test-seed#[1A736900F2D6E6B7]) [n:127.0.0.1:39113__f%2Fab ] o.a.s.s.SolrDispatchFilter user.dir=/home/jenkins/workspace/Lucene-Solr-trunk-Linux/solr/build/solr-solrj/test/J2
[junit4] 2> 5472 INFO (TEST-CloudSolrClientTest.test-seed#[1A736900F2D6E6B7]) [n:127.0.0.1:39113__f%2Fab ] o.a.s.s.SolrDispatchFilter SolrDispatchFilter.init() done
[junit4] 2> 5473 INFO (coreLoadExecutor-18-thread-1-processing-n:127.0.0.1:39113__f%2Fab) [n:127.0.0.1:39113__f%2Fab c:collection1 x:collection1] o.a.s.c.ZkController publishing state=down
[junit4] 2> 5473 INFO (coreLoadExecutor-18-thread-1-processing-n:127.0.0.1:39113__f%2Fab) [n:127.0.0.1:39113__f%2Fab c:collection1 x:collection1] o.a.s.c.ZkController numShards not found on descriptor - reading it from system property
[junit4] 2> 5475 INFO (coreLoadExecutor-18-thread-1-processing-n:127.0.0.1:39113__f%2Fab) [n:127.0.0.1:39113__f%2Fab c:collection1 x:collection1] o.a.s.c.ZkController Registering watch for collection collection1
[junit4] 2> 5475 INFO (coreLoadExecutor-18-thread-1-processing-n:127.0.0.1:39113__f%2Fab) [n:127.0.0.1:39113__f%2Fab c:collection1 x:collection1] o.a.s.c.c.ZkStateReader addZkWatch collection1
[junit4] 2> 5475 INFO (OverseerStateUpdate-94600885037039620-127.0.0.1:57855__f%2Fab-n_0000000000) [n:127.0.0.1:57855__f%2Fab ] o.a.s.c.Overseer processMessage: queueSize: 1, message = {
[junit4] 2> "core":"collection1",
[junit4] 2> "roles":null,
[junit4] 2> "base_url":"http://127.0.0.1:39113/_f/ab",
[junit4] 2> "node_name":"127.0.0.1:39113__f%2Fab",
[junit4] 2> "numShards":"2",
[junit4] 2> "state":"down",
[junit4] 2> "shard":null,
[junit4] 2> "collection":"collection1",
[junit4] 2> "operation":"state"} current state version: 4
[junit4] 2> 5476 INFO (OverseerStateUpdate-94600885037039620-127.0.0.1:57855__f%2Fab-n_0000000000) [n:127.0.0.1:57855__f%2Fab ] o.a.s.c.o.ReplicaMutator Update state numShards=2 message={
[junit4] 2> "core":"collection1",
[junit4] 2> "roles":null,
[junit4] 2> "base_url":"http://127.0.0.1:39113/_f/ab",
[junit4] 2> "node_name":"127.0.0.1:39113__f%2Fab",
[junit4] 2> "numShards":"2",
[junit4] 2> "state":"down",
[junit4] 2> "shard":null,
[junit4] 2> "collection":"collection1",
[junit4] 2> "operation":"state"}
[junit4] 2> 5476 INFO (OverseerStateUpdate-94600885037039620-127.0.0.1:57855__f%2Fab-n_0000000000) [n:127.0.0.1:57855__f%2Fab ] o.a.s.c.o.ReplicaMutator Collection already exists with numShards=2
[junit4] 2> 5477 INFO (OverseerStateUpdate-94600885037039620-127.0.0.1:57855__f%2Fab-n_0000000000) [n:127.0.0.1:57855__f%2Fab ] o.a.s.c.o.ReplicaMutator Assigning new node to shard shard=shard2
[junit4] 2> 5478 INFO (coreLoadExecutor-18-thread-1-processing-n:127.0.0.1:39113__f%2Fab) [n:127.0.0.1:39113__f%2Fab c:collection1 x:collection1] o.a.s.c.c.ZkStateReader Add data for collection1 ver 0
[junit4] 2> 5478 INFO (coreLoadExecutor-18-thread-1-processing-n:127.0.0.1:39113__f%2Fab) [n:127.0.0.1:39113__f%2Fab c:collection1 x:collection1] o.a.s.c.ZkController look for our core node name
[junit4] 2> 5580 INFO (OverseerStateUpdate-94600885037039620-127.0.0.1:57855__f%2Fab-n_0000000000) [n:127.0.0.1:57855__f%2Fab ] o.a.s.c.o.ZkStateWriter going to update_collection /collections/collection1/state.json version: 0
[junit4] 2> 5582 INFO (zkCallback-13-thread-1-processing-n:127.0.0.1:39113__f%2Fab) [n:127.0.0.1:39113__f%2Fab ] o.a.s.c.c.ZkStateReader A cluster state change: WatchedEvent state:SyncConnected type:NodeDataChanged path:/collections/collection1/state.json for collection collection1 has occurred - updating... (live nodes size: 2)
[junit4] 2> 5582 INFO (zkCallback-13-thread-1-processing-n:127.0.0.1:39113__f%2Fab) [n:127.0.0.1:39113__f%2Fab ] o.a.s.c.c.ZkStateReader Updating data for collection1 from 0 to 1
[junit4] 2> 6478 INFO (coreLoadExecutor-18-thread-1-processing-n:127.0.0.1:39113__f%2Fab) [n:127.0.0.1:39113__f%2Fab c:collection1 x:collection1] o.a.s.c.ZkController waiting to find shard id in clusterstate for collection1
[junit4] 2> 6479 INFO (coreLoadExecutor-18-thread-1-processing-n:127.0.0.1:39113__f%2Fab) [n:127.0.0.1:39113__f%2Fab c:collection1 x:collection1] o.a.s.c.ZkController Check for collection zkNode:collection1
[junit4] 2> 6479 INFO (coreLoadExecutor-18-thread-1-processing-n:127.0.0.1:39113__f%2Fab) [n:127.0.0.1:39113__f%2Fab c:collection1 x:collection1] o.a.s.c.ZkController Collection zkNode exists
[junit4] 2> 6479 INFO (coreLoadExecutor-18-thread-1-processing-n:127.0.0.1:39113__f%2Fab) [n:127.0.0.1:39113__f%2Fab c:collection1 x:collection1] o.a.s.c.c.ZkStateReader Load collection config from:/collections/collection1
[junit4] 2> 6480 INFO (coreLoadExecutor-18-thread-1-processing-n:127.0.0.1:39113__f%2Fab) [n:127.0.0.1:39113__f%2Fab c:collection1 x:collection1] o.a.s.c.c.ZkStateReader path=/collections/collection1 configName=conf1 specified config exists in ZooKeeper
[junit4] 2> 6480 INFO (coreLoadExecutor-18-thread-1-processing-n:127.0.0.1:39113__f%2Fab) [n:127.0.0.1:39113__f%2Fab c:collection1 x:collection1] o.a.s.c.SolrResourceLoader new SolrResourceLoader for directory: '/home/jenkins/workspace/Lucene-Solr-trunk-Linux/solr/build/solr-solrj/test/J2/temp/solr.client.solrj.impl.CloudSolrClientTest_1A736900F2D6E6B7-001/shard-1-001/cores/collection1/'
[junit4] 2> 6493 INFO (coreLoadExecutor-18-thread-1-processing-n:127.0.0.1:39113__f%2Fab) [n:127.0.0.1:39113__f%2Fab c:collection1 x:collection1] o.a.s.c.Config loaded config solrconfig.xml with version 0
[junit4] 2> 6500 INFO (coreLoadExecutor-18-thread-1-processing-n:127.0.0.1:39113__f%2Fab) [n:127.0.0.1:39113__f%2Fab c:collection1 x:collection1] o.a.s.c.SolrConfig current version of requestparams : -1
[junit4] 2> 6505 INFO (coreLoadExecutor-18-thread-1-processing-n:127.0.0.1:39113__f%2Fab) [n:127.0.0.1:39113__f%2Fab c:collection1 x:collection1] o.a.s.c.SolrConfig Using Lucene MatchVersion: 6.0.0
[junit4] 2> 6517 INFO (coreLoadExecutor-18-thread-1-processing-n:127.0.0.1:39113__f%2Fab) [n:127.0.0.1:39113__f%2Fab c:collection1 x:collection1] o.a.s.c.Config Loaded SolrConfig: solrconfig.xml
[junit4] 2> 6518 INFO (coreLoadExecutor-18-thread-1-processing-n:127.0.0.1:39113__f%2Fab) [n:127.0.0.1:39113__f%2Fab c:collection1 x:collection1] o.a.s.s.IndexSchema Reading Solr Schema from /configs/conf1/schema.xml
[junit4] 2> 6552 INFO (coreLoadExecutor-18-thread-1-processing-n:127.0.0.1:39113__f%2Fab) [n:127.0.0.1:39113__f%2Fab c:collection1 x:collection1] o.a.s.s.IndexSchema [collection1] Schema name=test
[junit4] 2> 6665 INFO (coreLoadExecutor-18-thread-1-processing-n:127.0.0.1:39113__f%2Fab) [n:127.0.0.1:39113__f%2Fab c:collection1 x:collection1] o.a.s.s.IndexSchema default search field in schema is text
[junit4] 2> 6667 INFO (coreLoadExecutor-18-thread-1-processing-n:127.0.0.1:39113__f%2Fab) [n:127.0.0.1:39113__f%2Fab c:collection1 x:collection1] o.a.s.s.IndexSchema unique key field: id
[junit4] 2> 6668 WARN (coreLoadExecutor-18-thread-1-processing-n:127.0.0.1:39113__f%2Fab) [n:127.0.0.1:39113__f%2Fab c:collection1 x:collection1] o.a.s.s.IndexSchema Field lowerfilt1and2 is not multivalued and destination for multiple copyFields (2)
[junit4] 2> 6668 WARN (coreLoadExecutor-18-thread-1-processing-n:127.0.0.1:39113__f%2Fab) [n:127.0.0.1:39113__f%2Fab c:collection1 x:collection1] o.a.s.s.IndexSchema Field text is not multivalued and destination for multiple copyFields (3)
[junit4] 2> 6671 INFO (coreLoadExecutor-18-thread-1-processing-n:127.0.0.1:39113__f%2Fab) [n:127.0.0.1:39113__f%2Fab c:collection1 x:collection1] o.a.s.c.ConfigSetProperties Did not find ConfigSet properties, assuming default properties: Can't find resource 'configsetprops.json' in classpath or '/configs/conf1', cwd=/home/jenkins/workspace/Lucene-Solr-trunk-Linux/solr/build/solr-solrj/test/J2
[junit4] 2> 6671 INFO (coreLoadExecutor-18-thread-1-processing-n:127.0.0.1:39113__f%2Fab) [n:127.0.0.1:39113__f%2Fab c:collection1 x:collection1] o.a.s.c.CoreContainer Creating SolrCore 'collection1' using configuration from collection collection1
[junit4] 2> 6671 INFO (coreLoadExecutor-18-thread-1-processing-n:127.0.0.1:39113__f%2Fab) [n:127.0.0.1:39113__f%2Fab c:collection1 s:shard2 r:core_node1 x:collection1] o.a.s.c.SolrCore org.apache.solr.core.MockDirectoryFactory
[junit4] 2> 6672 INFO (coreLoadExecutor-18-thread-1-processing-n:127.0.0.1:39113__f%2Fab) [n:127.0.0.1:39113__f%2Fab c:collection1 s:shard2 r:core_node1 x:collection1] o.a.s.c.SolrCore [[collection1] ] Opening new SolrCore at [/home/jenkins/workspace/Lucene-Solr-trunk-Linux/solr/build/solr-solrj/test/J2/temp/solr.client.solrj.impl.CloudSolrClientTest_1A736900F2D6E6B7-001/shard-1-001/cores/collection1/], dataDir=[null]
[junit4] 2> 6672 INFO (coreLoadExecutor-18-thread-1-processing-n:127.0.0.1:39113__f%2Fab) [n:127.0.0.1:39113__f%2Fab c:collection1 s:shard2 r:core_node1 x:collection1] o.a.s.c.SolrCore JMX monitoring not detected for core: collection1
[junit4] 2> 6673 INFO (coreLoadExecutor-18-thread-1-processing-n:127.0.0.1:39113__f%2Fab) [n:127.0.0.1:39113__f%2Fab c:collection1 s:shard2 r:core_node1 x:collection1] o.a.s.c.CachingDirectoryFactory return new directory for /home/jenkins/workspace/Lucene-Solr-trunk-Linux/solr/build/solr-solrj/test/J2/temp/solr.client.solrj.impl.CloudSolrClientTest_1A736900F2D6E6B7-001/shard-1-001/cores/collection1/data
[junit4] 2> 6673 INFO (coreLoadExecutor-18-thread-1-processing-n:127.0.0.1:39113__f%2Fab) [n:127.0.0.1:39113__f%2Fab c:collection1 s:shard2 r:core_node1 x:collection1] o.a.s.c.SolrCore New index directory detected: old=null new=/home/jenkins/workspace/Lucene-Solr-trunk-Linux/solr/build/solr-solrj/test/J2/temp/solr.client.solrj.impl.CloudSolrClientTest_1A736900F2D6E6B7-001/shard-1-001/cores/collection1/data/index/
[junit4] 2> 6673 WARN (coreLoadExecutor-18-thread-1-processing-n:127.0.0.1:39113__f%2Fab) [n:127.0.0.1:39113__f%2Fab c:collection1 s:shard2 r:core_node1 x:collection1] o.a.s.c.SolrCore [collection1] Solr index directory '/home/jenkins/workspace/Lucene-Solr-trunk-Linux/solr/build/solr-solrj/test/J2/temp/solr.client.solrj.impl.CloudSolrClientTest_1A736900F2D6E6B7-001/shard-1-001/cores/collection1/data/index' doesn't exist. Creating new index...
[junit4] 2> 6673 INFO (coreLoadExecutor-18-thread-1-processing-n:127.0.0.1:39113__f%2Fab) [n:127.0.0.1:39113__f%2Fab c:collection1 s:shard2 r:core_node1 x:collection1] o.a.s.c.CachingDirectoryFactory return new directory for /home/jenkins/workspace/Lucene-Solr-trunk-Linux/solr/build/solr-solrj/test/J2/temp/solr.client.solrj.impl.CloudSolrClientTest_1A736900F2D6E6B7-001/shard-1-001/cores/collection1/data/index
[junit4] 2> 6674 INFO (coreLoadExecutor-18-thread-1-processing-n:127.0.0.1:39113__f%2Fab) [n:127.0.0.1:39113__f%2Fab c:collection1 s:shard2 r:core_node1 x:collection1] o.a.s.c.SolrCore SolrDeletionPolicy.onCommit: commits: num=1
[junit4] 2> commit{dir=MockDirectoryWrapper(RAMDirectory@43000407 lockFactory=org.apache.lucene.store.SingleInstanceLockFactory@3664613e),segFN=segments_1,generation=1}
[junit4] 2> 6675 INFO (coreLoadExecutor-18-thread-1-processing-n:127.0.0.1:39113__f%2Fab) [n:127.0.0.1:39113__f%2Fab c:collection1 s:shard2 r:core_node1 x:collection1] o.a.s.c.SolrCore newest commit generation = 1
[junit4] 2> 6675 INFO (OldIndexDirectoryCleanupThreadForCore-collection1) [n:127.0.0.1:39113__f%2Fab c:collection1 s:shard2 r:core_node1 x:collection1] o.a.s.c.SolrCore Looking for old index directories to cleanup for core collection1 in /home/jenkins/workspace/Lucene-Solr-trunk-Linux/solr/build/solr-solrj/test/J2/temp/solr.client.solrj.impl.CloudSolrClientTest_1A736900F2D6E6B7-001/shard-1-001/cores/collection1/data/
[junit4] 2> 6675 WARN (OldIndexDirectoryCleanupThreadForCore-collection1) [n:127.0.0.1:39113__f%2Fab c:collection1 s:shard2 r:core_node1 x:collection1] o.a.s.c.DirectoryFactory /home/jenkins/workspace/Lucene-Solr-trunk-Linux/solr/build/solr-solrj/test/J2/temp/solr.client.solrj.impl.CloudSolrClientTest_1A736900F2D6E6B7-001/shard-1-001/cores/collection1/data/ does not point to a valid data directory; skipping clean-up of old index directories.
[junit4] 2> 6678 INFO (coreLoadExecutor-18-thread-1-processing-n:127.0.0.1:39113__f%2Fab) [n:127.0.0.1:39113__f%2Fab c:collection1 s:shard2 r:core_node1 x:collection1] o.a.s.c.SolrCore no updateRequestProcessorChain defined as default, creating implicit default
[junit4] 2> 6680 INFO (coreLoadExecutor-18-thread-1-processing-n:127.0.0.1:39113__f%2Fab) [n:127.0.0.1:39113__f%2Fab c:collection1 s:shard2 r:core_node1 x:collection1] o.a.s.h.l.XMLLoader xsltCacheLifetimeSeconds=60
[junit4] 2> 6682 INFO (coreLoadExecutor-18-thread-1-processing-n:127.0.0.1:39113__f%2Fab) [n:127.0.0.1:39113__f%2Fab c:collection1 s:shard2 r:core_node1 x:collection1] o.a.s.h.l.XMLLoader xsltCacheLifetimeSeconds=60
[junit4] 2> 6682 INFO (coreLoadExecutor-18-thread-1-processing-n:127.0.0.1:39113__f%2Fab) [n:127.0.0.1:39113__f%2Fab c:collection1 s:shard2 r:core_node1 x:collection1] o.a.s.h.l.XMLLoader xsltCacheLifetimeSeconds=60
[junit4] 2> 6683 INFO (coreLoadExecutor-18-thread-1-processing-n:127.0.0.1:39113__f%2Fab) [n:127.0.0.1:39113__f%2Fab c:collection1 s:shard2 r:core_node1 x:collection1] o.a.s.h.l.XMLLoader xsltCacheLifetimeSeconds=60
[junit4] 2> 6685 INFO (coreLoadExecutor-18-thread-1-processing-n:127.0.0.1:39113__f%2Fab) [n:127.0.0.1:39113__f%2Fab c:collection1 s:shard2 r:core_node1 x:collection1] o.a.s.c.RequestHandlers Registered paths: /admin/mbeans,standard,,/update/csv,/update/json/docs,/admin/luke,/admin/segments,/get,/admin/system,/replication,/admin/properties,/config,/schema,/admin/plugins,/admin/logging,/update/json,/admin/threads,/admin/ping,/update,/admin/file
[junit4] 2> 6686 INFO (coreLoadExecutor-18-thread-1-processing-n:127.0.0.1:39113__f%2Fab) [n:127.0.0.1:39113__f%2Fab c:collection1 s:shard2 r:core_node1 x:collection1] o.a.s.c.SolrCore Using default statsCache cache: org.apache.solr.search.stats.LocalStatsCache
[junit4] 2> 6693 INFO (coreLoadExecutor-18-thread-1-processing-n:127.0.0.1:39113__f%2Fab) [n:127.0.0.1:39113__f%2Fab c:collection1 s:shard2 r:core_node1 x:collection1] o.a.s.u.UpdateHandler Using UpdateLog implementation: org.apache.solr.update.UpdateLog
[junit4] 2> 6693 INFO (coreLoadExecutor-18-thread-1-processing-n:127.0.0.1:39113__f%2Fab) [n:127.0.0.1:39113__f%2Fab c:collection1 s:shard2 r:core_node1 x:collection1] o.a.s.u.UpdateLog Initializing UpdateLog: dataDir= defaultSyncLevel=FLUSH numRecordsToKeep=100 maxNumLogsToKeep=10 numVersionBuckets=65536
[junit4] 2> 6699 INFO (coreLoadExecutor-18-thread-1-processing-n:127.0.0.1:39113__f%2Fab) [n:127.0.0.1:39113__f%2Fab c:collection1 s:shard2 r:core_node1 x:collection1] o.a.s.c.SolrCore Hard AutoCommit: disabled
[junit4] 2> 6700 INFO (coreLoadExecutor-18-thread-1-processing-n:127.0.0.1:39113__f%2Fab) [n:127.0.0.1:39113__f%2Fab c:collection1 s:shard2 r:core_node1 x:collection1] o.a.s.c.SolrCore Soft AutoCommit: disabled
[junit4] 2> 6701 INFO (coreLoadExecutor-18-thread-1-processing-n:127.0.0.1:39113__f%2Fab) [n:127.0.0.1:39113__f%2Fab c:collection1 s:shard2 r:core_node1 x:collection1] o.a.s.c.SolrCore SolrDeletionPolicy.onInit: commits: num=1
[junit4] 2> commit{dir=MockDirectoryWrapper(RAMDirectory@43000407 lockFactory=org.apache.lucene.store.SingleInstanceLockFactory@3664613e),segFN=segments_1,generation=1}
[junit4] 2> 6701 INFO (coreLoadExecutor-18-thread-1-processing-n:127.0.0.1:39113__f%2Fab) [n:127.0.0.1:39113__f%2Fab c:collection1 s:shard2 r:core_node1 x:collection1] o.a.s.c.SolrCore newest commit generation = 1
[junit4] 2> 6701 INFO (coreLoadExecutor-18-thread-1-processing-n:127.0.0.1:39113__f%2Fab) [n:127.0.0.1:39113__f%2Fab c:collection1 s:shard2 r:core_node1 x:collection1] o.a.s.s.SolrIndexSearcher Op
[...truncated too long message...]
2> java.lang.InterruptedException
[junit4] 2> at java.util.concurrent.locks.AbstractQueuedSynchronizer$ConditionObject.reportInterruptAfterWait(AbstractQueuedSynchronizer.java:2014)
[junit4] 2> at java.util.concurrent.locks.AbstractQueuedSynchronizer$ConditionObject.await(AbstractQueuedSynchronizer.java:2048)
[junit4] 2> at java.util.concurrent.LinkedBlockingQueue.take(LinkedBlockingQueue.java:442)
[junit4] 2> at org.apache.zookeeper.ClientCnxn$EventThread.run(ClientCnxn.java:494)
[junit4] 2> 106812 WARN (TEST-CloudSolrClientTest.test-seed#[1A736900F2D6E6B7]-SendThread(127.0.0.1:60210)) [ ] o.a.z.ClientCnxn Unexpected exception
[junit4] 2> java.lang.InterruptedException: sleep interrupted
[junit4] 2> at java.lang.Thread.sleep(Native Method)
[junit4] 2> at org.apache.zookeeper.ClientCnxn$SendThread.run(ClientCnxn.java:994)
[junit4] 2> 107312 WARN (TEST-CloudSolrClientTest.test-seed#[1A736900F2D6E6B7]-SendThread(127.0.0.1:60210)) [ ] o.a.z.c.StaticHostProvider Unexpected exception
[junit4] 2> java.lang.InterruptedException: sleep interrupted
[junit4] 2> at java.lang.Thread.sleep(Native Method)
[junit4] 2> at org.apache.zookeeper.client.StaticHostProvider.next(StaticHostProvider.java:101)
[junit4] 2> at org.apache.zookeeper.ClientCnxn$SendThread.startConnect(ClientCnxn.java:940)
[junit4] 2> at org.apache.zookeeper.ClientCnxn$SendThread.run(ClientCnxn.java:1003)
[junit4] 2> 107313 WARN (TEST-CloudSolrClientTest.test-seed#[1A736900F2D6E6B7]-SendThread(127.0.0.1:60210)) [ ] o.a.z.ClientCnxn Session 0x1501700f4120012 for server null, unexpected error, closing socket connection and attempting reconnect
[junit4] 2> java.net.ConnectException: Connection refused
[junit4] 2> at sun.nio.ch.SocketChannelImpl.checkConnect(Native Method)
[junit4] 2> at sun.nio.ch.SocketChannelImpl.finishConnect(SocketChannelImpl.java:717)
[junit4] 2> at org.apache.zookeeper.ClientCnxnSocketNIO.doTransport(ClientCnxnSocketNIO.java:361)
[junit4] 2> at org.apache.zookeeper.ClientCnxn$SendThread.run(ClientCnxn.java:1081)
[junit4] 2> 107813 WARN (TEST-CloudSolrClientTest.test-seed#[1A736900F2D6E6B7]-SendThread(127.0.0.1:60210)) [ ] o.a.z.c.StaticHostProvider Unexpected exception
[junit4] 2> java.lang.InterruptedException: sleep interrupted
[junit4] 2> at java.lang.Thread.sleep(Native Method)
[junit4] 2> at org.apache.zookeeper.client.StaticHostProvider.next(StaticHostProvider.java:101)
[junit4] 2> at org.apache.zookeeper.ClientCnxn$SendThread.startConnect(ClientCnxn.java:940)
[junit4] 2> at org.apache.zookeeper.ClientCnxn$SendThread.run(ClientCnxn.java:1003)
[junit4] 2> 107813 WARN (TEST-CloudSolrClientTest.test-seed#[1A736900F2D6E6B7]-SendThread(127.0.0.1:60210)) [ ] o.a.z.ClientCnxn Session 0x1501700f4120012 for server null, unexpected error, closing socket connection and attempting reconnect
[junit4] 2> java.net.ConnectException: Connection refused
[junit4] 2> at sun.nio.ch.SocketChannelImpl.checkConnect(Native Method)
[junit4] 2> at sun.nio.ch.SocketChannelImpl.finishConnect(SocketChannelImpl.java:717)
[junit4] 2> at org.apache.zookeeper.ClientCnxnSocketNIO.doTransport(ClientCnxnSocketNIO.java:361)
[junit4] 2> at org.apache.zookeeper.ClientCnxn$SendThread.run(ClientCnxn.java:1081)
[junit4] 2> 108313 WARN (TEST-CloudSolrClientTest.test-seed#[1A736900F2D6E6B7]-SendThread(127.0.0.1:60210)) [ ] o.a.z.ClientCnxn Unexpected exception
[junit4] 2> java.lang.InterruptedException: sleep interrupted
[junit4] 2> at java.lang.Thread.sleep(Native Method)
[junit4] 2> at org.apache.zookeeper.ClientCnxn$SendThread.run(ClientCnxn.java:994)
[junit4] 2> 108813 WARN (TEST-CloudSolrClientTest.test-seed#[1A736900F2D6E6B7]-SendThread(127.0.0.1:60210)) [ ] o.a.z.c.StaticHostProvider Unexpected exception
[junit4] 2> java.lang.InterruptedException: sleep interrupted
[junit4] 2> at java.lang.Thread.sleep(Native Method)
[junit4] 2> at org.apache.zookeeper.client.StaticHostProvider.next(StaticHostProvider.java:101)
[junit4] 2> at org.apache.zookeeper.ClientCnxn$SendThread.startConnect(ClientCnxn.java:940)
[junit4] 2> at org.apache.zookeeper.ClientCnxn$SendThread.run(ClientCnxn.java:1003)
[junit4] 2> 108813 WARN (TEST-CloudSolrClientTest.test-seed#[1A736900F2D6E6B7]-SendThread(127.0.0.1:60210)) [ ] o.a.z.ClientCnxn Session 0x1501700f4120012 for server null, unexpected error, closing socket connection and attempting reconnect
[junit4] 2> java.net.ConnectException: Connection refused
[junit4] 2> at sun.nio.ch.SocketChannelImpl.checkConnect(Native Method)
[junit4] 2> at sun.nio.ch.SocketChannelImpl.finishConnect(SocketChannelImpl.java:717)
[junit4] 2> at org.apache.zookeeper.ClientCnxnSocketNIO.doTransport(ClientCnxnSocketNIO.java:361)
[junit4] 2> at org.apache.zookeeper.ClientCnxn$SendThread.run(ClientCnxn.java:1081)
[junit4] 2> Sep 29, 2015 2:50:59 AM com.carrotsearch.randomizedtesting.ThreadLeakControl tryToInterruptAll
[junit4] 2> SEVERE: There are still zombie threads that couldn't be terminated:
[junit4] 2> 1) Thread[id=242, name=TEST-CloudSolrClientTest.test-seed#[1A736900F2D6E6B7]-SendThread(127.0.0.1:60210), state=TIMED_WAITING, group=TGRP-CloudSolrClientTest]
[junit4] 2> at java.lang.Thread.sleep(Native Method)
[junit4] 2> at org.apache.zookeeper.ClientCnxn$SendThread.run(ClientCnxn.java:994)
[junit4] 2> NOTE: test params are: codec=Asserting(Lucene53): {_version_=FSTOrd50, multiDefault=PostingsFormat(name=LuceneFixedGap), a_t=PostingsFormat(name=LuceneFixedGap), intDefault=FSTOrd50, id=PostingsFormat(name=MockRandom), text=TestBloomFilteredLucenePostings(BloomFilteringPostingsFormat(Lucene50(blocksize=128))), range_facet_l=PostingsFormat(name=LuceneFixedGap), timestamp=PostingsFormat(name=LuceneFixedGap)}, docValues:{}, sim=RandomSimilarityProvider(queryNorm=true,coord=no): {}, locale=de_GR, timezone=America/Martinique
[junit4] 2> NOTE: Linux 3.19.0-28-generic amd64/Oracle Corporation 1.9.0-ea (64-bit)/cpus=12,threads=2,free=401386752,total=508887040
[junit4] 2> NOTE: All tests run in this JVM: [CloudSolrClientTest]
[junit4] 2> NOTE: reproduce with: ant test -Dtestcase=CloudSolrClientTest -Dtests.seed=1A736900F2D6E6B7 -Dtests.multiplier=3 -Dtests.slow=true -Dtests.locale=de_GR -Dtests.timezone=America/Martinique -Dtests.asserts=true -Dtests.file.encoding=US-ASCII
[junit4] ERROR 0.00s J2 | CloudSolrClientTest (suite) <<<
[junit4] > Throwable #1: com.carrotsearch.randomizedtesting.ThreadLeakError: 2 threads leaked from SUITE scope at org.apache.solr.client.solrj.impl.CloudSolrClientTest:
[junit4] > 1) Thread[id=243, name=TEST-CloudSolrClientTest.test-seed#[1A736900F2D6E6B7]-EventThread, state=WAITING, group=TGRP-CloudSolrClientTest]
[junit4] > at sun.misc.Unsafe.park(Native Method)
[junit4] > at java.util.concurrent.locks.LockSupport.park(LockSupport.java:175)
[junit4] > at java.util.concurrent.locks.AbstractQueuedSynchronizer$ConditionObject.await(AbstractQueuedSynchronizer.java:2039)
[junit4] > at java.util.concurrent.LinkedBlockingQueue.take(LinkedBlockingQueue.java:442)
[junit4] > at org.apache.zookeeper.ClientCnxn$EventThread.run(ClientCnxn.java:494)
[junit4] > 2) Thread[id=242, name=TEST-CloudSolrClientTest.test-seed#[1A736900F2D6E6B7]-SendThread(127.0.0.1:60210), state=RUNNABLE, group=TGRP-CloudSolrClientTest]
[junit4] > at java.lang.Thread.sleep(Native Method)
[junit4] > at org.apache.zookeeper.client.StaticHostProvider.next(StaticHostProvider.java:101)
[junit4] > at org.apache.zookeeper.ClientCnxn$SendThread.startConnect(ClientCnxn.java:940)
[junit4] > at org.apache.zookeeper.ClientCnxn$SendThread.run(ClientCnxn.java:1003)
[junit4] > at __randomizedtesting.SeedInfo.seed([1A736900F2D6E6B7]:0)Throwable #2: com.carrotsearch.randomizedtesting.ThreadLeakError: There are still zombie threads that couldn't be terminated:
[junit4] > 1) Thread[id=242, name=TEST-CloudSolrClientTest.test-seed#[1A736900F2D6E6B7]-SendThread(127.0.0.1:60210), state=TIMED_WAITING, group=TGRP-CloudSolrClientTest]
[junit4] > at java.lang.Thread.sleep(Native Method)
[junit4] > at org.apache.zookeeper.ClientCnxn$SendThread.run(ClientCnxn.java:994)
[junit4] > at __randomizedtesting.SeedInfo.seed([1A736900F2D6E6B7]:0)
[junit4] Completed [56/68] on J2 in 110.19s, 3 tests, 1 failure, 2 errors <<< FAILURES!
[...truncated 48 lines...]
BUILD FAILED
/home/jenkins/workspace/Lucene-Solr-trunk-Linux/build.xml:775: The following error occurred while executing this line:
/home/jenkins/workspace/Lucene-Solr-trunk-Linux/build.xml:719: The following error occurred while executing this line:
/home/jenkins/workspace/Lucene-Solr-trunk-Linux/build.xml:59: The following error occurred while executing this line:
/home/jenkins/workspace/Lucene-Solr-trunk-Linux/solr/build.xml:246: The following error occurred while executing this line:
/home/jenkins/workspace/Lucene-Solr-trunk-Linux/solr/common-build.xml:514: The following error occurred while executing this line:
/home/jenkins/workspace/Lucene-Solr-trunk-Linux/lucene/common-build.xml:1432: The following error occurred while executing this line:
/home/jenkins/workspace/Lucene-Solr-trunk-Linux/lucene/common-build.xml:987: There were test failures: 68 suites, 468 tests, 2 suite-level errors, 1 failure, 93 ignored [seed: 1A736900F2D6E6B7]
Total time: 50 minutes 1 second
Build step 'Invoke Ant' marked build as failure
Archiving artifacts
[WARNINGS] Skipping publisher since build result is FAILURE
Recording test results
Email was triggered for: Failure - Any
Sending email for trigger: Failure - Any